Console Output

Started by upstream project "gpkit_ResearchModel_gassolar_PR" build number 45
originally caused by:
 GitHub pull request #30 of commit 39fd5790e7ba6b52334ec08ed9e285ce4166476d, no merge conflicts.
Building remotely on reynolds in workspace /jenkins/workspace/gpkit_ResearchModel_gassolar_PR/buildnode/reynolds/optimizer/mosek
Wiping out workspace first.
Cloning the remote Git repository
Cloning repository https://github.com/convexengineering/gassolar
 > git init /jenkins/workspace/gpkit_ResearchModel_gassolar_PR/buildnode/reynolds/optimizer/mosek # timeout=10
Fetching upstream changes from https://github.com/convexengineering/gassolar
 > git --version # timeout=10
 > git fetch --tags --progress https://github.com/convexengineering/gassolar +refs/heads/*:refs/remotes/origin/*
 > git config remote.origin.url https://github.com/convexengineering/gassolar # timeout=10
 > git config --add remote.origin.fetch +refs/heads/*:refs/remotes/origin/* # timeout=10
 > git config remote.origin.url https://github.com/convexengineering/gassolar # timeout=10
Fetching upstream changes from https://github.com/convexengineering/gassolar
 > git fetch --tags --progress https://github.com/convexengineering/gassolar +refs/pull/*:refs/remotes/origin/pr/* +refs/heads/master:refs/remotes/origin/master
Merging Revision e978a09c8c198558745ab8d0e54daffc9e78774f (refs/remotes/origin/pr/30/merge) to origin/master, UserMergeOptions{mergeRemote='origin', mergeTarget='master', mergeStrategy='default', fastForwardMode='--ff'}
 > git rev-parse origin/master^{commit} # timeout=10
 > git config core.sparsecheckout # timeout=10
 > git checkout -f origin/master # timeout=3
 > git merge --ff e978a09c8c198558745ab8d0e54daffc9e78774f # timeout=10
 > git rev-parse HEAD^{commit} # timeout=10
Seen branch in repository origin/fitchange
Seen branch in repository origin/forwoody
Seen branch in repository origin/master
Seen branch in repository origin/pr/1/head
Seen branch in repository origin/pr/10/head
Seen branch in repository origin/pr/11/head
Seen branch in repository origin/pr/13/head
Seen branch in repository origin/pr/14/head
Seen branch in repository origin/pr/15/head
Seen branch in repository origin/pr/2/head
Seen branch in repository origin/pr/20/head
Seen branch in repository origin/pr/21/head
Seen branch in repository origin/pr/22/head
Seen branch in repository origin/pr/23/head
Seen branch in repository origin/pr/24/head
Seen branch in repository origin/pr/25/head
Seen branch in repository origin/pr/26/head
Seen branch in repository origin/pr/28/head
Seen branch in repository origin/pr/29/head
Seen branch in repository origin/pr/3/head
Seen branch in repository origin/pr/30/head
Seen branch in repository origin/pr/30/merge
Seen branch in repository origin/pr/4/head
Seen branch in repository origin/pr/6/head
Seen branch in repository origin/pr/7/head
Seen branch in repository origin/pr/8/head
Seen branch in repository origin/pr/9/head
Seen branch in repository origin/tflexmod
Seen 28 remote branches
 > git show-ref --tags -d # timeout=10
Checking out Revision e978a09c8c198558745ab8d0e54daffc9e78774f (origin/pr/30/merge, origin/master)
 > git config core.sparsecheckout # timeout=10
 > git checkout -f e978a09c8c198558745ab8d0e54daffc9e78774f # timeout=3
Commit message: "Merge 39fd5790e7ba6b52334ec08ed9e285ce4166476d into 558756ceb92e152b21d39de7e6eb61ccf76f0660"
Using 'Changelog to branch' strategy.
Run condition [Execution node ] enabling prebuild for step [Execute shell]
Run condition [Execution node ] enabling prebuild for step [Execute Windows batch command]
[Execution node] check if [reynolds] is in [[macys, macys_Sierra, reynolds, reynolds-ubuntu16]]
Run condition [Execution node ] enabling perform for step [Execute shell]
[mosek] $ /bin/bash -xe /tmp/jenkins8079761153864835013.sh
+ [[ reynolds == *macys* ]]
+ ls /jenkins/workspace/gpkit_ResearchModel_gassolar_PR/buildnode/reynolds/optimizer/mosek
docs
gassolar
__init__.py
README.md
runtests.sh
setup.py
TESTCONFIG
testing2.sh
testing.sh
TESTS
+ virtualenv --system-site-packages /jenkins/workspace/gpkit_ResearchModel_gassolar_PR/buildnode/reynolds/optimizer/mosek/venv2_gpkit
New python executable in /jenkins/workspace/gpkit_ResearchModel_gassolar_PR/buildnode/reynolds/optimizer/mosek/venv2_gpkit/bin/python2
Also creating executable in /jenkins/workspace/gpkit_ResearchModel_gassolar_PR/buildnode/reynolds/optimizer/mosek/venv2_gpkit/bin/python
Installing setuptools, pkg_resources, pip, wheel...done.
Running virtualenv with interpreter /usr/bin/python2
+ . /jenkins/workspace/gpkit_ResearchModel_gassolar_PR/buildnode/reynolds/optimizer/mosek/venv2_gpkit/bin/activate
++ deactivate nondestructive
++ unset -f pydoc
++ '[' -z '' ']'
++ '[' -z '' ']'
++ '[' -n /bin/bash ']'
++ hash -r
++ '[' -z '' ']'
++ unset VIRTUAL_ENV
++ '[' '!' nondestructive = nondestructive ']'
++ VIRTUAL_ENV=/jenkins/workspace/gpkit_ResearchModel_gassolar_PR/buildnode/reynolds/optimizer/mosek/venv2_gpkit
++ export VIRTUAL_ENV
++ _OLD_VIRTUAL_PATH=/usr/local/sbin:/usr/local/bin:/usr/sbin:/usr/bin:/sbin:/bin:/usr/games:/usr/local/games
++ PATH=/jenkins/workspace/gpkit_ResearchModel_gassolar_PR/buildnode/reynolds/optimizer/mosek/venv2_gpkit/bin:/usr/local/sbin:/usr/local/bin:/usr/sbin:/usr/bin:/sbin:/bin:/usr/games:/usr/local/games
++ export PATH
++ '[' -z '' ']'
++ '[' -z '' ']'
++ _OLD_VIRTUAL_PS1=
++ '[' x '!=' x ']'
+++ basename /jenkins/workspace/gpkit_ResearchModel_gassolar_PR/buildnode/reynolds/optimizer/mosek/venv2_gpkit
++ PS1='(venv2_gpkit) '
++ export PS1
++ alias pydoc
++ '[' -n /bin/bash ']'
++ hash -r
++ which pip
+ export PIP=/jenkins/workspace/gpkit_ResearchModel_gassolar_PR/buildnode/reynolds/optimizer/mosek/venv2_gpkit/bin/pip
+ PIP=/jenkins/workspace/gpkit_ResearchModel_gassolar_PR/buildnode/reynolds/optimizer/mosek/venv2_gpkit/bin/pip
+ python /jenkins/workspace/gpkit_ResearchModel_gassolar_PR/buildnode/reynolds/optimizer/mosek/venv2_gpkit/bin/pip install --upgrade pip
Requirement already up-to-date: pip in ./venv2_gpkit/lib/python2.7/site-packages
+ [[ reynolds == *reynolds* ]]
+ export CVXOPT_SUITESPARSE_INC_DIR=/usr/include/suitesparse
+ CVXOPT_SUITESPARSE_INC_DIR=/usr/include/suitesparse
+ export PATH=/home/jenkins/.local/bin/:/jenkins/workspace/gpkit_ResearchModel_gassolar_PR/buildnode/reynolds/optimizer/mosek/venv2_gpkit/bin:/usr/local/sbin:/usr/local/bin:/usr/sbin:/usr/bin:/sbin:/bin:/usr/games:/usr/local/games
+ PATH=/home/jenkins/.local/bin/:/jenkins/workspace/gpkit_ResearchModel_gassolar_PR/buildnode/reynolds/optimizer/mosek/venv2_gpkit/bin:/usr/local/sbin:/usr/local/bin:/usr/sbin:/usr/bin:/sbin:/bin:/usr/games:/usr/local/games
+ [[ mosek == mosek ]]
+ [[ reynolds == reynolds-ubuntu16 ]]
+ export PATH=/home/jenkins/.local/bin/:/jenkins/workspace/gpkit_ResearchModel_gassolar_PR/buildnode/reynolds/optimizer/mosek/venv2_gpkit/bin:/usr/local/sbin:/usr/local/bin:/usr/sbin:/usr/bin:/sbin:/bin:/usr/games:/usr/local/games:/home/jenkins/mosek/7/tools/platform/linux64x86/bin
+ PATH=/home/jenkins/.local/bin/:/jenkins/workspace/gpkit_ResearchModel_gassolar_PR/buildnode/reynolds/optimizer/mosek/venv2_gpkit/bin:/usr/local/sbin:/usr/local/bin:/usr/sbin:/usr/bin:/sbin:/bin:/usr/games:/usr/local/games:/home/jenkins/mosek/7/tools/platform/linux64x86/bin
+ python /home/jenkins/mosek/7/tools/platform/linux64x86/python/2/setup.py install
running install
running build
running build_py
running install_lib
creating /jenkins/workspace/gpkit_ResearchModel_gassolar_PR/buildnode/reynolds/optimizer/mosek/venv2_gpkit/lib/python2.7/site-packages/mosek
copying build/lib.linux-x86_64-2.7/mosek/__init__.py -> /jenkins/workspace/gpkit_ResearchModel_gassolar_PR/buildnode/reynolds/optimizer/mosek/venv2_gpkit/lib/python2.7/site-packages/mosek
copying build/lib.linux-x86_64-2.7/mosek/array.py -> /jenkins/workspace/gpkit_ResearchModel_gassolar_PR/buildnode/reynolds/optimizer/mosek/venv2_gpkit/lib/python2.7/site-packages/mosek
creating /jenkins/workspace/gpkit_ResearchModel_gassolar_PR/buildnode/reynolds/optimizer/mosek/venv2_gpkit/lib/python2.7/site-packages/mosek/fusion
copying build/lib.linux-x86_64-2.7/mosek/fusion/__init__.py -> /jenkins/workspace/gpkit_ResearchModel_gassolar_PR/buildnode/reynolds/optimizer/mosek/venv2_gpkit/lib/python2.7/site-packages/mosek/fusion
copying build/lib.linux-x86_64-2.7/mosek/fusion/Utils.py -> /jenkins/workspace/gpkit_ResearchModel_gassolar_PR/buildnode/reynolds/optimizer/mosek/venv2_gpkit/lib/python2.7/site-packages/mosek/fusion
copying build/lib.linux-x86_64-2.7/mosek/fusion/SolverInfo.py -> /jenkins/workspace/gpkit_ResearchModel_gassolar_PR/buildnode/reynolds/optimizer/mosek/venv2_gpkit/lib/python2.7/site-packages/mosek/fusion
byte-compiling /jenkins/workspace/gpkit_ResearchModel_gassolar_PR/buildnode/reynolds/optimizer/mosek/venv2_gpkit/lib/python2.7/site-packages/mosek/__init__.py to __init__.pyc
byte-compiling /jenkins/workspace/gpkit_ResearchModel_gassolar_PR/buildnode/reynolds/optimizer/mosek/venv2_gpkit/lib/python2.7/site-packages/mosek/array.py to array.pyc
byte-compiling /jenkins/workspace/gpkit_ResearchModel_gassolar_PR/buildnode/reynolds/optimizer/mosek/venv2_gpkit/lib/python2.7/site-packages/mosek/fusion/__init__.py to __init__.pyc
byte-compiling /jenkins/workspace/gpkit_ResearchModel_gassolar_PR/buildnode/reynolds/optimizer/mosek/venv2_gpkit/lib/python2.7/site-packages/mosek/fusion/Utils.py to Utils.pyc
byte-compiling /jenkins/workspace/gpkit_ResearchModel_gassolar_PR/buildnode/reynolds/optimizer/mosek/venv2_gpkit/lib/python2.7/site-packages/mosek/fusion/SolverInfo.py to SolverInfo.pyc
running install_data
copying /home/jenkins/mosek/7/tools/platform/linux64x86/python/2/../../bin/libmosek64.so.7.1 -> /jenkins/workspace/gpkit_ResearchModel_gassolar_PR/buildnode/reynolds/optimizer/mosek/venv2_gpkit/lib/python2.7/site-packages/mosek
copying /home/jenkins/mosek/7/tools/platform/linux64x86/python/2/../../bin/libiomp5.so -> /jenkins/workspace/gpkit_ResearchModel_gassolar_PR/buildnode/reynolds/optimizer/mosek/venv2_gpkit/lib/python2.7/site-packages/mosek
copying /home/jenkins/mosek/7/tools/platform/linux64x86/python/2/../../bin/libmosekxx7_1.so -> /jenkins/workspace/gpkit_ResearchModel_gassolar_PR/buildnode/reynolds/optimizer/mosek/venv2_gpkit/lib/python2.7/site-packages/mosek
copying /home/jenkins/mosek/7/tools/platform/linux64x86/python/2/../../bin/libmosekglb64.so.7.1 -> /jenkins/workspace/gpkit_ResearchModel_gassolar_PR/buildnode/reynolds/optimizer/mosek/venv2_gpkit/lib/python2.7/site-packages/mosek
copying /home/jenkins/mosek/7/tools/platform/linux64x86/python/2/../../../../../license.pdf -> /jenkins/workspace/gpkit_ResearchModel_gassolar_PR/buildnode/reynolds/optimizer/mosek/venv2_gpkit/lib/python2.7/site-packages/mosek
running install_egg_info
Writing /jenkins/workspace/gpkit_ResearchModel_gassolar_PR/buildnode/reynolds/optimizer/mosek/venv2_gpkit/lib/python2.7/site-packages/Mosek-7.1.20-py2.7.egg-info
Please review the MOSEK license conditions in license.pdf
+ [[ mosek == cvxopt ]]
+ [[ mosek == mosek ]]
+ python -c '__import__("mosek").Env()'
+ msktestlic
Computer
  Platform               : Linux/64-X86    
  Cores                  : 20              

Problem
  Name                   :                 
  Objective sense        : min             
  Type                   : LO (linear optimization problem)
  Constraints            : 1               
  Cones                  : 0               
  Scalar variables       : 5000            
  Matrix variables       : 0               
  Integer variables      : 0               

Optimizer started.
Interior-point optimizer started.
Presolve started.
Linear dependency checker started.
Linear dependency checker terminated.
Eliminator - tries                  : 0                 time                   : 0.00            
Eliminator - elim's                 : 0               
Lin. dep.  - tries                  : 1                 time                   : 0.00            
Lin. dep.  - number                 : 0               
Presolve terminated. Time: 0.00    
Interior-point optimizer terminated. Time: 0.00. 

Optimizer terminated. Time: 0.03    
************************************
A license was checked out correctly.
************************************
+ export 'GPKITSOLVERS=mosek, mosek_cli'
+ GPKITSOLVERS='mosek, mosek_cli'
+ [[ mosek == cvxopt ]]
+ python /jenkins/workspace/gpkit_ResearchModel_gassolar_PR/buildnode/reynolds/optimizer/mosek/venv2_gpkit/bin/pip install --upgrade xmlrunner
Collecting xmlrunner
Installing collected packages: xmlrunner
Successfully installed xmlrunner-1.7.7
+ python /jenkins/workspace/gpkit_ResearchModel_gassolar_PR/buildnode/reynolds/optimizer/mosek/venv2_gpkit/bin/pip install --upgrade pint
Collecting pint
Installing collected packages: pint
Successfully installed pint-0.8.1
+ python /jenkins/workspace/gpkit_ResearchModel_gassolar_PR/buildnode/reynolds/optimizer/mosek/venv2_gpkit/bin/pip install --upgrade numpy
Collecting numpy
  Using cached numpy-1.14.0-cp27-cp27mu-manylinux1_x86_64.whl
Installing collected packages: numpy
  Found existing installation: numpy 1.11.0
    Not uninstalling numpy at /usr/lib/python2.7/dist-packages, outside environment /jenkins/workspace/gpkit_ResearchModel_gassolar_PR/buildnode/reynolds/optimizer/mosek/venv2_gpkit
Successfully installed numpy-1.14.0
+ python /jenkins/workspace/gpkit_ResearchModel_gassolar_PR/buildnode/reynolds/optimizer/mosek/venv2_gpkit/bin/pip install --upgrade scipy
Collecting scipy
  Using cached scipy-1.0.0-cp27-cp27mu-manylinux1_x86_64.whl
Requirement already up-to-date: numpy>=1.8.2 in ./venv2_gpkit/lib/python2.7/site-packages (from scipy)
Installing collected packages: scipy
  Found existing installation: scipy 0.17.0
    Not uninstalling scipy at /usr/lib/python2.7/dist-packages, outside environment /jenkins/workspace/gpkit_ResearchModel_gassolar_PR/buildnode/reynolds/optimizer/mosek/venv2_gpkit
Successfully installed scipy-1.0.0
+ python /jenkins/workspace/gpkit_ResearchModel_gassolar_PR/buildnode/reynolds/optimizer/mosek/venv2_gpkit/bin/pip install --upgrade ctypesgen
Collecting ctypesgen
Installing collected packages: ctypesgen
Successfully installed ctypesgen-0.post125
+ export GPKITBUILD=/jenkins/workspace/gpkit_ResearchModel_gassolar_PR/buildnode/reynolds/optimizer/mosek/build_gpkit
+ GPKITBUILD=/jenkins/workspace/gpkit_ResearchModel_gassolar_PR/buildnode/reynolds/optimizer/mosek/build_gpkit
++ which coverage
+ COVERAGE=/home/jenkins/.local/bin//coverage
+ python -c 'import scipy; print scipy.__version__'
1.0.0
+ python -c 'import numpy; print numpy.__version__'
1.14.0
+ python -c 'import pint; print pint.__version__'
0.8.1
+ git clone --depth 1 https://github.com/convexengineering/gpkit.git /jenkins/workspace/gpkit_ResearchModel_gassolar_PR/buildnode/reynolds/optimizer/mosek/gpkit
Cloning into '/jenkins/workspace/gpkit_ResearchModel_gassolar_PR/buildnode/reynolds/optimizer/mosek/gpkit'...
+ python /jenkins/workspace/gpkit_ResearchModel_gassolar_PR/buildnode/reynolds/optimizer/mosek/venv2_gpkit/bin/pip install -v --no-cache-dir --no-deps -e /jenkins/workspace/gpkit_ResearchModel_gassolar_PR/buildnode/reynolds/optimizer/mosek/gpkit
Obtaining file:///jenkins/workspace/gpkit_ResearchModel_gassolar_PR/buildnode/reynolds/optimizer/mosek/gpkit
  Running setup.py (path:/jenkins/workspace/gpkit_ResearchModel_gassolar_PR/buildnode/reynolds/optimizer/mosek/gpkit/setup.py) egg_info for package from file:///jenkins/workspace/gpkit_ResearchModel_gassolar_PR/buildnode/reynolds/optimizer/mosek/gpkit
    Running command python setup.py egg_info
    Status: Preprocessing /tmp/tmp0b7iLS.h
    Status: gcc -E -U __GNUC__ -dD "-Dinline=" "-D__inline__=" "-D__extension__=" "-D_Bool=uint8_t" "-D__const=const" "-D__asm__(x)=" "-D__asm(x)=" "-DCTYPESGEN=1" /tmp/tmp0b7iLS.h
    Status: Parsing /tmp/tmp0b7iLS.h
    Status: Processing description list.
    Error: Ctypes does not support the type "long double". Function "strtold" will not be output
    Error: Ctypes does not support the type "long double". Function "qecvt" will not be output
    Error: Ctypes does not support the type "long double". Function "qfcvt" will not be output
    Error: Ctypes does not support the type "long double". Function "qgcvt" will not be output
    Error: Ctypes does not support the type "long double". Function "qecvt_r" will not be output
    Error: Ctypes does not support the type "long double". Function "qfcvt_r" will not be output
    Error: Typedef "__gnuc_va_list" depends on an unknown typedef "__builtin_va_list". Typedef "__gnuc_va_list" will not be output
    Warning: Could not parse macro "#define __warndecl(name,msg) extern void name ( void )"
    Warning: Could not parse macro "#define __errordecl(name,msg) extern void name ( void )"
    Warning: Could not parse macro "#define __flexarr [ ]"
    Warning: Could not parse macro "#define __extern_inline extern __inline __attribute__ ( ( __gnu_inline__ ) )"
    Warning: Could not parse macro "#define __extern_always_inline extern __always_inline __attribute__ ( ( __gnu_inline__ ) )"
    Warning: Could not parse macro "#define __fortify_function __extern_always_inline __attribute_artificial__"
    Warning: Could not parse macro "#define __LDBL_REDIR1_NTH(name,proto,alias) name proto __THROW"
    Warning: Could not parse macro "#define __LDBL_REDIR_NTH(name,proto) name proto __THROW"
    Warning: Could not parse macro "#define __LONG_LONG_PAIR(HI,LO) LO , HI"
    Warning: Could not parse macro "#define __STD_TYPE typedef"
    Warning: Could not parse macro "#define __FD_ZERO(set) do { unsigned int __i ; fd_set * __arr = ( set ) ; for ( __i = i0 ; __i < sizeof ( fd_set ) / sizeof ( __fd_mask ) ; ++ __i ) __FDS_BITS ( __arr ) [ __i ] = i0 ; } while ( i0 )"
    Warning: Could not parse macro "#define __PTHREAD_SPINS i0 , i0"
    Warning: Could not parse macro "#define __PTHREAD_RWLOCK_ELISION_EXTRA i0 , { i0 , i0 , i0 , i0 , i0 , i0 , i0 }"
    Warning: Macro "_Bool" depends on an unknown identifier "uint8_t". Macro "_Bool" will not be output
    Warning: Identifier pasting is not supported by ctypesgen. Macro "__CONCAT" will not be output
    Error: Ctypes does not support the type "long double". Typedef "__long_double_t" will not be output
    Warning: Macro "__bos" depends on an unknown identifier "__builtin_object_size". Macro "__bos" will not be output
    Warning: Macro "__bos0" depends on an unknown identifier "__builtin_object_size". Macro "__bos0" will not be output
    Warning: Macro "__attribute_used__" depends on an unknown identifier "__attribute__". Macro "__attribute_used__" will not be output
    Warning: Macro "__attribute_used__" depends on an unknown identifier "__unused__". Macro "__attribute_used__" will not be output
    Warning: Macro "__always_inline" depends on an unknown identifier "__inline". Macro "__always_inline" will not be output
    Warning: Macro "__restrict_arr" depends on an unknown identifier "restrict". Macro "__restrict_arr" will not be output
    Warning: Macro "__SYSCALL_SLONG_TYPE" depends on an unknown identifier "__SLONGWORD_TYPE". Macro "__SYSCALL_SLONG_TYPE" will not be output
    Warning: Macro "__SYSCALL_ULONG_TYPE" depends on an unknown identifier "__ULONGWORD_TYPE". Macro "__SYSCALL_ULONG_TYPE" will not be output
    Warning: Macro "__DEV_T_TYPE" depends on an unknown identifier "__UQUAD_TYPE". Macro "__DEV_T_TYPE" will not be output
    Warning: Macro "__UID_T_TYPE" depends on an unknown identifier "__U32_TYPE". Macro "__UID_T_TYPE" will not be output
    Warning: Macro "__GID_T_TYPE" depends on an unknown identifier "__U32_TYPE". Macro "__GID_T_TYPE" will not be output
    Warning: Macro "__INO64_T_TYPE" depends on an unknown identifier "__UQUAD_TYPE". Macro "__INO64_T_TYPE" will not be output
    Warning: Macro "__MODE_T_TYPE" depends on an unknown identifier "__U32_TYPE". Macro "__MODE_T_TYPE" will not be output
    Warning: Macro "__OFF64_T_TYPE" depends on an unknown identifier "__SQUAD_TYPE". Macro "__OFF64_T_TYPE" will not be output
    Warning: Macro "__PID_T_TYPE" depends on an unknown identifier "__S32_TYPE". Macro "__PID_T_TYPE" will not be output
    Warning: Macro "__RLIM64_T_TYPE" depends on an unknown identifier "__UQUAD_TYPE". Macro "__RLIM64_T_TYPE" will not be output
    Warning: Macro "__BLKCNT64_T_TYPE" depends on an unknown identifier "__SQUAD_TYPE". Macro "__BLKCNT64_T_TYPE" will not be output
    Warning: Macro "__FSBLKCNT64_T_TYPE" depends on an unknown identifier "__UQUAD_TYPE". Macro "__FSBLKCNT64_T_TYPE" will not be output
    Warning: Macro "__FSFILCNT64_T_TYPE" depends on an unknown identifier "__UQUAD_TYPE". Macro "__FSFILCNT64_T_TYPE" will not be output
    Warning: Macro "__ID_T_TYPE" depends on an unknown identifier "__U32_TYPE". Macro "__ID_T_TYPE" will not be output
    Warning: Macro "__USECONDS_T_TYPE" depends on an unknown identifier "__U32_TYPE". Macro "__USECONDS_T_TYPE" will not be output
    Warning: Macro "__DADDR_T_TYPE" depends on an unknown identifier "__S32_TYPE". Macro "__DADDR_T_TYPE" will not be output
    Warning: Macro "__KEY_T_TYPE" depends on an unknown identifier "__S32_TYPE". Macro "__KEY_T_TYPE" will not be output
    Warning: Macro "__CLOCKID_T_TYPE" depends on an unknown identifier "__S32_TYPE". Macro "__CLOCKID_T_TYPE" will not be output
    Warning: Macro "__SSIZE_T_TYPE" depends on an unknown identifier "__SWORD_TYPE". Macro "__SSIZE_T_TYPE" will not be output
    Warning: Macro "htobe16" depends on an unknown identifier "__bswap_16". Macro "htobe16" will not be output
    Warning: Macro "be16toh" depends on an unknown identifier "__bswap_16". Macro "be16toh" will not be output
    Warning: Macro "htobe32" depends on an unknown identifier "__bswap_32". Macro "htobe32" will not be output
    Warning: Macro "be32toh" depends on an unknown identifier "__bswap_32". Macro "be32toh" will not be output
    Warning: Macro "htobe64" depends on an unknown identifier "__bswap_64". Macro "htobe64" will not be output
    Warning: Macro "be64toh" depends on an unknown identifier "__bswap_64". Macro "be64toh" will not be output
    Warning: Macro "w_termsig" depends on an unknown identifier "__wait_terminated". Macro "w_termsig" will not be output
    Warning: Macro "w_coredump" depends on an unknown identifier "__wait_terminated". Macro "w_coredump" will not be output
    Warning: Macro "w_retcode" depends on an unknown identifier "__wait_terminated". Macro "w_retcode" will not be output
    Warning: Macro "w_stopsig" depends on an unknown identifier "__wait_stopped". Macro "w_stopsig" will not be output
    Warning: Macro "w_stopval" depends on an unknown identifier "__wait_stopped". Macro "w_stopval" will not be output
    Warning: Macro "_G_HAVE_ST_BLKSIZE" depends on an unknown identifier "defined". Macro "_G_HAVE_ST_BLKSIZE" will not be output
    Warning: Macro "_G_HAVE_ST_BLKSIZE" depends on an unknown identifier "_STATBUF_ST_BLKSIZE". Macro "_G_HAVE_ST_BLKSIZE" will not be output
    Warning: Macro "_IO_iconv_t" depends on an unknown identifier "_G_iconv_t". Macro "_IO_iconv_t" will not be output
    Warning: Macro "_IO_va_list" depends on an unknown identifier "_G_va_list". Macro "_IO_va_list" will not be output
    Warning: Macro "_IO_wint_t" depends on an unknown identifier "wint_t". Macro "_IO_wint_t" will not be output
    Warning: Macro "_IO_file_flags" depends on an unknown identifier "_flags". Macro "_IO_file_flags" will not be output
    Warning: Macro "va_start" depends on an unknown identifier "__builtin_va_start". Macro "va_start" will not be output
    Warning: Macro "va_end" depends on an unknown identifier "__builtin_va_end". Macro "va_end" will not be output
    Warning: Macro "va_arg" depends on an unknown identifier "__builtin_va_arg". Macro "va_arg" will not be output
    Warning: Macro "va_copy" depends on an unknown identifier "__builtin_va_copy". Macro "va_copy" will not be output
    Warning: Macro "__va_copy" depends on an unknown identifier "__builtin_va_copy". Macro "__va_copy" will not be output
    Status: Writing to gpkit/_mosek/lib/expopt_h.py.
    Status: Wrapping complete.
    No filename given.
    Usage:
         mskexpopt FILENAME [-primal] [-dual] [-p parameterfile]
    Return code: 1052
    Description: MSK_RES_ERR_FILE_OPEN [An error occurred while opening a file.]
    Could not load settings file.
    #     Could not find __init__.py
    Started building gpkit...

    Attempting to find and build solvers:

    # Looking for mosek
    #     Found /home/jenkins/mosek/7/tools/platform/linux64x86/h/mosek.h
    #     Found /home/jenkins/mosek/7/tools/platform/linux64x86/bin/libmosek64.so
    #     Found /home/jenkins/mosek/7/tools/examples/c/scopt-ext.c
    #     Found /home/jenkins/mosek/7/tools/examples/c/expopt.c
    #     Found /home/jenkins/mosek/7/tools/examples/c/dgopt.c
    #     Found /home/jenkins/mosek/7/tools/examples/c/scopt-ext.h
    #     Found /home/jenkins/mosek/7/tools/examples/c/expopt.h
    #     Found /home/jenkins/mosek/7/tools/examples/c/dgopt.h
    #     Found /home/jenkins/mosek/7/tools/platform/linux64x86/h/mosek.h
    # Found mosek version 7, installed to /home/jenkins/mosek
    #
    # Building mosek...
    #     Replacing directory gpkit/_mosek/lib
    #     Replacing directory /jenkins/workspace/gpkit_ResearchModel_gassolar_PR/buildnode/reynolds/optimizer/mosek/build_gpkit
    #     Replacing directory gpkit/_mosek/build
    #
    #   Copying expopt library files to gpkit/_mosek/build
    #f     Copying /home/jenkins/mosek/7/tools/examples/c/scopt-ext.c
    #f     Copying /home/jenkins/mosek/7/tools/examples/c/expopt.c
    #f     Copying /home/jenkins/mosek/7/tools/examples/c/dgopt.c
    #f     Copying /home/jenkins/mosek/7/tools/examples/c/scopt-ext.h
    #f     Copying /home/jenkins/mosek/7/tools/examples/c/expopt.h
    #f     Copying /home/jenkins/mosek/7/tools/examples/c/dgopt.h
    #f     Copying /home/jenkins/mosek/7/tools/platform/linux64x86/h/mosek.h
    #
    #   Applying expopt patches...
    #
    #     Change in gpkit/_mosek/build/dgopt.con line 683
    #     --           printf("Number of Hessian non-zeros: %d\n",nlh[0]->numhesnz)
    #     ++ MSK_echotask(task,MSK_STREAM_MSG,"Number of Hessian non-zeros: %d\n",n
    #
    #     Change in gpkit/_mosek/build/expopt.con line 569
    #     --       printf("Warning: The variable with index '%d' has only positive
    #     ++ MSK_echotask(expopttask,MSK_STREAM_MSG, "Warning: The variable with in
    #
    #     Change in gpkit/_mosek/build/expopt.con line 582
    #     --       printf("Warning: The variable with index '%d' has only negative
    #     ++ MSK_echotask(expopttask,MSK_STREAM_MSG, "Warning: The variable with in
    #
    #     Change in gpkit/_mosek/build/expopt.con line 1115
    #     --     printf ("solsta = %d, prosta = %d\n", (int)*solsta,(int)*prosta);
    #     ++ MSK_echotask(expopttask,MSK_STREAM_MSG, "solsta = %d, prosta = %d\n",
    #
    #   Building expopt library...
    #     Calling 'gcc -fpic -shared -Wl,--export-dynamic,-R "/home/jenkins/mosek/7/tools/platform/linux64x86/bin"    gpkit/_mosek/build/scopt-ext.c gpkit/_mosek/build/expopt.c gpkit/_mosek/build/dgopt.c   "/home/jenkins/mosek/7/tools/platform/linux64x86/bin/libmosek64.so" -o /jenkins/workspace/gpkit_ResearchModel_gassolar_PR/buildnode/reynolds/optimizer/mosek/build_gpkit/expopt.so'
    ##
    ### CALL BEGINS
    ### CALL ENDS
    ##
    #
    #   Building Python bindings for expopt and Mosek...
    #     Calling 'python gpkit/modified_ctypesgen.py -a -l /jenkins/workspace/gpkit_ResearchModel_gassolar_PR/buildnode/reynolds/optimizer/mosek/build_gpkit/expopt.so -l "/home/jenkins/mosek/7/tools/platform/linux64x86/bin/libmosek64.so" -o gpkit/_mosek/lib/expopt_h.py    gpkit/_mosek/build/expopt.h'
    ##
    ### CALL BEGINS
    ### CALL ENDS
    ##
    # Done building mosek
    # Looking for mosek_cli
    #   Trying to run mskexpopt...
    #     Calling 'mskexpopt'
    ##
    ### CALL BEGINS
    ### CALL ENDS
    ##
    # Found mosek_cli in system path
    # Looking for cvxopt
    #   Trying to import cvxopt...
    # Did not find cvxopt
    ...finished building gpkit.
    Replaced found solvers (['mosek', 'mosek_cli']) with environment var GPKITSOLVERS (mosek, mosek_cli)

    Found the following solvers: mosek, mosek_cli
    #     Replacing directory gpkit/env
    Replaced the directory gpkit/env

    running egg_info
    creating gpkit.egg-info
    writing requirements to gpkit.egg-info/requires.txt
    writing gpkit.egg-info/PKG-INFO
    writing top-level names to gpkit.egg-info/top_level.txt
    writing dependency_links to gpkit.egg-info/dependency_links.txt
    writing manifest file 'gpkit.egg-info/SOURCES.txt'
    reading manifest file 'gpkit.egg-info/SOURCES.txt'
    writing manifest file 'gpkit.egg-info/SOURCES.txt'
  Source in ./gpkit has version 0.6.0.0, which satisfies requirement gpkit==0.6.0.0 from file:///jenkins/workspace/gpkit_ResearchModel_gassolar_PR/buildnode/reynolds/optimizer/mosek/gpkit
Installing collected packages: gpkit
  Running setup.py develop for gpkit
    Running command /jenkins/workspace/gpkit_ResearchModel_gassolar_PR/buildnode/reynolds/optimizer/mosek/venv2_gpkit/bin/python -c "import setuptools, tokenize;__file__='/jenkins/workspace/gpkit_ResearchModel_gassolar_PR/buildnode/reynolds/optimizer/mosek/gpkit/setup.py';f=getattr(tokenize, 'open', open)(__file__);code=f.read().replace('\r\n', '\n');f.close();exec(compile(code, __file__, 'exec'))" develop --no-deps
    Status: Preprocessing /tmp/tmp2CanJo.h
    Status: gcc -E -U __GNUC__ -dD "-Dinline=" "-D__inline__=" "-D__extension__=" "-D_Bool=uint8_t" "-D__const=const" "-D__asm__(x)=" "-D__asm(x)=" "-DCTYPESGEN=1" /tmp/tmp2CanJo.h
    Status: Parsing /tmp/tmp2CanJo.h
    Status: Processing description list.
    Error: Ctypes does not support the type "long double". Function "strtold" will not be output
    Error: Ctypes does not support the type "long double". Function "qecvt" will not be output
    Error: Ctypes does not support the type "long double". Function "qfcvt" will not be output
    Error: Ctypes does not support the type "long double". Function "qgcvt" will not be output
    Error: Ctypes does not support the type "long double". Function "qecvt_r" will not be output
    Error: Ctypes does not support the type "long double". Function "qfcvt_r" will not be output
    Error: Typedef "__gnuc_va_list" depends on an unknown typedef "__builtin_va_list". Typedef "__gnuc_va_list" will not be output
    Warning: Could not parse macro "#define __warndecl(name,msg) extern void name ( void )"
    Warning: Could not parse macro "#define __errordecl(name,msg) extern void name ( void )"
    Warning: Could not parse macro "#define __flexarr [ ]"
    Warning: Could not parse macro "#define __extern_inline extern __inline __attribute__ ( ( __gnu_inline__ ) )"
    Warning: Could not parse macro "#define __extern_always_inline extern __always_inline __attribute__ ( ( __gnu_inline__ ) )"
    Warning: Could not parse macro "#define __fortify_function __extern_always_inline __attribute_artificial__"
    Warning: Could not parse macro "#define __LDBL_REDIR1_NTH(name,proto,alias) name proto __THROW"
    Warning: Could not parse macro "#define __LDBL_REDIR_NTH(name,proto) name proto __THROW"
    Warning: Could not parse macro "#define __LONG_LONG_PAIR(HI,LO) LO , HI"
    Warning: Could not parse macro "#define __STD_TYPE typedef"
    Warning: Could not parse macro "#define __FD_ZERO(set) do { unsigned int __i ; fd_set * __arr = ( set ) ; for ( __i = i0 ; __i < sizeof ( fd_set ) / sizeof ( __fd_mask ) ; ++ __i ) __FDS_BITS ( __arr ) [ __i ] = i0 ; } while ( i0 )"
    Warning: Could not parse macro "#define __PTHREAD_SPINS i0 , i0"
    Warning: Could not parse macro "#define __PTHREAD_RWLOCK_ELISION_EXTRA i0 , { i0 , i0 , i0 , i0 , i0 , i0 , i0 }"
    Warning: Macro "_Bool" depends on an unknown identifier "uint8_t". Macro "_Bool" will not be output
    Warning: Identifier pasting is not supported by ctypesgen. Macro "__CONCAT" will not be output
    Error: Ctypes does not support the type "long double". Typedef "__long_double_t" will not be output
    Warning: Macro "__bos" depends on an unknown identifier "__builtin_object_size". Macro "__bos" will not be output
    Warning: Macro "__bos0" depends on an unknown identifier "__builtin_object_size". Macro "__bos0" will not be output
    Warning: Macro "__attribute_used__" depends on an unknown identifier "__attribute__". Macro "__attribute_used__" will not be output
    Warning: Macro "__attribute_used__" depends on an unknown identifier "__unused__". Macro "__attribute_used__" will not be output
    Warning: Macro "__always_inline" depends on an unknown identifier "__inline". Macro "__always_inline" will not be output
    Warning: Macro "__restrict_arr" depends on an unknown identifier "restrict". Macro "__restrict_arr" will not be output
    Warning: Macro "__SYSCALL_SLONG_TYPE" depends on an unknown identifier "__SLONGWORD_TYPE". Macro "__SYSCALL_SLONG_TYPE" will not be output
    Warning: Macro "__SYSCALL_ULONG_TYPE" depends on an unknown identifier "__ULONGWORD_TYPE". Macro "__SYSCALL_ULONG_TYPE" will not be output
    Warning: Macro "__DEV_T_TYPE" depends on an unknown identifier "__UQUAD_TYPE". Macro "__DEV_T_TYPE" will not be output
    Warning: Macro "__UID_T_TYPE" depends on an unknown identifier "__U32_TYPE". Macro "__UID_T_TYPE" will not be output
    Warning: Macro "__GID_T_TYPE" depends on an unknown identifier "__U32_TYPE". Macro "__GID_T_TYPE" will not be output
    Warning: Macro "__INO64_T_TYPE" depends on an unknown identifier "__UQUAD_TYPE". Macro "__INO64_T_TYPE" will not be output
    Warning: Macro "__MODE_T_TYPE" depends on an unknown identifier "__U32_TYPE". Macro "__MODE_T_TYPE" will not be output
    Warning: Macro "__OFF64_T_TYPE" depends on an unknown identifier "__SQUAD_TYPE". Macro "__OFF64_T_TYPE" will not be output
    Warning: Macro "__PID_T_TYPE" depends on an unknown identifier "__S32_TYPE". Macro "__PID_T_TYPE" will not be output
    Warning: Macro "__RLIM64_T_TYPE" depends on an unknown identifier "__UQUAD_TYPE". Macro "__RLIM64_T_TYPE" will not be output
    Warning: Macro "__BLKCNT64_T_TYPE" depends on an unknown identifier "__SQUAD_TYPE". Macro "__BLKCNT64_T_TYPE" will not be output
    Warning: Macro "__FSBLKCNT64_T_TYPE" depends on an unknown identifier "__UQUAD_TYPE". Macro "__FSBLKCNT64_T_TYPE" will not be output
    Warning: Macro "__FSFILCNT64_T_TYPE" depends on an unknown identifier "__UQUAD_TYPE". Macro "__FSFILCNT64_T_TYPE" will not be output
    Warning: Macro "__ID_T_TYPE" depends on an unknown identifier "__U32_TYPE". Macro "__ID_T_TYPE" will not be output
    Warning: Macro "__USECONDS_T_TYPE" depends on an unknown identifier "__U32_TYPE". Macro "__USECONDS_T_TYPE" will not be output
    Warning: Macro "__DADDR_T_TYPE" depends on an unknown identifier "__S32_TYPE". Macro "__DADDR_T_TYPE" will not be output
    Warning: Macro "__KEY_T_TYPE" depends on an unknown identifier "__S32_TYPE". Macro "__KEY_T_TYPE" will not be output
    Warning: Macro "__CLOCKID_T_TYPE" depends on an unknown identifier "__S32_TYPE". Macro "__CLOCKID_T_TYPE" will not be output
    Warning: Macro "__SSIZE_T_TYPE" depends on an unknown identifier "__SWORD_TYPE". Macro "__SSIZE_T_TYPE" will not be output
    Warning: Macro "htobe16" depends on an unknown identifier "__bswap_16". Macro "htobe16" will not be output
    Warning: Macro "be16toh" depends on an unknown identifier "__bswap_16". Macro "be16toh" will not be output
    Warning: Macro "htobe32" depends on an unknown identifier "__bswap_32". Macro "htobe32" will not be output
    Warning: Macro "be32toh" depends on an unknown identifier "__bswap_32". Macro "be32toh" will not be output
    Warning: Macro "htobe64" depends on an unknown identifier "__bswap_64". Macro "htobe64" will not be output
    Warning: Macro "be64toh" depends on an unknown identifier "__bswap_64". Macro "be64toh" will not be output
    Warning: Macro "w_termsig" depends on an unknown identifier "__wait_terminated". Macro "w_termsig" will not be output
    Warning: Macro "w_coredump" depends on an unknown identifier "__wait_terminated". Macro "w_coredump" will not be output
    Warning: Macro "w_retcode" depends on an unknown identifier "__wait_terminated". Macro "w_retcode" will not be output
    Warning: Macro "w_stopsig" depends on an unknown identifier "__wait_stopped". Macro "w_stopsig" will not be output
    Warning: Macro "w_stopval" depends on an unknown identifier "__wait_stopped". Macro "w_stopval" will not be output
    Warning: Macro "_G_HAVE_ST_BLKSIZE" depends on an unknown identifier "defined". Macro "_G_HAVE_ST_BLKSIZE" will not be output
    Warning: Macro "_G_HAVE_ST_BLKSIZE" depends on an unknown identifier "_STATBUF_ST_BLKSIZE". Macro "_G_HAVE_ST_BLKSIZE" will not be output
    Warning: Macro "_IO_iconv_t" depends on an unknown identifier "_G_iconv_t". Macro "_IO_iconv_t" will not be output
    Warning: Macro "_IO_va_list" depends on an unknown identifier "_G_va_list". Macro "_IO_va_list" will not be output
    Warning: Macro "_IO_wint_t" depends on an unknown identifier "wint_t". Macro "_IO_wint_t" will not be output
    Warning: Macro "_IO_file_flags" depends on an unknown identifier "_flags". Macro "_IO_file_flags" will not be output
    Warning: Macro "va_start" depends on an unknown identifier "__builtin_va_start". Macro "va_start" will not be output
    Warning: Macro "va_end" depends on an unknown identifier "__builtin_va_end". Macro "va_end" will not be output
    Warning: Macro "va_arg" depends on an unknown identifier "__builtin_va_arg". Macro "va_arg" will not be output
    Warning: Macro "va_copy" depends on an unknown identifier "__builtin_va_copy". Macro "va_copy" will not be output
    Warning: Macro "__va_copy" depends on an unknown identifier "__builtin_va_copy". Macro "__va_copy" will not be output
    Status: Writing to gpkit/_mosek/lib/expopt_h.py.
    Status: Wrapping complete.
    No filename given.
    Usage:
         mskexpopt FILENAME [-primal] [-dual] [-p parameterfile]
    Return code: 1052
    Description: MSK_RES_ERR_FILE_OPEN [An error occurred while opening a file.]
    #     Could not find __init__.py
    Started building gpkit...

    Attempting to find and build solvers:

    # Looking for mosek
    #     Found /home/jenkins/mosek/7/tools/platform/linux64x86/h/mosek.h
    #     Found /home/jenkins/mosek/7/tools/platform/linux64x86/bin/libmosek64.so
    #     Found /home/jenkins/mosek/7/tools/examples/c/scopt-ext.c
    #     Found /home/jenkins/mosek/7/tools/examples/c/expopt.c
    #     Found /home/jenkins/mosek/7/tools/examples/c/dgopt.c
    #     Found /home/jenkins/mosek/7/tools/examples/c/scopt-ext.h
    #     Found /home/jenkins/mosek/7/tools/examples/c/expopt.h
    #     Found /home/jenkins/mosek/7/tools/examples/c/dgopt.h
    #     Found /home/jenkins/mosek/7/tools/platform/linux64x86/h/mosek.h
    # Found mosek version 7, installed to /home/jenkins/mosek
    #
    # Building mosek...
    #     Replacing directory gpkit/_mosek/lib
    #     Replacing directory /jenkins/workspace/gpkit_ResearchModel_gassolar_PR/buildnode/reynolds/optimizer/mosek/build_gpkit
    #     Replacing directory gpkit/_mosek/build
    #
    #   Copying expopt library files to gpkit/_mosek/build
    #f     Copying /home/jenkins/mosek/7/tools/examples/c/scopt-ext.c
    #f     Copying /home/jenkins/mosek/7/tools/examples/c/expopt.c
    #f     Copying /home/jenkins/mosek/7/tools/examples/c/dgopt.c
    #f     Copying /home/jenkins/mosek/7/tools/examples/c/scopt-ext.h
    #f     Copying /home/jenkins/mosek/7/tools/examples/c/expopt.h
    #f     Copying /home/jenkins/mosek/7/tools/examples/c/dgopt.h
    #f     Copying /home/jenkins/mosek/7/tools/platform/linux64x86/h/mosek.h
    #
    #   Applying expopt patches...
    #
    #     Change in gpkit/_mosek/build/dgopt.con line 683
    #     --           printf("Number of Hessian non-zeros: %d\n",nlh[0]->numhesnz)
    #     ++ MSK_echotask(task,MSK_STREAM_MSG,"Number of Hessian non-zeros: %d\n",n
    #
    #     Change in gpkit/_mosek/build/expopt.con line 569
    #     --       printf("Warning: The variable with index '%d' has only positive
    #     ++ MSK_echotask(expopttask,MSK_STREAM_MSG, "Warning: The variable with in
    #
    #     Change in gpkit/_mosek/build/expopt.con line 582
    #     --       printf("Warning: The variable with index '%d' has only negative
    #     ++ MSK_echotask(expopttask,MSK_STREAM_MSG, "Warning: The variable with in
    #
    #     Change in gpkit/_mosek/build/expopt.con line 1115
    #     --     printf ("solsta = %d, prosta = %d\n", (int)*solsta,(int)*prosta);
    #     ++ MSK_echotask(expopttask,MSK_STREAM_MSG, "solsta = %d, prosta = %d\n",
    #
    #   Building expopt library...
    #     Calling 'gcc -fpic -shared -Wl,--export-dynamic,-R "/home/jenkins/mosek/7/tools/platform/linux64x86/bin"    gpkit/_mosek/build/scopt-ext.c gpkit/_mosek/build/expopt.c gpkit/_mosek/build/dgopt.c   "/home/jenkins/mosek/7/tools/platform/linux64x86/bin/libmosek64.so" -o /jenkins/workspace/gpkit_ResearchModel_gassolar_PR/buildnode/reynolds/optimizer/mosek/build_gpkit/expopt.so'
    ##
    ### CALL BEGINS
    ### CALL ENDS
    ##
    #
    #   Building Python bindings for expopt and Mosek...
    #     Calling 'python gpkit/modified_ctypesgen.py -a -l /jenkins/workspace/gpkit_ResearchModel_gassolar_PR/buildnode/reynolds/optimizer/mosek/build_gpkit/expopt.so -l "/home/jenkins/mosek/7/tools/platform/linux64x86/bin/libmosek64.so" -o gpkit/_mosek/lib/expopt_h.py    gpkit/_mosek/build/expopt.h'
    ##
    ### CALL BEGINS
    ### CALL ENDS
    ##
    # Done building mosek
    # Looking for mosek_cli
    #   Trying to run mskexpopt...
    #     Calling 'mskexpopt'
    ##
    ### CALL BEGINS
    ### CALL ENDS
    ##
    # Found mosek_cli in system path
    # Looking for cvxopt
    #   Trying to import cvxopt...
    # Did not find cvxopt
    ...finished building gpkit.
    Replaced found solvers (['mosek', 'mosek_cli']) with environment var GPKITSOLVERS (mosek, mosek_cli)

    Found the following solvers: mosek, mosek_cli
    #     Replacing directory gpkit/env
    Replaced the directory gpkit/env

    running develop
    running egg_info
    writing requirements to gpkit.egg-info/requires.txt
    writing gpkit.egg-info/PKG-INFO
    writing top-level names to gpkit.egg-info/top_level.txt
    writing dependency_links to gpkit.egg-info/dependency_links.txt
    reading manifest file 'gpkit.egg-info/SOURCES.txt'
    writing manifest file 'gpkit.egg-info/SOURCES.txt'
    running build_ext
    Creating /jenkins/workspace/gpkit_ResearchModel_gassolar_PR/buildnode/reynolds/optimizer/mosek/venv2_gpkit/lib/python2.7/site-packages/gpkit.egg-link (link to .)
    Adding gpkit 0.6.0.0 to easy-install.pth file

    Installed /jenkins/workspace/gpkit_ResearchModel_gassolar_PR/buildnode/reynolds/optimizer/mosek/gpkit
Successfully installed gpkit
Cleaning up...
+ cat /jenkins/workspace/gpkit_ResearchModel_gassolar_PR/buildnode/reynolds/optimizer/mosek/gpkit/gpkit/env/settings
installed_solvers : mosek, mosek_cli
mosek_bin_dir : /home/jenkins/mosek/7/tools/platform/linux64x86/bin

+ ls /jenkins/workspace/gpkit_ResearchModel_gassolar_PR/buildnode/reynolds/optimizer/mosek/build_gpkit
expopt.so
+ echo 'from gpkit.tests.test_repo import test_repo; test_repo(xmloutput=True)'
+ python /home/jenkins/.local/bin//coverage run --append --source=. jenkins_test.py
Cloning into 'gplibrary'...
Obtaining file:///jenkins/workspace/gpkit_ResearchModel_gassolar_PR/buildnode/reynolds/optimizer/mosek/gplibrary
Installing collected packages: gpkitmodels
  Running setup.py develop for gpkitmodels
Successfully installed gpkitmodels
Collecting pandas
  Using cached pandas-0.22.0-cp27-cp27mu-manylinux1_x86_64.whl
Requirement already satisfied: pytz>=2011k in /usr/lib/python2.7/dist-packages (from pandas)
Requirement already satisfied: numpy>=1.9.0 in ./venv2_gpkit/lib/python2.7/site-packages (from pandas)
Requirement already satisfied: python-dateutil in /usr/lib/python2.7/dist-packages (from pandas)
Installing collected packages: pandas
Successfully installed pandas-0.22.0
Collecting git+https://github.com/hoburg/gpfit.git
  Cloning https://github.com/hoburg/gpfit.git to /tmp/pip-zInRqj-build
Requirement already satisfied: numpy in ./venv2_gpkit/lib/python2.7/site-packages (from gpfit==0.1)
Requirement already satisfied: scipy in ./venv2_gpkit/lib/python2.7/site-packages (from gpfit==0.1)
Requirement already satisfied: gpkit in ./gpkit (from gpfit==0.1)
Requirement already satisfied: pint>=0.7 in ./venv2_gpkit/lib/python2.7/site-packages (from gpkit->gpfit==0.1)
Installing collected packages: gpfit
  Running setup.py install for gpfit: started
    Running setup.py install for gpfit: finished with status 'done'
Successfully installed gpfit-0.1
Processing /jenkins/workspace/gpkit_ResearchModel_gassolar_PR/buildnode/reynolds/optimizer/mosek
Requirement already satisfied: numpy in ./venv2_gpkit/lib/python2.7/site-packages (from gassolar==0.0.0.0)
Requirement already satisfied: scipy in ./venv2_gpkit/lib/python2.7/site-packages (from gassolar==0.0.0.0)
Requirement already satisfied: gpkit in ./gpkit (from gassolar==0.0.0.0)
Requirement already satisfied: pandas in ./venv2_gpkit/lib/python2.7/site-packages (from gassolar==0.0.0.0)
Requirement already satisfied: gpfit in ./venv2_gpkit/lib/python2.7/site-packages (from gassolar==0.0.0.0)
Requirement already satisfied: pint>=0.7 in ./venv2_gpkit/lib/python2.7/site-packages (from gpkit->gassolar==0.0.0.0)
Requirement already satisfied: pytz>=2011k in /usr/lib/python2.7/dist-packages (from pandas->gassolar==0.0.0.0)
Requirement already satisfied: python-dateutil in /usr/lib/python2.7/dist-packages (from pandas->gassolar==0.0.0.0)
Installing collected packages: gassolar
  Running setup.py install for gassolar: started
    Running setup.py install for gassolar: finished with status 'done'
Successfully installed gassolar-0.0.0.0

Running tests...
----------------------------------------------------------------------
../jenkins/workspace/gpkit_ResearchModel_gassolar_PR/buildnode/reynolds/optimizer/mosek/venv2_gpkit/local/lib/python2.7/site-packages/gassolar/environment/solar_irradiance.py:40: RuntimeWarning: overflow encountered in exp
  tau = np.exp(-0.175/costhsun)
/jenkins/workspace/gpkit_ResearchModel_gassolar_PR/buildnode/reynolds/optimizer/mosek/venv2_gpkit/local/lib/python2.7/site-packages/gpfit/ba_init.py:79: FutureWarning: `rcond` parameter will change to the default of machine precision times ``max(M, N)`` where M and N are the input matrix dimensions.
To use the future default and silence this warning we advise to pass `rcond=None`, to keep using the old, explicitly pass `rcond=-1`.
  b[:, k] = lstsq(X[inds.nonzero()], y[inds.nonzero()])[0][:, 0]
/jenkins/workspace/gpkit_ResearchModel_gassolar_PR/buildnode/reynolds/optimizer/mosek/venv2_gpkit/local/lib/python2.7/site-packages/gpfit/levenberg_marquardt.py:139: FutureWarning: `rcond` parameter will change to the default of machine precision times ``max(M, N)`` where M and N are the input matrix dimensions.
To use the future default and silence this warning we advise to pass `rcond=None`, to keep using the old, explicitly pass `rcond=-1`.
  step = np.linalg.lstsq(augJ, augr)[0]
.adding test for 'gassolar/gas/gas.py'
adding test for 'gassolar/solar/solar.py'
Using solver 'mosek'
Solving for 593 variables.
Solving took 0.233 seconds.
Warning: Variable P_{ref}_Mission/Aircraft/Engine**-1*P_{sl-max}_Mission/Aircraft/Engine could cause inaccurate result because it is below lower bound. Solution is 0.2090 but bound is 0.2955
Warning: Variable [P_{shaft-max}_Mission/Climb/FlightSegment/AircraftPerf/EnginePerf_(0,)**-1*P_{total}_Mission/Climb/ could cause inaccurate result because it is above upper bound. Solution is 1.0000 but bound is 0.9685
Beginning signomial solve.
Solving took 4 GP solves and 1.98 seconds.
Warning: Variable P_{ref}_Mission.1/Aircraft.1/Engine.1**-1*P_{sl-max}_Mission.1/Aircraft.1/Engine.1 could cause inaccurate result because it is below lower bound. Solution is 0.2115 but bound is 0.2955
Warning: Variable [P_{shaft-max}_Mission.1/Climb.1/FlightSegment.2/AircraftPerf.2/EnginePerf.2_(0,)**-1*P_{total}_Miss could cause inaccurate result because it is above upper bound. Solution is 1.0000 but bound is 0.9685
Using solver 'mosek'
Solving for 593 variables.
Solving took 0.19 seconds.
Warning: Variable P_{ref}_Mission/Aircraft/Engine**-1*P_{sl-max}_Mission/Aircraft/Engine could cause inaccurate result because it is below lower bound. Solution is 0.2090 but bound is 0.2955
Warning: Variable [P_{shaft-max}_Mission/Climb/FlightSegment/AircraftPerf/EnginePerf_(0,)**-1*P_{total}_Mission/Climb/ could cause inaccurate result because it is above upper bound. Solution is 1.0000 but bound is 0.9685
Beginning signomial solve.
Solving took 4 GP solves and 111 seconds.
Warning: Variable P_{ref}_Mission.1/Aircraft.1/Engine.1**-1*P_{sl-max}_Mission.1/Aircraft.1/Engine.1 could cause inaccurate result because it is below lower bound. Solution is 0.2115 but bound is 0.2955
Warning: Variable [P_{shaft-max}_Mission.1/Climb.1/FlightSegment.2/AircraftPerf.2/EnginePerf.2_(0,)**-1*P_{total}_Miss could cause inaccurate result because it is above upper bound. Solution is 1.0000 but bound is 0.9685
Using solver 'mosek'
Solving for 1206 variables.
Solving took 1.42 seconds.
Warning: Variable Re_Mission/FlightSegment/AircraftPerf/WingAero could cause inaccurate result because it is below lower bound. Solution is 97517.0234 but bound is 150000.0000
Warning: Variable Re_Mission/FlightSegment.10/AircraftPerf.10/WingAero.10 could cause inaccurate result because it is below lower bound. Solution is 97518.5695 but bound is 150000.0000
1 is a constraining latitude
2 is a constraining latitude
3 is a constraining latitude
4 is a constraining latitude
5 is a constraining latitude
6 is a constraining latitude
7 is a constraining latitude
8 is a constraining latitude
9 is a constraining latitude
10 is a constraining latitude
11 is a constraining latitude
Beginning signomial solve.
Solving took 4 GP solves and 9.95 seconds.
Warning: Variable Re_Mission.1/FlightSegment.11/AircraftPerf.11/WingAero.11 could cause inaccurate result because it is below lower bound. Solution is 98164.7670 but bound is 150000.0000
Warning: Variable Re_Mission.1/FlightSegment.21/AircraftPerf.21/WingAero.21 could cause inaccurate result because it is below lower bound. Solution is 98166.2655 but bound is 150000.0000
1 is a constraining latitude
2 is a constraining latitude
3 is a constraining latitude
4 is a constraining latitude
5 is a constraining latitude
6 is a constraining latitude
7 is a constraining latitude
8 is a constraining latitude
9 is a constraining latitude
10 is a constraining latitude
11 is a constraining latitude
Using solver 'mosek_cli'
Solving for 1206 variables.
Solving took 1.98 seconds.
Warning: Variable Re_Mission/FlightSegment/AircraftPerf/WingAero could cause inaccurate result because it is below lower bound. Solution is 97516.8049 but bound is 150000.0000
Warning: Variable Re_Mission/FlightSegment.10/AircraftPerf.10/WingAero.10 could cause inaccurate result because it is below lower bound. Solution is 97518.7552 but bound is 150000.0000
1 is a constraining latitude
2 is a constraining latitude
3 is a constraining latitude
4 i.
----------------------------------------------------------------------
Ran 4 tests in 160.105s

OK

Generating XML reports...
s a constraining latitude
5 is a constraining latitude
6 is a constraining latitude
7 is a constraining latitude
8 is a constraining latitude
9 is a constraining latitude
10 is a constraining latitude
11 is a constraining latitude
Beginning signomial solve.
Solving took 4 GP solves and 8.86 seconds.
Warning: Variable Re_Mission.1/FlightSegment.11/AircraftPerf.11/WingAero.11 could cause inaccurate result because it is below lower bound. Solution is 98164.5077 but bound is 150000.0000
Warning: Variable Re_Mission.1/FlightSegment.21/AircraftPerf.21/WingAero.21 could cause inaccurate result because it is below lower bound. Solution is 98166.4710 but bound is 150000.0000
1 is a constraining latitude
2 is a constraining latitude
3 is a constraining latitude
4 is a constraining latitude
5 is a constraining latitude
6 is a constraining latitude
7 is a constraining latitude
8 is a constraining latitude
9 is a constraining latitude
10 is a constraining latitude
11 is a constraining latitude

SETTINGS
defaultdict(<type 'str'>, {'skipsolvers': 'cvxopt', 'pip install': 'pandas, git+https://github.com/hoburg/gpfit.git', 'gpkit-models branch': 'master'})

calling ['git', 'clone', '--depth', '1', '-b', 'master', 'https://github.com/convexengineering/gplibrary.git']
  attempt 1
calling ['python', '/jenkins/workspace/gpkit_ResearchModel_gassolar_PR/buildnode/reynolds/optimizer/mosek/venv2_gpkit/bin/pip', 'install', '--no-cache-dir', '--no-deps', '-e', 'gplibrary']
  attempt 1
calling ['python', '/jenkins/workspace/gpkit_ResearchModel_gassolar_PR/buildnode/reynolds/optimizer/mosek/venv2_gpkit/bin/pip', 'install', 'pandas']
  attempt 1
calling ['python', '/jenkins/workspace/gpkit_ResearchModel_gassolar_PR/buildnode/reynolds/optimizer/mosek/venv2_gpkit/bin/pip', 'install', 'git+https://github.com/hoburg/gpfit.git']
  attempt 1
calling ['python', '/jenkins/workspace/gpkit_ResearchModel_gassolar_PR/buildnode/reynolds/optimizer/mosek/venv2_gpkit/bin/pip', 'install', '.']
  attempt 1
[Execution node] check if [reynolds] is in [[windows10x64, windows7x64]]
Run condition [Execution node ] preventing perform for step [Execute Windows batch command]
Build step 'Console output (build log) parsing' changed build result to FAILURE
[Cobertura] Publishing Cobertura coverage report...

[xUnit] [INFO] - Starting to record.
[xUnit] [INFO] - Processing JUnit
[xUnit] [INFO] - [JUnit] - 1 test report file(s) were found with the pattern '**/test_reports/*.xml' relative to '/jenkins/workspace/gpkit_ResearchModel_gassolar_PR/buildnode/reynolds/optimizer/mosek' for the testing framework 'JUnit'.
[xUnit] [INFO] - Check 'Failed Tests' threshold.
[xUnit] [INFO] - Check 'Skipped Tests' threshold.
[xUnit] [INFO] - Setting the build status to FAILURE
[xUnit] [INFO] - Stopping recording.
[WS-CLEANUP] Deleting project workspace...[WS-CLEANUP] done
Finished: FAILURE