Console Output

Skipping 78 KB.. Full Log
  Preparing metadata (setup.py): started
  Preparing metadata (setup.py): finished with status 'done'
Requirement already satisfied: numpy in /Users/jenkins/workspace/CE_gpkit_PR_research_models/buildnode/macys/optimizer/mosek/venv_jenkins/lib/python3.9/site-packages (from turbofan==0.0.0.0) (1.22.2)
Requirement already satisfied: scipy in /Users/jenkins/workspace/CE_gpkit_PR_research_models/buildnode/macys/optimizer/mosek/venv_jenkins/lib/python3.9/site-packages (from turbofan==0.0.0.0) (1.8.0)
Requirement already satisfied: pint in /Users/jenkins/workspace/CE_gpkit_PR_research_models/buildnode/macys/optimizer/mosek/venv_jenkins/lib/python3.9/site-packages (from turbofan==0.0.0.0) (0.18)
Collecting future
  Using cached future-0.18.2-py3-none-any.whl
Requirement already satisfied: packaging in /Users/jenkins/workspace/CE_gpkit_PR_research_models/buildnode/macys/optimizer/mosek/venv_jenkins/lib/python3.9/site-packages (from pint->turbofan==0.0.0.0) (21.3)
Requirement already satisfied: pyparsing!=3.0.5,>=2.0.2 in /Users/jenkins/workspace/CE_gpkit_PR_research_models/buildnode/macys/optimizer/mosek/venv_jenkins/lib/python3.9/site-packages (from packaging->pint->turbofan==0.0.0.0) (3.0.7)
Building wheels for collected packages: turbofan
  Building wheel for turbofan (setup.py): started
  Building wheel for turbofan (setup.py): finished with status 'done'
  Created wheel for turbofan: filename=turbofan-0.0.0.0-py3-none-any.whl size=43849 sha256=6c32fa8e3b14bfb7ac4b1eb45b90a3588493fd21f27d92f7f3ab0366e14c1ffe
  Stored in directory: /private/var/folders/xs/_fh4l1p54zqcl6mbk4zclcfr0000gp/T/pip-ephem-wheel-cache-6p2s5rs2/wheels/d7/9f/b9/a8875d37f2740d561f7ca84d6af59091975c6b21d1b7f0369c
Successfully built turbofan
Installing collected packages: future, turbofan
Successfully installed future-0.18.2 turbofan-0.0.0.0
Processing /Users/jenkins/workspace/CE_gpkit_PR_research_models/buildnode/macys/optimizer/mosek/SPaircraft
  Preparing metadata (setup.py): started
  Preparing metadata (setup.py): finished with status 'done'
Requirement already satisfied: turbofan in /Users/jenkins/workspace/CE_gpkit_PR_research_models/buildnode/macys/optimizer/mosek/venv_jenkins/lib/python3.9/site-packages (from SPaircraft==0.0.0) (0.0.0.0)
Requirement already satisfied: gpkit in /Users/jenkins/workspace/CE_gpkit_PR_research_models/buildnode/macys/optimizer/mosek (from SPaircraft==0.0.0) (1.1.1)
Requirement already satisfied: future in /Users/jenkins/workspace/CE_gpkit_PR_research_models/buildnode/macys/optimizer/mosek/venv_jenkins/lib/python3.9/site-packages (from SPaircraft==0.0.0) (0.18.2)
Requirement already satisfied: numpy>=1.16.4 in /Users/jenkins/workspace/CE_gpkit_PR_research_models/buildnode/macys/optimizer/mosek/venv_jenkins/lib/python3.9/site-packages (from gpkit->SPaircraft==0.0.0) (1.22.2)
Requirement already satisfied: pint>=0.8.1 in /Users/jenkins/workspace/CE_gpkit_PR_research_models/buildnode/macys/optimizer/mosek/venv_jenkins/lib/python3.9/site-packages (from gpkit->SPaircraft==0.0.0) (0.18)
Requirement already satisfied: plotly in /Users/jenkins/workspace/CE_gpkit_PR_research_models/buildnode/macys/optimizer/mosek/venv_jenkins/lib/python3.9/site-packages (from gpkit->SPaircraft==0.0.0) (5.6.0)
Requirement already satisfied: scipy in /Users/jenkins/workspace/CE_gpkit_PR_research_models/buildnode/macys/optimizer/mosek/venv_jenkins/lib/python3.9/site-packages (from gpkit->SPaircraft==0.0.0) (1.8.0)
Requirement already satisfied: adce in /Users/jenkins/workspace/CE_gpkit_PR_research_models/buildnode/macys/optimizer/mosek/venv_jenkins/lib/python3.9/site-packages (from gpkit->SPaircraft==0.0.0) (1.3.3.2)
Requirement already satisfied: cvxopt>=1.1.8 in /Users/jenkins/workspace/CE_gpkit_PR_research_models/buildnode/macys/optimizer/mosek/venv_jenkins/lib/python3.9/site-packages (from gpkit->SPaircraft==0.0.0) (1.2.7)
Requirement already satisfied: matplotlib in /Users/jenkins/workspace/CE_gpkit_PR_research_models/buildnode/macys/optimizer/mosek/venv_jenkins/lib/python3.9/site-packages (from gpkit->SPaircraft==0.0.0) (3.5.1)
Requirement already satisfied: packaging in /Users/jenkins/workspace/CE_gpkit_PR_research_models/buildnode/macys/optimizer/mosek/venv_jenkins/lib/python3.9/site-packages (from pint>=0.8.1->gpkit->SPaircraft==0.0.0) (21.3)
Requirement already satisfied: python-dateutil>=2.7 in /Users/jenkins/workspace/CE_gpkit_PR_research_models/buildnode/macys/optimizer/mosek/venv_jenkins/lib/python3.9/site-packages (from matplotlib->gpkit->SPaircraft==0.0.0) (2.8.2)
Requirement already satisfied: fonttools>=4.22.0 in /Users/jenkins/workspace/CE_gpkit_PR_research_models/buildnode/macys/optimizer/mosek/venv_jenkins/lib/python3.9/site-packages (from matplotlib->gpkit->SPaircraft==0.0.0) (4.29.1)
Requirement already satisfied: pillow>=6.2.0 in /Users/jenkins/workspace/CE_gpkit_PR_research_models/buildnode/macys/optimizer/mosek/venv_jenkins/lib/python3.9/site-packages (from matplotlib->gpkit->SPaircraft==0.0.0) (9.0.1)
Requirement already satisfied: pyparsing>=2.2.1 in /Users/jenkins/workspace/CE_gpkit_PR_research_models/buildnode/macys/optimizer/mosek/venv_jenkins/lib/python3.9/site-packages (from matplotlib->gpkit->SPaircraft==0.0.0) (3.0.7)
Requirement already satisfied: cycler>=0.10 in /Users/jenkins/workspace/CE_gpkit_PR_research_models/buildnode/macys/optimizer/mosek/venv_jenkins/lib/python3.9/site-packages (from matplotlib->gpkit->SPaircraft==0.0.0) (0.11.0)
Requirement already satisfied: kiwisolver>=1.0.1 in /Users/jenkins/workspace/CE_gpkit_PR_research_models/buildnode/macys/optimizer/mosek/venv_jenkins/lib/python3.9/site-packages (from matplotlib->gpkit->SPaircraft==0.0.0) (1.3.2)
Requirement already satisfied: six in /Users/jenkins/workspace/CE_gpkit_PR_research_models/buildnode/macys/optimizer/mosek/venv_jenkins/lib/python3.9/site-packages (from plotly->gpkit->SPaircraft==0.0.0) (1.16.0)
Requirement already satisfied: tenacity>=6.2.0 in /Users/jenkins/workspace/CE_gpkit_PR_research_models/buildnode/macys/optimizer/mosek/venv_jenkins/lib/python3.9/site-packages (from plotly->gpkit->SPaircraft==0.0.0) (8.0.1)
Building wheels for collected packages: SPaircraft
  Building wheel for SPaircraft (setup.py): started
  Building wheel for SPaircraft (setup.py): finished with status 'done'
  Created wheel for SPaircraft: filename=SPaircraft-0.0.0-py3-none-any.whl size=1771 sha256=53428899101d0fed47ade9e94d7bab4493d66c37f981c1882a125c0298b78f9b
  Stored in directory: /private/var/folders/xs/_fh4l1p54zqcl6mbk4zclcfr0000gp/T/pip-ephem-wheel-cache-1wq_0osj/wheels/b4/ce/af/4b3e963e53885bc39639cf307e532cc8d5c7dac22fa4c4e06a
Successfully built SPaircraft
Installing collected packages: SPaircraft
Successfully installed SPaircraft-0.0.0

Running tests...
----------------------------------------------------------------------
adding test for 'SPaircraft.py'
./Users/jenkins/workspace/CE_gpkit_PR_research_models/buildnode/macys/optimizer/mosek/gpkit/constraints/gp.py:441: RuntimeWarning: divide by zero encountered in log
  b[mi] - np.log(self.nu_by_posy[i]/la[i]))
Starting a sequence of GP solves
 for 317 free variables
  in 136 locally-GP constraints
  and for 1198 free variables
       in 4699 posynomial inequalities.

GP Solve 1
Using solver 'mosek_cli'
 for 1198 free variables
  in 4699 posynomial inequalities.
Solving took 0.591 seconds.
Solved cost was 3.965e+40.

GP Solve 2
Using solver 'mosek_cli'
 for 1198 free variables
  in 4699 posynomial inequalities.
Solving took 0.474 seconds.
Solved cost was 4.011e+10.

GP Solve 3
Using solver 'mosek_cli'
 for 1198 free variables
  in 4699 posynomial inequalities.
Solving took 0.484 seconds.
Solved cost was 3.196e+05.

GP Solve 4
Using solver 'mosek_cli'
 for 1198 free variables
  in 4699 posynomial inequalities.
Solving took 0.562 seconds.
Solved cost was 2.931e+04.

GP Solve 5
Using solver 'mosek_cli'
 for 1198 free variables
  in 4699 posynomial inequalities.
Solving took 0.438 seconds.
Solved cost was 2.498e+04.

GP Solve 6
Using solver 'mosek_cli'
 for 1198 free variables
  in 4699 posynomial inequalities.
Solving took 0.466 seconds.
Solved cost was 2.381e+04.

GP Solve 7
Using solver 'mosek_cli'
 for 1198 free variables
  in 4699 posynomial inequalities.
Solving took 0.5 seconds.
Solved cost was 2.328e+04.

GP Solve 8
Using solver 'mosek_cli'
 for 1198 free variables
  in 4699 posynomial inequalities.
Solving took 0.59 seconds.
Solved cost was 2.303e+04.

Solving took 5.33 seconds and 8 GP solves.
WEIGHT DIFFERENCES


Total Fuel Weight Percent Diff: [-14.58138901]


Total Aircraft Weight Percent Diff: [-0.74792307]


Engine Weight Percent Diff: -31.678123275424017


Fuselage Weight Percent Diff: 2.6526976812611798


Payload Weight Percent Diff: [-0.04052335]


VT Weight Percent Diff: 36.22127417266154


HT Weight Percent Diff: -97.00046733347595


Wing Weight Percent Diff: 6.301579926786875




WING DIFFERENCES


Wing Span Percent Diff: -4.0375217464993565


Wing Area Percent Diff: 20.488997712424652




HORIZONTAL TAIL DIFFERENCES


HT Area Percent Diff: 31.218905332316265




VERTICAL TAIL DIFFERENCES




VT Span Percent Diff: 0.9750022574577574


VT Area Percent Diff: -48.98410860424179




CRUISE SEGMENT 1 DRAG DIFFERENCES


Overall Cd Percent Diff: [-29.23167059]


L/D Percent Diff: [16.07558699]


Nacelle Cd Percent Diff: [-2.28045361]


HT Cd Percent Diff: [-97.20243713310997] dimensionless


Fuselage Cd Percent Diff: [108.78744865]


VT Cd Percent Diff: [-35.67326815095701] dimensionless


Wing Cd percent Diff: [-29.62869661]
Induced Drag Cd Percent Diff: [-33.69785347]




CRUISE SEGMENT 1 TSFC DIFFERENCES


Initial Cruise TSFC Percent Diff: [-5.54311993]




FUSELAGE DIFFERENCES




Weight of HB material: -30.58188647308088 


Weight of VB material: 115.86648547134872 
Fan Propulsive Efficiency in Cruise Segment 1
---------------------
[0.80046983]
Starting a sequence of GP solves
 for 317 free variables
  in 136 locally-GP constraints
  and for 1198 free variables
       in 4699 posynomial inequalities.

GP Solve 1
Using solver 'mosek_cli'
 for 1198 free variables
  in 4699 posynomial inequalities.
Solving took 0.547 seconds.
Solved cost was 3.965e+40.

GP Solve 2
Using solver 'mosek_cli'
 for 1198 free variables
  in 4699 posynomial inequalities.
Solving took 0.411 seconds.
Solved cost was 4.013e+10.

GP Solve 3
Using solver 'mosek_cli'
 for 1198 free variables
  in 4699 posynomial inequalities.
Solving took 0.47 seconds.
Solved cost was 3.195e+05.

GP Solve 4
Using solver 'mosek_cli'
 for 1198 free variables
  in 4699 posynomial inequalities.
Solving took 0.558 seconds.
Solved cost was 2.931e+04.

GP Solve 5
Using solver 'mosek_cli'
 for 1198 free variables
  in 4699 posynomial inequalities.
Solving took 0.455 seconds.
Solved cost was 2.498e+04.

GP Solve 6
Using solver 'mosek_cli'
 for 1198 free variables
  in 4699 posynomial inequalities.
Solving took 0.487 seconds.
Solved cost was 2.381e+04.

GP Solve 7
Using solver 'mosek_cli'
 for 1198 free variables
  in 4699 posynomial inequalities.
Solving took 0.495 seconds.
Solved cost was 2.328e+04.

GP Solve 8
Using solver 'mosek_cli'
 for 1198 free variables
  in 4699 posynomial inequalities.
Solving took 0.531 seconds.
Solved cost was 2.303e+04.

Solving took 5.14 seconds and 8 GP solves.
WEIGHT DIFFERENCES


Total Fuel Weight Percent Diff: [-14.58138901]


Total Aircraft Weight Percent Diff: [-0.74792307]


Engine Weight Percent Diff: -31.67887481193446


Fuselage Weight Percent Diff: 2.6526976812611798


Payload Weight Percent Diff: [-0.04052335]


VT Weight Percent Diff: 36.220593067993455


HT Weight Percent Diff: -97.00046433394179


Wing Weight Percent Diff: 6.301579926786875




WING DIFFERENCES


Wing Span Percent Diff: -4.0375217464993565


Wing Area Percent Diff: 20.489118201482633




HORIZONTAL TAIL DIFFERENCES


HT Area Percent Diff: 31.218905332316265




VERTICAL TAIL DIFFERENCES




VT Span Percent Diff: 0.9750022574577574


VT Area Percent Diff: -48.98415962010767




CRUISE SEGMENT 1 DRAG DIFFERENCES


Overall Cd Percent Diff: [-29.23174136]


L/D Percent Diff: [16.07570307]


Nacelle Cd Percent Diff: [-2.28182168]


HT Cd Percent Diff: [-97.20243993067145] dimensionless


Fuselage Cd Percent Diff: [108.78744865]


VT Cd Percent Diff: [-35.673396804292054] dimensionless


Wing Cd percent Diff: [-29.62869661]
Induced Drag Cd Percent Diff: [-33.69791978]




CRUISE SEGMENT 1 TSFC DIFFERENCES


Initial Cruise TSFC Percent Diff: [-5.54291212]




FUSELAGE DIFFERENCES




Weight of HB material: -30.56300217805381 


Weight of VB material: 115.86670133794205 
Fan Propulsive Efficiency in Cruise Segment 1
---------------------
[0.80046695]
Starting a sequence of GP solves
 for 317 free variables
  in 136 locally-GP constraints
  and for 1198 free variables
       in 4699 posynomial inequalities.

GP Solve 1
Using solver 'mosek_conif'
 for 1198 free variables
  in 4699 posynomial inequalities.
Solving took 0.359 seconds.
Solved cost was 3.965e+40.

GP Solve 2
Using solver 'mosek_conif'
 for 1198 free variables
  in 4699 posynomial inequalities.
Solving took 0.326 seconds.
Solved cost was 2.96e+10.

GP Solve 3
Using solver 'mosek_conif'
 for 1198 free variables
  in 4699 posynomial inequalities.
Solving took 0.35 seconds.
Solved cost was 5.008e+05.

GP Solve 4
Using solver 'mosek_conif'
 for 1198 free variables
  in 4699 posynomial inequalities.
Solving took 0.34 seconds.
Solved cost was 3.084e+04.

GP Solve 5
Using solver 'mosek_conif'
 for 1198 free variables
  in 4699 posynomial inequalities.
Solving took 0.318 seconds.
Solved cost was 2.523e+04.

GP Solve 6
Using solver 'mosek_conif'
 for 1198 free variables
  in 4699 posynomial inequalities.
Solving took 0.35 seconds.
Solved cost was 2.393e+04.

GP Solve 7
Using solver 'mosek_conif'
 for 1198 free variables
  in 4699 posynomial inequalities.
Solving took 0.333 seconds.
Solved cost was 2.335e+04.

GP Solve 8
Using solver 'mosek_conif'
 for 1198 free variables
  in 4699 posynomial inequalities.
Solving took 0.36 seconds.
Solved cost was 2.306e+04.
Solution check warning: Dual cost nan does not match primal cost 23060.2718749359

Solving took 4.22 seconds and 8 GP solves.
WEIGHT DIFFERENCES


Total Fuel Weight Percent Diff: [-14.4620349]


Total Aircraft Weight Percent Diff: [-0.47702146]


Engine Weight Percent Diff: -30.87793170605766


Fuselage Weight Percent Diff: 3.0472176434677927


Payload Weight Percent Diff: [-0.04003539]


VT Weight Percent Diff: 37.1580565346551


HT Weight Percent Diff: -96.99292127432845


Wing Weight Percent Diff: 6.456820755741618




WING DIFFERENCES


Wing Span Percent Diff: -4.069711628462601


Wing Area Percent Diff: 20.5708006153049




HORIZONTAL TAIL DIFFERENCES


HT Area Percent Diff: 31.542551240349813




VERTICAL TAIL DIFFERENCES




VT Span Percent Diff: 1.15285504423029


VT Area Percent Diff: -48.80425463113751




CRUISE SEGMENT 1 DRAG DIFFERENCES


Overall Cd Percent Diff: [-29.22577241]


L/D Percent Diff: [15.98253454]


Nacelle Cd Percent Diff: [-1.31153536]


HT Cd Percent Diff: [-97.19562346854258] dimensionless


Fuselage Cd Percent Diff: [108.78752887]


VT Cd Percent Diff: [-35.45988427002766] dimensionless


Wing Cd percent Diff: [-29.70195523]
Induced Drag Cd Percent Diff: [-33.70462132]




CRUISE SEGMENT 1 TSFC DIFFERENCES


Initial Cruise TSFC Percent Diff: [-5.6322152]




FUSELAGE DIFFERENCES




Weight of HB material: -48.55968142917282 


Weight of VB material: 117.26903108617512 
Fan Propulsive Efficiency in Cruise Segment 1
---------------------
[0.80271009]
.
----------------------------------------------------------------------
Ran 2 tests in 30.750s

OK

Generating XML reports...
Cloning into 'robust'...
Processing /Users/jenkins/workspace/CE_gpkit_PR_research_models/buildnode/macys/optimizer/mosek/robust
  Preparing metadata (setup.py): started
  Preparing metadata (setup.py): finished with status 'done'
Requirement already satisfied: gpkit in /Users/jenkins/workspace/CE_gpkit_PR_research_models/buildnode/macys/optimizer/mosek (from robust==0.0.0) (1.1.1)
ERROR: Could not find a version that satisfies the requirement gplibrary (from robust) (from versions: none)
ERROR: No matching distribution found for gplibrary
Processing /Users/jenkins/workspace/CE_gpkit_PR_research_models/buildnode/macys/optimizer/mosek/robust
  Preparing metadata (setup.py): started
  Preparing metadata (setup.py): finished with status 'done'
Requirement already satisfied: gpkit in /Users/jenkins/workspace/CE_gpkit_PR_research_models/buildnode/macys/optimizer/mosek (from robust==0.0.0) (1.1.1)
ERROR: Could not find a version that satisfies the requirement gplibrary (from robust) (from versions: none)
ERROR: No matching distribution found for gplibrary
Processing /Users/jenkins/workspace/CE_gpkit_PR_research_models/buildnode/macys/optimizer/mosek/robust
  Preparing metadata (setup.py): started
  Preparing metadata (setup.py): finished with status 'done'
Requirement already satisfied: gpkit in /Users/jenkins/workspace/CE_gpkit_PR_research_models/buildnode/macys/optimizer/mosek (from robust==0.0.0) (1.1.1)
ERROR: Could not find a version that satisfies the requirement gplibrary (from robust) (from versions: none)
ERROR: No matching distribution found for gplibrary
Processing /Users/jenkins/workspace/CE_gpkit_PR_research_models/buildnode/macys/optimizer/mosek/robust
  Preparing metadata (setup.py): started
  Preparing metadata (setup.py): finished with status 'done'
Requirement already satisfied: gpkit in /Users/jenkins/workspace/CE_gpkit_PR_research_models/buildnode/macys/optimizer/mosek (from robust==0.0.0) (1.1.1)
ERROR: Could not find a version that satisfies the requirement gplibrary (from robust) (from versions: none)
ERROR: No matching distribution found for gplibrary
Processing /Users/jenkins/workspace/CE_gpkit_PR_research_models/buildnode/macys/optimizer/mosek/robust
  Preparing metadata (setup.py): started
  Preparing metadata (setup.py): finished with status 'done'
Requirement already satisfied: gpkit in /Users/jenkins/workspace/CE_gpkit_PR_research_models/buildnode/macys/optimizer/mosek (from robust==0.0.0) (1.1.1)
ERROR: Could not find a version that satisfies the requirement gplibrary (from robust) (from versions: none)
ERROR: No matching distribution found for gplibrary

Running tests...
----------------------------------------------------------------------
adding test for 'run_tests.py'

Running tests...
----------------------------------------------------------------------
.F...F................FF..FF....F..F...Final PCCP solution let non-GP constraints slacken by 0.026%. Calling .localsolve(pccp_penalty=...) with a higher `pccp_penalty` (it was 200 this time) will reduce slack if the model is solvable with less. To verify that the slack is needed, generate an SGP with `use_pccp=False` and start it from this model's  solution: e.g. `m.localsolve(use_pccp=False, x0=m.solution["variables"])`.
Solution check warning: Dual cost 115071.56623625649 does not match primal cost 115044.1
Final PCCP solution let non-GP constraints slacken by 1.3%. Calling .localsolve(pccp_penalty=...) with a higher `pccp_penalty` (it was 200 this time) will reduce slack if the model is solvable with less. To verify that the slack is needed, generate an SGP with `use_pccp=False` and start it from this model's  solution: e.g. `m.localsolve(use_pccp=False, x0=m.solution["variables"])`.
Final PCCP solution let non-GP constraints slacken by 0.036%. Calling .localsolve(pccp_penalty=...) with a higher `pccp_penalty` (it was 200 this time) will reduce slack if the model is solvable with less. To verify that the slack is needed, generate an SGP with `use_pccp=False` and start it from this model's  solution: e.g. `m.localsolve(use_pccp=False, x0=m.solution["variables"])`.
...
======================================================================
FAIL [0.025s]: test_correlated_monomials (run_tests.TestEquivalentPosynomials_mosek_cli)
----------------------------------------------------------------------
Traceback (most recent call last):
  File "/Users/jenkins/workspace/CE_gpkit_PR_research_models/buildnode/macys/optimizer/mosek/robust/robust/testing/t_equivalent_posynomials.py", line 99, in test_correlated_monomials
    self.assertSetEqual(set(actual_posynomials), set(theoretical_posynomials))
AssertionError: Items in the first set but not the second:
gpkit.Posynomial(x_3^1.5·u_0^2.8·x_1^3.9/x_4^3.8/x_2^3.2/u_1^1.4/x_0^1.2 + x_3^1.8·x_1^1.9·u_3^2.3·x_2^3.1/x_0^3.1/u_1^2.7/x_4^1.8 + x_1^1.4·x_3^1.4/x_0^4/x_4^2.1/x_2^1.6 + x_1^0.48·u_3^1.8/x_0^4.2/x_2^2.4/x_4^1/x_3^0.24 + x_4^0.48·x_2^2.3·x_3^3.3·x_1^3.9·u_4^4.5/x_0^4.5 + x_1^1.4·x_4^4.3·x_2^4.6/u_1^4.7/x_3^4.6/x_0^4.5/u_0^0.15 + x_0^0.25·x_4^2.1/x_1^4.4/x_3^4/x_2^2.7 + x_0^0.32·x_1^2/x_3^3.4/x_4^1.7/x_2^1.5/u_4^1.1 + x_0^0.51·u_2^3·x_3^3.7/u_0^4.2/x_2^4/x_1^1.7/x_4^1.5 + x_4^0.0045·x_2^0.17·x_0^0.94/x_1^2.6/x_3^0.91 + x_3^0.49·x_0^1.9·x_1^1.9·x_2^4/x_4^4.5 + x_0^2.1·u_2^2.4·x_1^4.9/x_4^4/x_3^2.8/x_2^2.5/u_3^0.78 + x_1^0.26·u_2^1.3·x_0^3.6·x_3^4.3/x_2^1.9/x_4^1.2 + x_0^3.6/x_4^4.3/x_2^4.1/x_1^3.8/x_3^1.7/u_3^0.14 + x_4^4.2·x_0^4.4/x_3^4/x_1^3.8/u_3^2.7/x_2^1.2 + x_1^0.44·x_4^1.1·x_2^3.5·x_0^4.6/x_3^3/u_3^1.7/u_1^0.99)
Items in the second set but not the first:
gpkit.Posynomial(u_0^1.5·x_3^1.7·x_2^2.2·u_3^3.9·x_1^4.9/x_0^4.7/x_4^4.2/u_1^0.34 + x_0^-0.943304835962671·x_1^4.439345435127715·x_2^1.5290282510681674·x_3^0.6613544652657914·x_4^1.2758468504666718·u_0^0.0·u_1^0.0·u_2^3.359459086052551·u_3^-1.2354817411984471·u_4^0.0 + x_0^-1.2236850137918873·x_1^-2.9341658134892787·x_2^0.007435727276769555·x_3^1.3757562248258273·x_4^-3.427277613648143·u_0^0.0·u_1^0.0·u_2^0.0·u_3^-3.1651061223462413·u_4^0.0 + x_0^-4.548152842582093·x_1^1.4368320356180062·x_2^4.586196011284461·x_3^-4.5941659470181015·x_4^4.295107806897127·u_0^-0.14765467758117656·u_1^-4.692528510981019·u_2^0.0·u_3^0.0·u_4^0.0 + x_0^-3.1150651698911136·x_1^1.9120914350219032·x_2^3.127958915192732·x_3^1.770695082581617·x_4^-1.8356566142755169·u_0^0.0·u_1^-2.685900330439635·u_2^0.0·u_3^2.3078111011312212·u_4^0.0 + x_0^-4.221854642444674·x_1^0.4762127356223136·x_2^-2.374941953259272·x_3^-0.24386138156746995·x_4^-1.0184738608321666·u_0^0.0·u_1^0.0·u_2^0.0·u_3^1.7566412254076569·u_4^0.0 + x_0^-1.210908925459302·x_1^3.9267946513222043·x_2^-3.2144300699260664·x_3^1.4687276128695768·x_4^-3.7555980048992135·u_0^2.7825040696549372·u_1^-1.4159976525653235·u_2^0.0·u_3^0.0·u_4^0.0 + x_0^0.3204140230545116·x_1^1.9837672229083303·x_2^-1.4756254090004117·x_3^-3.4013491134576315·x_4^-1.6862775786103357·u_0^0.0·u_1^0.0·u_2^0.0·u_3^0.0·u_4^-1.128220014404782 + x_0^-4.467575648296532·x_1^3.9343041027980092·x_2^2.3044053531210658·x_3^3.281086783895093·x_4^0.47945412652248276·u_0^0.0·u_1^0.0·u_2^0.0·u_3^0.0·u_4^4.5120716637864815 + x_0^3.6020494793741022·x_1^-3.810077351250908·x_2^-4.06364144172012·x_3^-1.6502150194575926·x_4^-4.304700654801103·u_0^0.0·u_1^0.0·u_2^0.0·u_3^-0.14244701119333902·u_4^0.0 + x_0^4.385484574701493·x_1^-3.7766698154433067·x_2^-1.184221037389399·x_3^-4.039391833823602·x_4^4.185912942024007·u_0^0.0·u_1^0.0·u_2^0.0·u_3^-2.6829123397758274·u_4^0.0 + x_0^4.556633984320351·x_1^0.4375946989195256·x_2^3.517365236826352·x_3^-2.9641167047398165·x_4^1.0850365321483721·u_0^0.0·u_1^-0.9928355694574004·u_2^0.0·u_3^-1.7218444363928276·u_4^0.0 + x_0^0.5098026563194837·x_1^-1.6511878916147662·x_2^-4.046145768967521·x_3^3.6733803839525496·x_4^-1.5174128803170852·u_0^-4.22628826981225·u_1^0.0·u_2^2.9596794818625414·u_3^0.0·u_4^0.0 + x_0^2.143002233032761·x_1^4.947637157714222·x_2^-2.4767670704392075·x_3^-2.7992443625691843·x_4^-3.9685617343644797·u_0^0.0·u_1^0.0·u_2^2.4390955944542374·u_3^-0.7843371288471312·u_4^0.0 + x_0^-1.4736862577026222·x_1^3.7902024091931246·x_2^2.894011011627824·x_3^-0.8405353457095552·x_4^-4.999443888959717·u_0^0.0·u_1^0.0·u_2^3.9641459968752972·u_3^1.1668371820420664·u_4^4.093496088154219 + x_0^3.5968695456113124·x_1^1.9222680942345205·x_2^2.539510197948953·x_3^1.2574255307613358·x_4^0.16774291343694792·u_0^0.0·u_1^0.0·u_2^0.0·u_3^0.0·u_4^-4.134903257104692)

======================================================================
FAIL [0.113s]: test_correlated_monomials (run_tests.TestEquivalentPosynomials_mosek_conif)
----------------------------------------------------------------------
Traceback (most recent call last):
  File "/Users/jenkins/workspace/CE_gpkit_PR_research_models/buildnode/macys/optimizer/mosek/robust/robust/testing/t_equivalent_posynomials.py", line 99, in test_correlated_monomials
    self.assertSetEqual(set(actual_posynomials), set(theoretical_posynomials))
AssertionError: Items in the first set but not the second:
gpkit.Posynomial(x_8^0.12·x_5^0.21·x_16^0.23·x_3^0.97·x_7^1.9·x_9^3.1·x_11^4.3·x_14^4.5·x_4^4.8/x_10^4.6/x_2^4.4/x_6^4.2/x_1^3.7/x_17^3.4/x_15^2.3/x_0^2/x_13^1.8/x_12^1 + x_13^0.51·x_8^0.61·x_3^1.6·x_16^2.3·x_15^3.3·x_11^3.9·x_7^4.9/x_12^4/x_9^3.9/x_4^3.8/x_14^3.8/x_1^3/x_5^2.8/x_6^2.7/x_0^2/x_2^1.6/x_17^0.93/x_10^0.65 + x_15^2.2·x_2^2.4·x_8^3.3·x_5^3.4·x_1^3.7·x_9^3.8·x_11^4.5·x_17^4.7/x_14^4.7/x_10^4.7/x_3^4.6/x_0^2.7/x_16^2.6/x_6^1.9/x_4^1.8/x_13^1.5/x_12^0.46/x_7^0.18 + x_4^0.076·x_14^1.3·x_1^2.5·x_7^3·x_17^3.3·x_2^4.5·x_12^4.6/x_9^4.7/x_0^3.4/x_6^2.2/x_11^1.7/x_3^1.5/x_15^1.5/x_16^1.2/x_13^1.1/x_10^0.69/x_5^0.62/x_8^0.11 + x_14^0.43·x_12^1.2·x_10^1.5·x_4^2.1·x_13^2.3·x_2^2.6·x_8^2.6·x_16^2.7·x_9^3.1·x_7^3.5·x_1^4.5/x_3^4.8/x_0^4.7/x_17^2.9/x_15^2.4/x_6^2/x_5^1.4/x_11^0.49 + x_4^0.24·x_13^0.55·x_14^2.1·x_9^3.1·x_10^3.1·x_7^3.6·x_11^3.8/x_0^4.8/x_17^3.6/x_16^3.6/x_8^3.5/x_15^2.8/x_6^1.6/x_3^1.2/x_1^0.73/x_2^0.35/x_12^0.32/x_5^0.26 + x_0^0.46·x_11^0.72·x_16^1.6·x_13^2.7·x_1^2.8·x_5^3.3·x_6^3.6·x_17^4.2·x_3^4.3·x_7^4.7·x_8^4.8/x_9^4.6/x_15^3.7/x_10^2.8/x_4^2.2/x_14^1.2/x_2^1.1/x_12^0.63)
Items in the second set but not the first:
gpkit.Posynomial(x_3^0.066·x_16^0.59·x_14^0.92·x_11^1.1·x_8^1.7·x_7^1.8·x_1^3.5·x_4^3.8·x_10^4.5·x_17^4.6·x_2^4.8/x_9^4.9/x_15^4.8/x_5^4.5/x_13^4.3/x_0^4.1/u_0^3/x_6^2.9/x_12^1.2 + x_0^1.3483529181381773·x_1^-1.203004903228766·x_2^-3.248404389504278·x_3^4.622434170974099·x_4^-4.1370123037038775·x_5^-3.0845628702853123·x_6^-2.258243584752883·x_7^-0.033972232404987146·x_8^4.438332096257486·x_9^4.198623968698907·x_10^3.604618829462284·x_11^-1.9746980746718679·x_12^-4.49148941535019·x_13^-4.5859476366223735·x_14^-4.803002839931187·x_15^3.3041097278766056·x_16^0.4343616981128626·x_17^-3.7119221348419384·u_0^-3.2850779021015737 + x_0^4.573914790166171·x_1^1.8011747173202233·x_2^-2.364138421035269·x_3^-1.3301125656402846·x_4^-0.5934480062440874·x_5^-3.33587329282771·x_6^-0.09305655227490561·x_7^1.5794552701686957·x_8^-0.3498478909756315·x_9^0.4402916424272094·x_10^-3.517020449603452·x_11^-4.930854700900198·x_12^-1.710882728683364·x_13^0.4170679118088998·x_14^1.5563113455595454·x_15^1.6031834686576474·x_16^-4.043238881483093·x_17^-0.4691892731382552·u_0^3.173671096756599 + x_0^1.047208421260856·x_1^0.7309834939857209·x_2^0.33672221462948926·x_3^3.03867159416305·x_4^-3.2299311280336127·x_5^0.5927070531822585·x_6^1.0575596572609829·x_7^0.32318610610450627·x_8^1.1673041845818037·x_9^0.2589608280607809·x_10^1.1196404508726667·x_11^2.9805933913029765·x_12^-1.8009164253134777·x_13^3.8143298826288046·x_14^1.1752282953445583·x_15^0.5403934401671915·x_16^4.750444290684525·x_17^2.5329030340190615·u_0^-0.7757561019859571 + x_0^1.0229797983769817·x_1^3.599183883697565·x_2^-1.5179609691047569·x_3^-4.809232014094941·x_4^-0.020185318026565646·x_5^2.386981475083693·x_6^1.940247126870796·x_7^-4.916926782484229·x_8^4.076260489325067·x_9^2.7263585396285688·x_10^4.74829657532381·x_11^0.23039629653201033·x_12^3.943595132797089·x_13^-1.3811561103122107·x_14^3.0045459120980578·x_15^1.1178123320768707·x_16^-2.777440110959831·x_17^-4.726037674321445·u_0^4.00311895084161 + x_0^-4.3160571162827495·x_1^4.649770133228735·x_2^-0.693402774937395·x_3^1.22902335915221·x_4^2.6796348222987207·x_5^-4.389075346680224·x_6^-0.5789976027462265·x_7^-1.784722467251746·x_8^0.3689078551242009·x_9^-0.45865079547510135·x_10^-3.0190626899041173·x_11^3.7353391828409777·x_12^-4.681154209148362·x_13^-3.6269682456101893·x_14^1.6019165169757148·x_15^-2.672255115910185·x_16^-2.184491321681421·x_17^-2.3329855834124578·u_0^2.920475546583821 + x_0^-4.826226432244286·x_1^-4.0690459673960735·x_2^3.901337872874798·x_3^-3.7892113797716256·x_4^0.1579926419909512·x_5^0.5403815913563754·x_6^-0.3432429034039819·x_7^-4.799044567091764·x_8^1.6945030709163875·x_9^-0.2357429296028073·x_10^-0.03756762668733504·x_11^4.5052136232091335·x_12^2.7815040470657024·x_13^-1.232553601817096·x_14^-1.5960521680316218·x_15^-0.8685561581221268·x_16^0.3177096403402677·x_17^-0.14085695026472056·u_0^-0.1668103705416557)

======================================================================
FAIL [1.050s]: test_conservativeness (run_tests.TestPrimitives_mosek_cli)
Testing conservativeness of solution methods
----------------------------------------------------------------------
Traceback (most recent call last):
  File "/Users/jenkins/workspace/CE_gpkit_PR_research_models/buildnode/macys/optimizer/mosek/robust/robust/testing/t_primitives.py", line 66, in test_conservativeness
    self.assertTrue(sm['cost'] <= sem['cost'] <= smm['cost'] <= sbm['cost'])
AssertionError: False is not true

======================================================================
FAIL [0.280s]: test_methods (run_tests.TestPrimitives_mosek_cli)
----------------------------------------------------------------------
Traceback (most recent call last):
  File "/Users/jenkins/workspace/CE_gpkit_PR_research_models/buildnode/macys/optimizer/mosek/robust/robust/testing/t_primitives.py", line 117, in test_methods
    self.assertAlmostEqual(sol(vk), prev_sol(vk), places=5)
AssertionError: <Quantity(0.636130467, 'dimensionless')> != <Quantity(0.631384596, 'dimensionless')> within 5 places (<Quantity(0.0047458711, 'dimensionless')> difference)

======================================================================
FAIL [1.022s]: test_conservativeness (run_tests.TestPrimitives_mosek_conif)
Testing conservativeness of solution methods
----------------------------------------------------------------------
Traceback (most recent call last):
  File "/Users/jenkins/workspace/CE_gpkit_PR_research_models/buildnode/macys/optimizer/mosek/robust/robust/testing/t_primitives.py", line 66, in test_conservativeness
    self.assertTrue(sm['cost'] <= sem['cost'] <= smm['cost'] <= sbm['cost'])
AssertionError: False is not true

======================================================================
FAIL [0.318s]: test_methods (run_tests.TestPrimitives_mosek_conif)
----------------------------------------------------------------------
Traceback (most recent call last):
  File "/Users/jenkins/workspace/CE_gpkit_PR_research_models/buildnode/macys/optimizer/mosek/robust/robust/testing/t_primitives.py", line 117, in test_methods
    self.assertAlmostEqual(sol(vk), prev_sol(vk), places=5)
AssertionError: <Quantity(0.636130467, 'dimensionless')> != <Quantity(0.631384596, 'dimensionless')> within 5 places (<Quantity(0.0047458711, 'dimensionless')> difference)

======================================================================
FAIL [0.180s]: test_bad_relations (run_tests.TestTwoTermApproximation_mosek_cli)
----------------------------------------------------------------------
Traceback (most recent call last):
  File "/Users/jenkins/workspace/CE_gpkit_PR_research_models/buildnode/macys/optimizer/mosek/robust/robust/testing/t_two_term_approximation.py", line 202, in test_bad_relations
    self.assertEqual(actual_relations_mons, relations_mons)
AssertionError: {gpkit.Monomial(9.74·u_7^0.032·u_11^0.69·x_7^0.73·x_4^1.4[14750 chars]: 2}} != {gpkit.Monomial(2.81·x_0^4.172560580925671·x_1^0.46441226[39744 chars]: 7}}
Diff is 93902 characters long. Set self.maxDiff to None to see it.

======================================================================
FAIL [0.445s]: test_bad_relations (run_tests.TestTwoTermApproximation_mosek_conif)
----------------------------------------------------------------------
Traceback (most recent call last):
  File "/Users/jenkins/workspace/CE_gpkit_PR_research_models/buildnode/macys/optimizer/mosek/robust/robust/testing/t_two_term_approximation.py", line 202, in test_bad_relations
    self.assertEqual(actual_relations_mons, relations_mons)
AssertionError: {gpkit.Monomial(8.65·u_2^0.086·u_6^0.21·u_24^0.21·u_17^2.[48875 chars]: 1}} != {gpkit.Monomial(1.23·x_0^-2.7471920470757305·u_0^1.945554[134404 chars]: 5}}
Diff is 332192 characters long. Set self.maxDiff to None to see it.

----------------------------------------------------------------------
Ran 42 tests in 78.314s

FAILED (failures=8)

Generating XML reports...
.
Running tests...
----------------------------------------------------------------------
.F...F................FF..FF....F..F...Final PCCP solution let non-GP constraints slacken by 0.0074%. Calling .localsolve(pccp_penalty=...) with a higher `pccp_penalty` (it was 200 this time) will reduce slack if the model is solvable with less. To verify that the slack is needed, generate an SGP with `use_pccp=False` and start it from this model's  solution: e.g. `m.localsolve(use_pccp=False, x0=m.solution["variables"])`.
Solution check warning: Dual: sum of nu^T * A did not vanish.
Final PCCP solution let non-GP constraints slacken by 16%. Calling .localsolve(pccp_penalty=...) with a higher `pccp_penalty` (it was 200 this time) will reduce slack if the model is solvable with less. To verify that the slack is needed, generate an SGP with `use_pccp=False` and start it from this model's  solution: e.g. `m.localsolve(use_pccp=False, x0=m.solution["variables"])`.
Final PCCP solution let non-GP constraints slacken by 0.0062%. Calling .localsolve(pccp_penalty=...) with a higher `pccp_penalty` (it was 200 this time) will reduce slack if the model is solvable with less. To verify that the slack is needed, generate an SGP with `use_pccp=False` and start it from this model's  solution: e.g. `m.localsolve(use_pccp=False, x0=m.solution["variables"])`.
..Final PCCP solution let non-GP constraints slacken by 2.7%. Calling .localsolve(pccp_penalty=...) with a higher `pccp_penalty` (it was 200 this time) will reduce slack if the model is solvable with less. To verify that the slack is needed, generate an SGP with `use_pccp=False` and start it from this model's  solution: e.g. `m.localsolve(use_pccp=False, x0=m.solution["variables"])`.
.
======================================================================
FAIL [0.036s]: test_correlated_monomials (run_tests.TestEquivalentPosynomials_mosek_cli)
----------------------------------------------------------------------
Traceback (most recent call last):
  File "/Users/jenkins/workspace/CE_gpkit_PR_research_models/buildnode/macys/optimizer/mosek/robust/robust/testing/t_equivalent_posynomials.py", line 116, in test_correlated_monomials
    self.assertSetEqual(set(actual_posynomials), set(theoretical_posynomials))
AssertionError: Items in the first set but not the second:
gpkit.Posynomial(x_4^0.29·x_10^0.38·x_8^0.48·x_1^1.7·x_11^2.3/x_6^4.7/x_9^3.4/x_12^1.9/x_0^1.5/x_5^1.1/x_3^1.1/x_7^0.81/x_2^0.26 + x_10^1.3·x_3^1.9·x_1^2.2·x_4^2.5·x_6^4·x_0^5/x_8^3.5/x_2^3.4/x_5^3.3/x_7^2.5/x_11^2.3/x_12^1.9/x_9^0.19)
Items in the second set but not the first:
gpkit.Posynomial(x_6^0.22·x_9^1.2·x_4^2.4·x_11^2.8·x_3^3.4·u_0^3.8·x_7^3.9·x_12^4.2·x_10^4.7/x_0^3/x_5^3/x_8^2.6/x_1^2.5/x_2^0.12 + x_0^1.761199695316221·x_1^2.361622337439763·x_2^3.073304481748096·x_3^4.132726920826563·x_4^3.9932322744211888·x_5^-2.4059541302416756·x_6^1.4013494556569395·x_7^3.2285000849766927·x_8^4.542955977152912·x_9^4.583001531955073·x_10^1.3447234341209748·x_11^3.0390335385268568·x_12^-1.0842507436695623·u_0^1.9422110055174202)

======================================================================
FAIL [0.019s]: test_correlated_monomials (run_tests.TestEquivalentPosynomials_mosek_conif)
----------------------------------------------------------------------
Traceback (most recent call last):
  File "/Users/jenkins/workspace/CE_gpkit_PR_research_models/buildnode/macys/optimizer/mosek/robust/robust/testing/t_equivalent_posynomials.py", line 99, in test_correlated_monomials
    self.assertSetEqual(set(actual_posynomials), set(theoretical_posynomials))
AssertionError: Items in the first set but not the second:
gpkit.Posynomial(x_5^0.61·x_7^0.78·x_2^1.3·x_3^2.2·x_8^3.1·x_1^3.4/x_6^3.7/x_4^2.8/x_0^2.2/u_2^1.2/u_3^0.46 + x_2^1.8·x_6^3.6·x_1^3.9·x_3^4/x_0^3.1/u_3^2.2/x_7^2.1/x_4^2/x_5^1/x_8^0.44 + x_0^0.11·x_2^1.7·x_8^2.4·x_6^4.8/x_4^3.4/x_7^2.5/x_5^2.2/x_3^2/x_1^0.67 + x_3^0.31·u_2^0.5·x_4^1.3·x_0^2.3/x_5^4.4/x_7^3.8/x_6^3.4/x_1^2.3/x_8^1.1/x_2^0.26 + u_0^1.2·x_6^1.4·u_2^1.6·x_0^2.8·u_3^3.1·x_1^3.6/x_2^5/x_5^4.2/x_7^3.4/x_3^3/x_8^2.7/x_4^0.38 + x_2^0.52·x_8^2.2·x_5^3.5·x_0^3.7·x_1^4/u_0^3.5/x_3^2.8/x_4^2.1/x_7^1.7/x_6^0.6 + x_8^2.2·x_3^2.6·x_1^2.9·x_2^3.7·x_7^4.6·x_6^4.6·x_0^4.7/x_4^3.8/x_5^3.2)
Items in the second set but not the first:
gpkit.Posynomial(x_7^0.56·u_2^2.2·x_2^2.4·x_4^3.3·x_8^3.8·u_0^4.7·x_1^4.8/x_3^2.8/x_5^2.4/x_0^1.4/x_6^0.22 + x_0^-3.095211216619437·x_1^3.890126575075751·x_2^1.7938742928201883·x_3^4.043810489714772·x_4^-2.0439835905102868·x_5^-1.00055067471994·x_6^3.5886974406784073·x_7^-2.147557651679594·x_8^-0.4409801292286577·u_0^0.0·u_1^0.0·u_2^0.0·u_3^-2.210402874123739 + x_0^2.8474570195340156·x_1^3.628162990810475·x_2^-4.971120893121909·x_3^-2.9654881738052685·x_4^-0.37545971831174363·x_5^-4.1852157356767306·x_6^1.4142921981443637·x_7^-3.423852781910053·x_8^-2.68112021247086·u_0^1.172413234470167·u_1^0.0·u_2^1.6324865265578241·u_3^3.1425636351464674 + x_0^-2.1626940211393286·x_1^3.4165166733191015·x_2^1.2971771886099637·x_3^2.156361499577831·x_4^-2.7673255614316226·x_5^0.6118185440640271·x_6^-3.7228602271134603·x_7^0.7779886733425947·x_8^3.083471946363309·u_0^0.0·u_1^0.0·u_2^-1.193742162490266·u_3^-0.4647887104240478 + x_0^3.661894577536419·x_1^4.014033125143694·x_2^0.5202475323858877·x_3^-2.8062916762695513·x_4^-2.0798498924552655·x_5^3.519722761252499·x_6^-0.6044692161371001·x_7^-1.7356059263148227·x_8^2.1705906872068548·u_0^-3.455157525432207·u_1^0.0·u_2^0.0·u_3^0.0 + x_0^2.28114757705327·x_1^-2.2666290990015914·x_2^-0.2581804486663728·x_3^0.3077346310669773·x_4^1.2724508032975743·x_5^-4.433117569534602·x_6^-3.436710614046098·x_7^-3.8173723575816765·x_8^-1.106129013107613·u_0^0.0·u_1^0.0·u_2^0.5005684937714783·u_3^0.0 + x_0^1.6297376674943775·x_1^0.2476172640661094·x_2^3.790622607767748·x_3^-2.603331751818756·x_4^-2.8054975261005177·x_5^4.610761340613443·x_6^3.2302013816635586·x_7^-2.1436600637525913·x_8^1.9177954511009556·u_0^0.0·u_1^0.34400666646691946·u_2^3.874001164293883·u_3^0.0)

======================================================================
FAIL [0.613s]: test_conservativeness (run_tests.TestPrimitives_mosek_cli)
Testing conservativeness of solution methods
----------------------------------------------------------------------
Traceback (most recent call last):
  File "/Users/jenkins/workspace/CE_gpkit_PR_research_models/buildnode/macys/optimizer/mosek/robust/robust/testing/t_primitives.py", line 66, in test_conservativeness
    self.assertTrue(sm['cost'] <= sem['cost'] <= smm['cost'] <= sbm['cost'])
AssertionError: False is not true

======================================================================
FAIL [0.147s]: test_methods (run_tests.TestPrimitives_mosek_cli)
----------------------------------------------------------------------
Traceback (most recent call last):
  File "/Users/jenkins/workspace/CE_gpkit_PR_research_models/buildnode/macys/optimizer/mosek/robust/robust/testing/t_primitives.py", line 117, in test_methods
    self.assertAlmostEqual(sol(vk), prev_sol(vk), places=5)
AssertionError: <Quantity(0.636130459, 'dimensionless')> != <Quantity(0.631384596, 'dimensionless')> within 5 places (<Quantity(0.00474586309, 'dimensionless')> difference)

======================================================================
FAIL [0.650s]: test_conservativeness (run_tests.TestPrimitives_mosek_conif)
Testing conservativeness of solution methods
----------------------------------------------------------------------
Traceback (most recent call last):
  File "/Users/jenkins/workspace/CE_gpkit_PR_research_models/buildnode/macys/optimizer/mosek/robust/robust/testing/t_primitives.py", line 66, in test_conservativeness
    self.assertTrue(sm['cost'] <= sem['cost'] <= smm['cost'] <= sbm['cost'])
AssertionError: False is not true

======================================================================
FAIL [0.163s]: test_methods (run_tests.TestPrimitives_mosek_conif)
----------------------------------------------------------------------
Traceback (most recent call last):
  File "/Users/jenkins/workspace/CE_gpkit_PR_research_models/buildnode/macys/optimizer/mosek/robust/robust/testing/t_primitives.py", line 117, in test_methods
    self.assertAlmostEqual(sol(vk), prev_sol(vk), places=5)
AssertionError: <Quantity(0.636130459, 'dimensionless')> != <Quantity(0.631384596, 'dimensionless')> within 5 places (<Quantity(0.00474586309, 'dimensionless')> difference)

======================================================================
FAIL [0.552s]: test_bad_relations (run_tests.TestTwoTermApproximation_mosek_cli)
----------------------------------------------------------------------
Traceback (most recent call last):
  File "/Users/jenkins/workspace/CE_gpkit_PR_research_models/buildnode/macys/optimizer/mosek/robust/robust/testing/t_two_term_approximation.py", line 202, in test_bad_relations
    self.assertEqual(actual_relations_mons, relations_mons)
AssertionError: {gpkit.Monomial(4.85·u_85^0.035·u_103^0.062·u_77^0.18·u_5[25329 chars]: 7}} != {gpkit.Monomial(0.466·x_0^3.9831012818962446·x_1^-2.66788[116593 chars]: 9}}
Diff is 239762 characters long. Set self.maxDiff to None to see it.

======================================================================
FAIL [0.027s]: test_bad_relations (run_tests.TestTwoTermApproximation_mosek_conif)
----------------------------------------------------------------------
Traceback (most recent call last):
  File "/Users/jenkins/workspace/CE_gpkit_PR_research_models/buildnode/macys/optimizer/mosek/robust/robust/testing/t_two_term_approximation.py", line 202, in test_bad_relations
    self.assertEqual(actual_relations_mons, relations_mons)
AssertionError: {gpki[13 chars]06·x_2^2.2·u_1^2.6·u_0^2.8·u_9^4.1·x_1^4.9/u_4[1018 chars]: 3}} != {gpki[13 chars]06·x_0^-3.4584358404377946·x_1^4.9243941241269[2863 chars]: 3}}
Diff is 5392 characters long. Set self.maxDiff to None to see it.

----------------------------------------------------------------------
Ran 42 tests in 67.755s

FAILED (failures=8)

Generating XML reports...
.
----------------------------------------------------------------------
Ran 2 tests in 164.278s

OK

Generating XML reports...
Cloning into 'shopping'...

Running tests...
----------------------------------------------------------------------
adding test for 'test.py'
..Using solver 'mosek_cli'
 for 25 free variables
  in 40 posynomial inequalities.
Solving took 0.0399 seconds.
Using solver 'mosek_cli'
 for 25 free variables
  in 40 posynomial inequalities.
Solving took 0.0369 seconds.
.Using solver 'mosek_conif'
 for 25 free variables
  in 40 posynomial inequalities.
Solving took 0.0223 seconds.

----------------------------------------------------------------------
Ran 3 tests in 0.235s

OK

Generating XML reports...
Cloning into 'gassolar'...
Requirement already satisfied: pandas in /Users/jenkins/workspace/CE_gpkit_PR_research_models/buildnode/macys/optimizer/mosek/venv_jenkins/lib/python3.9/site-packages (1.4.1)
Requirement already satisfied: pytz>=2020.1 in /Users/jenkins/workspace/CE_gpkit_PR_research_models/buildnode/macys/optimizer/mosek/venv_jenkins/lib/python3.9/site-packages (from pandas) (2021.3)
Requirement already satisfied: numpy>=1.18.5 in /Users/jenkins/workspace/CE_gpkit_PR_research_models/buildnode/macys/optimizer/mosek/venv_jenkins/lib/python3.9/site-packages (from pandas) (1.22.2)
Requirement already satisfied: python-dateutil>=2.8.1 in /Users/jenkins/workspace/CE_gpkit_PR_research_models/buildnode/macys/optimizer/mosek/venv_jenkins/lib/python3.9/site-packages (from pandas) (2.8.2)
Requirement already satisfied: six>=1.5 in /Users/jenkins/workspace/CE_gpkit_PR_research_models/buildnode/macys/optimizer/mosek/venv_jenkins/lib/python3.9/site-packages (from python-dateutil>=2.8.1->pandas) (1.16.0)
Collecting git+https://github.com/hoburg/gpfit.git
  Cloning https://github.com/hoburg/gpfit.git to /private/var/folders/xs/_fh4l1p54zqcl6mbk4zclcfr0000gp/T/pip-req-build-bn4adkgx
  Running command git clone --filter=blob:none --quiet https://github.com/hoburg/gpfit.git /private/var/folders/xs/_fh4l1p54zqcl6mbk4zclcfr0000gp/T/pip-req-build-bn4adkgx
  Resolved https://github.com/hoburg/gpfit.git to commit 3c8025f12ba5360fdeb71c270e55d4c93e1676fd
  Preparing metadata (setup.py): started
  Preparing metadata (setup.py): finished with status 'done'
Requirement already satisfied: numpy in /Users/jenkins/workspace/CE_gpkit_PR_research_models/buildnode/macys/optimizer/mosek/venv_jenkins/lib/python3.9/site-packages (from gpfit==0.2.0) (1.22.2)
Requirement already satisfied: scipy in /Users/jenkins/workspace/CE_gpkit_PR_research_models/buildnode/macys/optimizer/mosek/venv_jenkins/lib/python3.9/site-packages (from gpfit==0.2.0) (1.8.0)
Requirement already satisfied: gpkit in /Users/jenkins/workspace/CE_gpkit_PR_research_models/buildnode/macys/optimizer/mosek (from gpfit==0.2.0) (1.1.1)
Requirement already satisfied: matplotlib>=3.3.2 in /Users/jenkins/workspace/CE_gpkit_PR_research_models/buildnode/macys/optimizer/mosek/venv_jenkins/lib/python3.9/site-packages (from gpfit==0.2.0) (3.5.1)
Requirement already satisfied: pytest>=6.2.5 in /Users/jenkins/workspace/CE_gpkit_PR_research_models/buildnode/macys/optimizer/mosek/venv_jenkins/lib/python3.9/site-packages (from gpfit==0.2.0) (7.0.1)
Collecting pytest-mpl>=0.13
  Using cached pytest_mpl-0.14.0-py3-none-any.whl (27 kB)
Requirement already satisfied: pillow>=6.2.0 in /Users/jenkins/workspace/CE_gpkit_PR_research_models/buildnode/macys/optimizer/mosek/venv_jenkins/lib/python3.9/site-packages (from matplotlib>=3.3.2->gpfit==0.2.0) (9.0.1)
Requirement already satisfied: pyparsing>=2.2.1 in /Users/jenkins/workspace/CE_gpkit_PR_research_models/buildnode/macys/optimizer/mosek/venv_jenkins/lib/python3.9/site-packages (from matplotlib>=3.3.2->gpfit==0.2.0) (3.0.7)
Requirement already satisfied: fonttools>=4.22.0 in /Users/jenkins/workspace/CE_gpkit_PR_research_models/buildnode/macys/optimizer/mosek/venv_jenkins/lib/python3.9/site-packages (from matplotlib>=3.3.2->gpfit==0.2.0) (4.29.1)
Requirement already satisfied: packaging>=20.0 in /Users/jenkins/workspace/CE_gpkit_PR_research_models/buildnode/macys/optimizer/mosek/venv_jenkins/lib/python3.9/site-packages (from matplotlib>=3.3.2->gpfit==0.2.0) (21.3)
Requirement already satisfied: cycler>=0.10 in /Users/jenkins/workspace/CE_gpkit_PR_research_models/buildnode/macys/optimizer/mosek/venv_jenkins/lib/python3.9/site-packages (from matplotlib>=3.3.2->gpfit==0.2.0) (0.11.0)
Requirement already satisfied: kiwisolver>=1.0.1 in /Users/jenkins/workspace/CE_gpkit_PR_research_models/buildnode/macys/optimizer/mosek/venv_jenkins/lib/python3.9/site-packages (from matplotlib>=3.3.2->gpfit==0.2.0) (1.3.2)
Requirement already satisfied: python-dateutil>=2.7 in /Users/jenkins/workspace/CE_gpkit_PR_research_models/buildnode/macys/optimizer/mosek/venv_jenkins/lib/python3.9/site-packages (from matplotlib>=3.3.2->gpfit==0.2.0) (2.8.2)
Requirement already satisfied: pluggy<2.0,>=0.12 in /Users/jenkins/workspace/CE_gpkit_PR_research_models/buildnode/macys/optimizer/mosek/venv_jenkins/lib/python3.9/site-packages (from pytest>=6.2.5->gpfit==0.2.0) (1.0.0)
Requirement already satisfied: py>=1.8.2 in /Users/jenkins/workspace/CE_gpkit_PR_research_models/buildnode/macys/optimizer/mosek/venv_jenkins/lib/python3.9/site-packages (from pytest>=6.2.5->gpfit==0.2.0) (1.11.0)
Requirement already satisfied: tomli>=1.0.0 in /Users/jenkins/workspace/CE_gpkit_PR_research_models/buildnode/macys/optimizer/mosek/venv_jenkins/lib/python3.9/site-packages (from pytest>=6.2.5->gpfit==0.2.0) (2.0.1)
Requirement already satisfied: iniconfig in /Users/jenkins/workspace/CE_gpkit_PR_research_models/buildnode/macys/optimizer/mosek/venv_jenkins/lib/python3.9/site-packages (from pytest>=6.2.5->gpfit==0.2.0) (1.1.1)
Requirement already satisfied: attrs>=19.2.0 in /Users/jenkins/workspace/CE_gpkit_PR_research_models/buildnode/macys/optimizer/mosek/venv_jenkins/lib/python3.9/site-packages (from pytest>=6.2.5->gpfit==0.2.0) (21.4.0)
Requirement already satisfied: Jinja2 in /Users/jenkins/workspace/CE_gpkit_PR_research_models/buildnode/macys/optimizer/mosek/venv_jenkins/lib/python3.9/site-packages (from pytest-mpl>=0.13->gpfit==0.2.0) (3.0.3)
Requirement already satisfied: pint>=0.8.1 in /Users/jenkins/workspace/CE_gpkit_PR_research_models/buildnode/macys/optimizer/mosek/venv_jenkins/lib/python3.9/site-packages (from gpkit->gpfit==0.2.0) (0.18)
Requirement already satisfied: plotly in /Users/jenkins/workspace/CE_gpkit_PR_research_models/buildnode/macys/optimizer/mosek/venv_jenkins/lib/python3.9/site-packages (from gpkit->gpfit==0.2.0) (5.6.0)
Requirement already satisfied: adce in /Users/jenkins/workspace/CE_gpkit_PR_research_models/buildnode/macys/optimizer/mosek/venv_jenkins/lib/python3.9/site-packages (from gpkit->gpfit==0.2.0) (1.3.3.2)
Requirement already satisfied: cvxopt>=1.1.8 in /Users/jenkins/workspace/CE_gpkit_PR_research_models/buildnode/macys/optimizer/mosek/venv_jenkins/lib/python3.9/site-packages (from gpkit->gpfit==0.2.0) (1.2.7)
Requirement already satisfied: six>=1.5 in /Users/jenkins/workspace/CE_gpkit_PR_research_models/buildnode/macys/optimizer/mosek/venv_jenkins/lib/python3.9/site-packages (from python-dateutil>=2.7->matplotlib>=3.3.2->gpfit==0.2.0) (1.16.0)
Requirement already satisfied: MarkupSafe>=2.0 in /Users/jenkins/workspace/CE_gpkit_PR_research_models/buildnode/macys/optimizer/mosek/venv_jenkins/lib/python3.9/site-packages (from Jinja2->pytest-mpl>=0.13->gpfit==0.2.0) (2.1.0)
Requirement already satisfied: tenacity>=6.2.0 in /Users/jenkins/workspace/CE_gpkit_PR_research_models/buildnode/macys/optimizer/mosek/venv_jenkins/lib/python3.9/site-packages (from plotly->gpkit->gpfit==0.2.0) (8.0.1)
Building wheels for collected packages: gpfit
  Building wheel for gpfit (setup.py): started
  Building wheel for gpfit (setup.py): finished with status 'done'
  Created wheel for gpfit: filename=gpfit-0.2.0-py3-none-any.whl size=493939 sha256=361fdf9f6bb9f0b706e9d841f8f0315d00f964e550b3021e5b4994c7eda245c6
  Stored in directory: /private/var/folders/xs/_fh4l1p54zqcl6mbk4zclcfr0000gp/T/pip-ephem-wheel-cache-5z2ufei2/wheels/7d/c7/e2/9c7f9a2bc07099a39824267dca90eb5f2bc4114dcffca7aced
Successfully built gpfit
Installing collected packages: pytest-mpl, gpfit
Successfully installed gpfit-0.2.0 pytest-mpl-0.14.0
Processing /Users/jenkins/workspace/CE_gpkit_PR_research_models/buildnode/macys/optimizer/mosek/gassolar
  Preparing metadata (setup.py): started
  Preparing metadata (setup.py): finished with status 'done'
Requirement already satisfied: numpy in /Users/jenkins/workspace/CE_gpkit_PR_research_models/buildnode/macys/optimizer/mosek/venv_jenkins/lib/python3.9/site-packages (from gassolar==0.0.0.0) (1.22.2)
Requirement already satisfied: scipy in /Users/jenkins/workspace/CE_gpkit_PR_research_models/buildnode/macys/optimizer/mosek/venv_jenkins/lib/python3.9/site-packages (from gassolar==0.0.0.0) (1.8.0)
Requirement already satisfied: gpkit in /Users/jenkins/workspace/CE_gpkit_PR_research_models/buildnode/macys/optimizer/mosek (from gassolar==0.0.0.0) (1.1.1)
Requirement already satisfied: pandas in /Users/jenkins/workspace/CE_gpkit_PR_research_models/buildnode/macys/optimizer/mosek/venv_jenkins/lib/python3.9/site-packages (from gassolar==0.0.0.0) (1.4.1)
Requirement already satisfied: gpfit in /Users/jenkins/workspace/CE_gpkit_PR_research_models/buildnode/macys/optimizer/mosek/venv_jenkins/lib/python3.9/site-packages (from gassolar==0.0.0.0) (0.2.0)
Requirement already satisfied: pytest-mpl>=0.13 in /Users/jenkins/workspace/CE_gpkit_PR_research_models/buildnode/macys/optimizer/mosek/venv_jenkins/lib/python3.9/site-packages (from gpfit->gassolar==0.0.0.0) (0.14.0)
Requirement already satisfied: matplotlib>=3.3.2 in /Users/jenkins/workspace/CE_gpkit_PR_research_models/buildnode/macys/optimizer/mosek/venv_jenkins/lib/python3.9/site-packages (from gpfit->gassolar==0.0.0.0) (3.5.1)
Requirement already satisfied: pytest>=6.2.5 in /Users/jenkins/workspace/CE_gpkit_PR_research_models/buildnode/macys/optimizer/mosek/venv_jenkins/lib/python3.9/site-packages (from gpfit->gassolar==0.0.0.0) (7.0.1)
Requirement already satisfied: pint>=0.8.1 in /Users/jenkins/workspace/CE_gpkit_PR_research_models/buildnode/macys/optimizer/mosek/venv_jenkins/lib/python3.9/site-packages (from gpkit->gassolar==0.0.0.0) (0.18)
Requirement already satisfied: plotly in /Users/jenkins/workspace/CE_gpkit_PR_research_models/buildnode/macys/optimizer/mosek/venv_jenkins/lib/python3.9/site-packages (from gpkit->gassolar==0.0.0.0) (5.6.0)
Requirement already satisfied: adce in /Users/jenkins/workspace/CE_gpkit_PR_research_models/buildnode/macys/optimizer/mosek/venv_jenkins/lib/python3.9/site-packages (from gpkit->gassolar==0.0.0.0) (1.3.3.2)
Requirement already satisfied: cvxopt>=1.1.8 in /Users/jenkins/workspace/CE_gpkit_PR_research_models/buildnode/macys/optimizer/mosek/venv_jenkins/lib/python3.9/site-packages (from gpkit->gassolar==0.0.0.0) (1.2.7)
Requirement already satisfied: pytz>=2020.1 in /Users/jenkins/workspace/CE_gpkit_PR_research_models/buildnode/macys/optimizer/mosek/venv_jenkins/lib/python3.9/site-packages (from pandas->gassolar==0.0.0.0) (2021.3)
Requirement already satisfied: python-dateutil>=2.8.1 in /Users/jenkins/workspace/CE_gpkit_PR_research_models/buildnode/macys/optimizer/mosek/venv_jenkins/lib/python3.9/site-packages (from pandas->gassolar==0.0.0.0) (2.8.2)
Requirement already satisfied: pyparsing>=2.2.1 in /Users/jenkins/workspace/CE_gpkit_PR_research_models/buildnode/macys/optimizer/mosek/venv_jenkins/lib/python3.9/site-packages (from matplotlib>=3.3.2->gpfit->gassolar==0.0.0.0) (3.0.7)
Requirement already satisfied: cycler>=0.10 in /Users/jenkins/workspace/CE_gpkit_PR_research_models/buildnode/macys/optimizer/mosek/venv_jenkins/lib/python3.9/site-packages (from matplotlib>=3.3.2->gpfit->gassolar==0.0.0.0) (0.11.0)
Requirement already satisfied: kiwisolver>=1.0.1 in /Users/jenkins/workspace/CE_gpkit_PR_research_models/buildnode/macys/optimizer/mosek/venv_jenkins/lib/python3.9/site-packages (from matplotlib>=3.3.2->gpfit->gassolar==0.0.0.0) (1.3.2)
Requirement already satisfied: pillow>=6.2.0 in /Users/jenkins/workspace/CE_gpkit_PR_research_models/buildnode/macys/optimizer/mosek/venv_jenkins/lib/python3.9/site-packages (from matplotlib>=3.3.2->gpfit->gassolar==0.0.0.0) (9.0.1)
Requirement already satisfied: packaging>=20.0 in /Users/jenkins/workspace/CE_gpkit_PR_research_models/buildnode/macys/optimizer/mosek/venv_jenkins/lib/python3.9/site-packages (from matplotlib>=3.3.2->gpfit->gassolar==0.0.0.0) (21.3)
Requirement already satisfied: fonttools>=4.22.0 in /Users/jenkins/workspace/CE_gpkit_PR_research_models/buildnode/macys/optimizer/mosek/venv_jenkins/lib/python3.9/site-packages (from matplotlib>=3.3.2->gpfit->gassolar==0.0.0.0) (4.29.1)
Requirement already satisfied: py>=1.8.2 in /Users/jenkins/workspace/CE_gpkit_PR_research_models/buildnode/macys/optimizer/mosek/venv_jenkins/lib/python3.9/site-packages (from pytest>=6.2.5->gpfit->gassolar==0.0.0.0) (1.11.0)
Requirement already satisfied: pluggy<2.0,>=0.12 in /Users/jenkins/workspace/CE_gpkit_PR_research_models/buildnode/macys/optimizer/mosek/venv_jenkins/lib/python3.9/site-packages (from pytest>=6.2.5->gpfit->gassolar==0.0.0.0) (1.0.0)
Requirement already satisfied: iniconfig in /Users/jenkins/workspace/CE_gpkit_PR_research_models/buildnode/macys/optimizer/mosek/venv_jenkins/lib/python3.9/site-packages (from pytest>=6.2.5->gpfit->gassolar==0.0.0.0) (1.1.1)
Requirement already satisfied: attrs>=19.2.0 in /Users/jenkins/workspace/CE_gpkit_PR_research_models/buildnode/macys/optimizer/mosek/venv_jenkins/lib/python3.9/site-packages (from pytest>=6.2.5->gpfit->gassolar==0.0.0.0) (21.4.0)
Requirement already satisfied: tomli>=1.0.0 in /Users/jenkins/workspace/CE_gpkit_PR_research_models/buildnode/macys/optimizer/mosek/venv_jenkins/lib/python3.9/site-packages (from pytest>=6.2.5->gpfit->gassolar==0.0.0.0) (2.0.1)
Requirement already satisfied: Jinja2 in /Users/jenkins/workspace/CE_gpkit_PR_research_models/buildnode/macys/optimizer/mosek/venv_jenkins/lib/python3.9/site-packages (from pytest-mpl>=0.13->gpfit->gassolar==0.0.0.0) (3.0.3)
Requirement already satisfied: six>=1.5 in /Users/jenkins/workspace/CE_gpkit_PR_research_models/buildnode/macys/optimizer/mosek/venv_jenkins/lib/python3.9/site-packages (from python-dateutil>=2.8.1->pandas->gassolar==0.0.0.0) (1.16.0)
Requirement already satisfied: tenacity>=6.2.0 in /Users/jenkins/workspace/CE_gpkit_PR_research_models/buildnode/macys/optimizer/mosek/venv_jenkins/lib/python3.9/site-packages (from plotly->gpkit->gassolar==0.0.0.0) (8.0.1)
Requirement already satisfied: MarkupSafe>=2.0 in /Users/jenkins/workspace/CE_gpkit_PR_research_models/buildnode/macys/optimizer/mosek/venv_jenkins/lib/python3.9/site-packages (from Jinja2->pytest-mpl>=0.13->gpfit->gassolar==0.0.0.0) (2.1.0)
Building wheels for collected packages: gassolar
  Building wheel for gassolar (setup.py): started
  Building wheel for gassolar (setup.py): finished with status 'done'
  Created wheel for gassolar: filename=gassolar-0.0.0.0-py3-none-any.whl size=4876528 sha256=57eedcf51824e74b1a880ab18e9ee7e78c0812f701173f3ccafe0dcda7710e42
  Stored in directory: /private/var/folders/xs/_fh4l1p54zqcl6mbk4zclcfr0000gp/T/pip-ephem-wheel-cache-i94wk89m/wheels/f6/db/91/614a0bb34f2eee716f21a2d9d22118982bdc15f63e1ace353d
Successfully built gassolar
Installing collected packages: gassolar
Successfully installed gassolar-0.0.0.0

Running tests...
----------------------------------------------------------------------
adding test for 'gassolar/gas/gas.py'
adding test for 'gassolar/solar/solar.py'
EEEE
======================================================================
ERROR [1.030s]: test_gassolar_gas_gas_py_mosek_cli (gpkit.tests.from_paths.TestFiles)
----------------------------------------------------------------------
Traceback (most recent call last):
  File "/Users/jenkins/workspace/CE_gpkit_PR_research_models/buildnode/macys/optimizer/mosek/gpkit/tests/helpers.py", line 55, in test
    testfn(name, import_dict, path)(self)
  File "/Users/jenkins/workspace/CE_gpkit_PR_research_models/buildnode/macys/optimizer/mosek/gpkit/tests/from_paths.py", line 48, in <lambda>
    lambda self: getattr(self, name)()))  # pylint:disable=undefined-variable
  File "/Users/jenkins/workspace/CE_gpkit_PR_research_models/buildnode/macys/optimizer/mosek/gpkit/tests/from_paths.py", line 34, in test_fn
    mod = __import__(os.path.basename(path)[:-3])
  File "/Users/jenkins/workspace/CE_gpkit_PR_research_models/buildnode/macys/optimizer/mosek/gassolar/gassolar/gas/gas.py", line 3, in <module>
    from gpkitmodels.GP.aircraft.engine.gas_engine import Engine
  File "/Users/jenkins/workspace/CE_gpkit_PR_research_models/buildnode/macys/optimizer/mosek/gplibrary/gpkitmodels/GP/aircraft/engine/gas_engine.py", line 7, in <module>
    from gpfit.fit_constraintset import FitCS
ModuleNotFoundError: No module named 'gpfit.fit_constraintset'

======================================================================
ERROR [0.002s]: test_gassolar_gas_gas_py_mosek_conif (gpkit.tests.from_paths.TestFiles)
----------------------------------------------------------------------
Traceback (most recent call last):
  File "/Users/jenkins/workspace/CE_gpkit_PR_research_models/buildnode/macys/optimizer/mosek/gpkit/tests/helpers.py", line 55, in test
    testfn(name, import_dict, path)(self)
  File "/Users/jenkins/workspace/CE_gpkit_PR_research_models/buildnode/macys/optimizer/mosek/gpkit/tests/from_paths.py", line 48, in <lambda>
    lambda self: getattr(self, name)()))  # pylint:disable=undefined-variable
  File "/Users/jenkins/workspace/CE_gpkit_PR_research_models/buildnode/macys/optimizer/mosek/gpkit/tests/from_paths.py", line 34, in test_fn
    mod = __import__(os.path.basename(path)[:-3])
  File "/Users/jenkins/workspace/CE_gpkit_PR_research_models/buildnode/macys/optimizer/mosek/gassolar/gassolar/gas/gas.py", line 3, in <module>
    from gpkitmodels.GP.aircraft.engine.gas_engine import Engine
  File "/Users/jenkins/workspace/CE_gpkit_PR_research_models/buildnode/macys/optimizer/mosek/gplibrary/gpkitmodels/GP/aircraft/engine/gas_engine.py", line 7, in <module>
    from gpfit.fit_constraintset import FitCS
ModuleNotFoundError: No module named 'gpfit.fit_constraintset'

======================================================================
ERROR [0.044s]: test_gassolar_solar_solar_py_mosek_cli (gpkit.tests.from_paths.TestFiles)
----------------------------------------------------------------------
Traceback (most recent call last):
  File "/Users/jenkins/workspace/CE_gpkit_PR_research_models/buildnode/macys/optimizer/mosek/gpkit/tests/helpers.py", line 55, in test
    testfn(name, import_dict, path)(self)
  File "/Users/jenkins/workspace/CE_gpkit_PR_research_models/buildnode/macys/optimizer/mosek/gpkit/tests/from_paths.py", line 48, in <lambda>
    lambda self: getattr(self, name)()))  # pylint:disable=undefined-variable
  File "/Users/jenkins/workspace/CE_gpkit_PR_research_models/buildnode/macys/optimizer/mosek/gpkit/tests/from_paths.py", line 34, in test_fn
    mod = __import__(os.path.basename(path)[:-3])
  File "/Users/jenkins/workspace/CE_gpkit_PR_research_models/buildnode/macys/optimizer/mosek/gassolar/gassolar/solar/solar.py", line 12, in <module>
    from gpkitmodels.GP.aircraft.wing.wing import Wing as WingGP
  File "/Users/jenkins/workspace/CE_gpkit_PR_research_models/buildnode/macys/optimizer/mosek/gplibrary/gpkitmodels/GP/aircraft/wing/wing.py", line 10, in <module>
    from .capspar import CapSpar
  File "/Users/jenkins/workspace/CE_gpkit_PR_research_models/buildnode/macys/optimizer/mosek/gplibrary/gpkitmodels/GP/aircraft/wing/capspar.py", line 4, in <module>
    from .gustloading import GustL
  File "/Users/jenkins/workspace/CE_gpkit_PR_research_models/buildnode/macys/optimizer/mosek/gplibrary/gpkitmodels/GP/aircraft/wing/gustloading.py", line 4, in <module>
    from ad.admath import cos
ModuleNotFoundError: No module named 'ad'

======================================================================
ERROR [0.003s]: test_gassolar_solar_solar_py_mosek_conif (gpkit.tests.from_paths.TestFiles)
----------------------------------------------------------------------
Traceback (most recent call last):
  File "/Users/jenkins/workspace/CE_gpkit_PR_research_models/buildnode/macys/optimizer/mosek/gpkit/tests/helpers.py", line 55, in test
    testfn(name, import_dict, path)(self)
  File "/Users/jenkins/workspace/CE_gpkit_PR_research_models/buildnode/macys/optimizer/mosek/gpkit/tests/from_paths.py", line 48, in <lambda>
    lambda self: getattr(self, name)()))  # pylint:disable=undefined-variable
  File "/Users/jenkins/workspace/CE_gpkit_PR_research_models/buildnode/macys/optimizer/mosek/gpkit/tests/from_paths.py", line 34, in test_fn
    mod = __import__(os.path.basename(path)[:-3])
  File "/Users/jenkins/workspace/CE_gpkit_PR_research_models/buildnode/macys/optimizer/mosek/gassolar/gassolar/solar/solar.py", line 12, in <module>
    from gpkitmodels.GP.aircraft.wing.wing import Wing as WingGP
  File "/Users/jenkins/workspace/CE_gpkit_PR_research_models/buildnode/macys/optimizer/mosek/gplibrary/gpkitmodels/GP/aircraft/wing/wing.py", line 10, in <module>
    from .capspar import CapSpar
  File "/Users/jenkins/workspace/CE_gpkit_PR_research_models/buildnode/macys/optimizer/mosek/gplibrary/gpkitmodels/GP/aircraft/wing/capspar.py", line 4, in <module>
    from .gustloading import GustL
  File "/Users/jenkins/workspace/CE_gpkit_PR_research_models/buildnode/macys/optimizer/mosek/gplibrary/gpkitmodels/GP/aircraft/wing/gustloading.py", line 4, in <module>
    from ad.admath import cos
ModuleNotFoundError: No module named 'ad'

----------------------------------------------------------------------
Ran 4 tests in 1.079s

FAILED (errors=4)

Generating XML reports...
Cloning into 'jho'...
Requirement already satisfied: pandas in /Users/jenkins/workspace/CE_gpkit_PR_research_models/buildnode/macys/optimizer/mosek/venv_jenkins/lib/python3.9/site-packages (1.4.1)
Requirement already satisfied: python-dateutil>=2.8.1 in /Users/jenkins/workspace/CE_gpkit_PR_research_models/buildnode/macys/optimizer/mosek/venv_jenkins/lib/python3.9/site-packages (from pandas) (2.8.2)
Requirement already satisfied: pytz>=2020.1 in /Users/jenkins/workspace/CE_gpkit_PR_research_models/buildnode/macys/optimizer/mosek/venv_jenkins/lib/python3.9/site-packages (from pandas) (2021.3)
Requirement already satisfied: numpy>=1.18.5 in /Users/jenkins/workspace/CE_gpkit_PR_research_models/buildnode/macys/optimizer/mosek/venv_jenkins/lib/python3.9/site-packages (from pandas) (1.22.2)
Requirement already satisfied: six>=1.5 in /Users/jenkins/workspace/CE_gpkit_PR_research_models/buildnode/macys/optimizer/mosek/venv_jenkins/lib/python3.9/site-packages (from python-dateutil>=2.8.1->pandas) (1.16.0)
Collecting git+https://github.com/hoburg/gpfit.git
  Cloning https://github.com/hoburg/gpfit.git to /private/var/folders/xs/_fh4l1p54zqcl6mbk4zclcfr0000gp/T/pip-req-build-5elpzmpi
  Running command git clone --filter=blob:none --quiet https://github.com/hoburg/gpfit.git /private/var/folders/xs/_fh4l1p54zqcl6mbk4zclcfr0000gp/T/pip-req-build-5elpzmpi
  Resolved https://github.com/hoburg/gpfit.git to commit 3c8025f12ba5360fdeb71c270e55d4c93e1676fd
  Preparing metadata (setup.py): started
  Preparing metadata (setup.py): finished with status 'done'
Requirement already satisfied: numpy in /Users/jenkins/workspace/CE_gpkit_PR_research_models/buildnode/macys/optimizer/mosek/venv_jenkins/lib/python3.9/site-packages (from gpfit==0.2.0) (1.22.2)
Requirement already satisfied: scipy in /Users/jenkins/workspace/CE_gpkit_PR_research_models/buildnode/macys/optimizer/mosek/venv_jenkins/lib/python3.9/site-packages (from gpfit==0.2.0) (1.8.0)
Requirement already satisfied: gpkit in /Users/jenkins/workspace/CE_gpkit_PR_research_models/buildnode/macys/optimizer/mosek (from gpfit==0.2.0) (1.1.1)
Requirement already satisfied: matplotlib>=3.3.2 in /Users/jenkins/workspace/CE_gpkit_PR_research_models/buildnode/macys/optimizer/mosek/venv_jenkins/lib/python3.9/site-packages (from gpfit==0.2.0) (3.5.1)
Requirement already satisfied: pytest>=6.2.5 in /Users/jenkins/workspace/CE_gpkit_PR_research_models/buildnode/macys/optimizer/mosek/venv_jenkins/lib/python3.9/site-packages (from gpfit==0.2.0) (7.0.1)
Requirement already satisfied: pytest-mpl>=0.13 in /Users/jenkins/workspace/CE_gpkit_PR_research_models/buildnode/macys/optimizer/mosek/venv_jenkins/lib/python3.9/site-packages (from gpfit==0.2.0) (0.14.0)
Requirement already satisfied: fonttools>=4.22.0 in /Users/jenkins/workspace/CE_gpkit_PR_research_models/buildnode/macys/optimizer/mosek/venv_jenkins/lib/python3.9/site-packages (from matplotlib>=3.3.2->gpfit==0.2.0) (4.29.1)
Requirement already satisfied: kiwisolver>=1.0.1 in /Users/jenkins/workspace/CE_gpkit_PR_research_models/buildnode/macys/optimizer/mosek/venv_jenkins/lib/python3.9/site-packages (from matplotlib>=3.3.2->gpfit==0.2.0) (1.3.2)
Requirement already satisfied: python-dateutil>=2.7 in /Users/jenkins/workspace/CE_gpkit_PR_research_models/buildnode/macys/optimizer/mosek/venv_jenkins/lib/python3.9/site-packages (from matplotlib>=3.3.2->gpfit==0.2.0) (2.8.2)
Requirement already satisfied: pyparsing>=2.2.1 in /Users/jenkins/workspace/CE_gpkit_PR_research_models/buildnode/macys/optimizer/mosek/venv_jenkins/lib/python3.9/site-packages (from matplotlib>=3.3.2->gpfit==0.2.0) (3.0.7)
Requirement already satisfied: pillow>=6.2.0 in /Users/jenkins/workspace/CE_gpkit_PR_research_models/buildnode/macys/optimizer/mosek/venv_jenkins/lib/python3.9/site-packages (from matplotlib>=3.3.2->gpfit==0.2.0) (9.0.1)
Requirement already satisfied: packaging>=20.0 in /Users/jenkins/workspace/CE_gpkit_PR_research_models/buildnode/macys/optimizer/mosek/venv_jenkins/lib/python3.9/site-packages (from matplotlib>=3.3.2->gpfit==0.2.0) (21.3)
Requirement already satisfied: cycler>=0.10 in /Users/jenkins/workspace/CE_gpkit_PR_research_models/buildnode/macys/optimizer/mosek/venv_jenkins/lib/python3.9/site-packages (from matplotlib>=3.3.2->gpfit==0.2.0) (0.11.0)
Requirement already satisfied: attrs>=19.2.0 in /Users/jenkins/workspace/CE_gpkit_PR_research_models/buildnode/macys/optimizer/mosek/venv_jenkins/lib/python3.9/site-packages (from pytest>=6.2.5->gpfit==0.2.0) (21.4.0)
Requirement already satisfied: iniconfig in /Users/jenkins/workspace/CE_gpkit_PR_research_models/buildnode/macys/optimizer/mosek/venv_jenkins/lib/python3.9/site-packages (from pytest>=6.2.5->gpfit==0.2.0) (1.1.1)
Requirement already satisfied: pluggy<2.0,>=0.12 in /Users/jenkins/workspace/CE_gpkit_PR_research_models/buildnode/macys/optimizer/mosek/venv_jenkins/lib/python3.9/site-packages (from pytest>=6.2.5->gpfit==0.2.0) (1.0.0)
Requirement already satisfied: tomli>=1.0.0 in /Users/jenkins/workspace/CE_gpkit_PR_research_models/buildnode/macys/optimizer/mosek/venv_jenkins/lib/python3.9/site-packages (from pytest>=6.2.5->gpfit==0.2.0) (2.0.1)
Requirement already satisfied: py>=1.8.2 in /Users/jenkins/workspace/CE_gpkit_PR_research_models/buildnode/macys/optimizer/mosek/venv_jenkins/lib/python3.9/site-packages (from pytest>=6.2.5->gpfit==0.2.0) (1.11.0)
Requirement already satisfied: Jinja2 in /Users/jenkins/workspace/CE_gpkit_PR_research_models/buildnode/macys/optimizer/mosek/venv_jenkins/lib/python3.9/site-packages (from pytest-mpl>=0.13->gpfit==0.2.0) (3.0.3)
Requirement already satisfied: pint>=0.8.1 in /Users/jenkins/workspace/CE_gpkit_PR_research_models/buildnode/macys/optimizer/mosek/venv_jenkins/lib/python3.9/site-packages (from gpkit->gpfit==0.2.0) (0.18)
Requirement already satisfied: plotly in /Users/jenkins/workspace/CE_gpkit_PR_research_models/buildnode/macys/optimizer/mosek/venv_jenkins/lib/python3.9/site-packages (from gpkit->gpfit==0.2.0) (5.6.0)
Requirement already satisfied: adce in /Users/jenkins/workspace/CE_gpkit_PR_research_models/buildnode/macys/optimizer/mosek/venv_jenkins/lib/python3.9/site-packages (from gpkit->gpfit==0.2.0) (1.3.3.2)
Requirement already satisfied: cvxopt>=1.1.8 in /Users/jenkins/workspace/CE_gpkit_PR_research_models/buildnode/macys/optimizer/mosek/venv_jenkins/lib/python3.9/site-packages (from gpkit->gpfit==0.2.0) (1.2.7)
Requirement already satisfied: six>=1.5 in /Users/jenkins/workspace/CE_gpkit_PR_research_models/buildnode/macys/optimizer/mosek/venv_jenkins/lib/python3.9/site-packages (from python-dateutil>=2.7->matplotlib>=3.3.2->gpfit==0.2.0) (1.16.0)
Requirement already satisfied: MarkupSafe>=2.0 in /Users/jenkins/workspace/CE_gpkit_PR_research_models/buildnode/macys/optimizer/mosek/venv_jenkins/lib/python3.9/site-packages (from Jinja2->pytest-mpl>=0.13->gpfit==0.2.0) (2.1.0)
Requirement already satisfied: tenacity>=6.2.0 in /Users/jenkins/workspace/CE_gpkit_PR_research_models/buildnode/macys/optimizer/mosek/venv_jenkins/lib/python3.9/site-packages (from plotly->gpkit->gpfit==0.2.0) (8.0.1)

Running tests...
----------------------------------------------------------------------
adding test for 'model/jho.py'
adding test for 'model/print_perf.py'
EEEE
======================================================================
ERROR [1.047s]: test_model_jho_py_mosek_cli (gpkit.tests.from_paths.TestFiles)
----------------------------------------------------------------------
Traceback (most recent call last):
  File "/Users/jenkins/workspace/CE_gpkit_PR_research_models/buildnode/macys/optimizer/mosek/gpkit/tests/helpers.py", line 55, in test
    testfn(name, import_dict, path)(self)
  File "/Users/jenkins/workspace/CE_gpkit_PR_research_models/buildnode/macys/optimizer/mosek/gpkit/tests/from_paths.py", line 48, in <lambda>
    lambda self: getattr(self, name)()))  # pylint:disable=undefined-variable
  File "/Users/jenkins/workspace/CE_gpkit_PR_research_models/buildnode/macys/optimizer/mosek/gpkit/tests/from_paths.py", line 34, in test_fn
    mod = __import__(os.path.basename(path)[:-3])
  File "/Users/jenkins/workspace/CE_gpkit_PR_research_models/buildnode/macys/optimizer/mosek/jho/model/jho.py", line 5, in <module>
    from gpkitmodels.GP.aircraft.engine.gas_engine import Engine
  File "/Users/jenkins/workspace/CE_gpkit_PR_research_models/buildnode/macys/optimizer/mosek/gplibrary/gpkitmodels/GP/aircraft/engine/gas_engine.py", line 7, in <module>
    from gpfit.fit_constraintset import FitCS
ModuleNotFoundError: No module named 'gpfit.fit_constraintset'

======================================================================
ERROR [0.002s]: test_model_jho_py_mosek_conif (gpkit.tests.from_paths.TestFiles)
----------------------------------------------------------------------
Traceback (most recent call last):
  File "/Users/jenkins/workspace/CE_gpkit_PR_research_models/buildnode/macys/optimizer/mosek/gpkit/tests/helpers.py", line 55, in test
    testfn(name, import_dict, path)(self)
  File "/Users/jenkins/workspace/CE_gpkit_PR_research_models/buildnode/macys/optimizer/mosek/gpkit/tests/from_paths.py", line 48, in <lambda>
    lambda self: getattr(self, name)()))  # pylint:disable=undefined-variable
  File "/Users/jenkins/workspace/CE_gpkit_PR_research_models/buildnode/macys/optimizer/mosek/gpkit/tests/from_paths.py", line 34, in test_fn
    mod = __import__(os.path.basename(path)[:-3])
  File "/Users/jenkins/workspace/CE_gpkit_PR_research_models/buildnode/macys/optimizer/mosek/jho/model/jho.py", line 5, in <module>
    from gpkitmodels.GP.aircraft.engine.gas_engine import Engine
  File "/Users/jenkins/workspace/CE_gpkit_PR_research_models/buildnode/macys/optimizer/mosek/gplibrary/gpkitmodels/GP/aircraft/engine/gas_engine.py", line 7, in <module>
    from gpfit.fit_constraintset import FitCS
ModuleNotFoundError: No module named 'gpfit.fit_constraintset'

======================================================================
ERROR [0.005s]: test_model_print_perf_py_mosek_cli (gpkit.tests.from_paths.TestFiles)
----------------------------------------------------------------------
Traceback (most recent call last):
  File "/Users/jenkins/workspace/CE_gpkit_PR_research_models/buildnode/macys/optimizer/mosek/gpkit/tests/helpers.py", line 55, in test
    testfn(name, import_dict, path)(self)
  File "/Users/jenkins/workspace/CE_gpkit_PR_research_models/buildnode/macys/optimizer/mosek/gpkit/tests/from_paths.py", line 48, in <lambda>
    lambda self: getattr(self, name)()))  # pylint:disable=undefined-variable
  File "/Users/jenkins/workspace/CE_gpkit_PR_research_models/buildnode/macys/optimizer/mosek/gpkit/tests/from_paths.py", line 34, in test_fn
    mod = __import__(os.path.basename(path)[:-3])
  File "/Users/jenkins/workspace/CE_gpkit_PR_research_models/buildnode/macys/optimizer/mosek/jho/model/print_perf.py", line 4, in <module>
    from jho import Mission
  File "/Users/jenkins/workspace/CE_gpkit_PR_research_models/buildnode/macys/optimizer/mosek/jho/model/jho.py", line 5, in <module>
    from gpkitmodels.GP.aircraft.engine.gas_engine import Engine
  File "/Users/jenkins/workspace/CE_gpkit_PR_research_models/buildnode/macys/optimizer/mosek/gplibrary/gpkitmodels/GP/aircraft/engine/gas_engine.py", line 7, in <module>
    from gpfit.fit_constraintset import FitCS
ModuleNotFoundError: No module named 'gpfit.fit_constraintset'

======================================================================
ERROR [0.003s]: test_model_print_perf_py_mosek_conif (gpkit.tests.from_paths.TestFiles)
----------------------------------------------------------------------
Traceback (most recent call last):
  File "/Users/jenkins/workspace/CE_gpkit_PR_research_models/buildnode/macys/optimizer/mosek/gpkit/tests/helpers.py", line 55, in test
    testfn(name, import_dict, path)(self)
  File "/Users/jenkins/workspace/CE_gpkit_PR_research_models/buildnode/macys/optimizer/mosek/gpkit/tests/from_paths.py", line 48, in <lambda>
    lambda self: getattr(self, name)()))  # pylint:disable=undefined-variable
  File "/Users/jenkins/workspace/CE_gpkit_PR_research_models/buildnode/macys/optimizer/mosek/gpkit/tests/from_paths.py", line 34, in test_fn
    mod = __import__(os.path.basename(path)[:-3])
  File "/Users/jenkins/workspace/CE_gpkit_PR_research_models/buildnode/macys/optimizer/mosek/jho/model/print_perf.py", line 4, in <module>
    from jho import Mission
  File "/Users/jenkins/workspace/CE_gpkit_PR_research_models/buildnode/macys/optimizer/mosek/jho/model/jho.py", line 5, in <module>
    from gpkitmodels.GP.aircraft.engine.gas_engine import Engine
  File "/Users/jenkins/workspace/CE_gpkit_PR_research_models/buildnode/macys/optimizer/mosek/gplibrary/gpkitmodels/GP/aircraft/engine/gas_engine.py", line 7, in <module>
    from gpfit.fit_constraintset import FitCS
ModuleNotFoundError: No module named 'gpfit.fit_constraintset'

----------------------------------------------------------------------
Ran 4 tests in 1.058s

FAILED (errors=4)

Generating XML reports...
Cloning into 'turbofan'...
Processing /Users/jenkins/workspace/CE_gpkit_PR_research_models/buildnode/macys/optimizer/mosek/turbofan
  Preparing metadata (setup.py): started
  Preparing metadata (setup.py): finished with status 'done'
Requirement already satisfied: numpy in /Users/jenkins/workspace/CE_gpkit_PR_research_models/buildnode/macys/optimizer/mosek/venv_jenkins/lib/python3.9/site-packages (from turbofan==0.0.0.0) (1.22.2)
Requirement already satisfied: scipy in /Users/jenkins/workspace/CE_gpkit_PR_research_models/buildnode/macys/optimizer/mosek/venv_jenkins/lib/python3.9/site-packages (from turbofan==0.0.0.0) (1.8.0)
Requirement already satisfied: pint in /Users/jenkins/workspace/CE_gpkit_PR_research_models/buildnode/macys/optimizer/mosek/venv_jenkins/lib/python3.9/site-packages (from turbofan==0.0.0.0) (0.18)
Requirement already satisfied: future in /Users/jenkins/workspace/CE_gpkit_PR_research_models/buildnode/macys/optimizer/mosek/venv_jenkins/lib/python3.9/site-packages (from turbofan==0.0.0.0) (0.18.2)
Requirement already satisfied: packaging in /Users/jenkins/workspace/CE_gpkit_PR_research_models/buildnode/macys/optimizer/mosek/venv_jenkins/lib/python3.9/site-packages (from pint->turbofan==0.0.0.0) (21.3)
Requirement already satisfied: pyparsing!=3.0.5,>=2.0.2 in /Users/jenkins/workspace/CE_gpkit_PR_research_models/buildnode/macys/optimizer/mosek/venv_jenkins/lib/python3.9/site-packages (from packaging->pint->turbofan==0.0.0.0) (3.0.7)
Building wheels for collected packages: turbofan
  Building wheel for turbofan (setup.py): started
  Building wheel for turbofan (setup.py): finished with status 'done'
  Created wheel for turbofan: filename=turbofan-0.0.0.0-py3-none-any.whl size=43849 sha256=3ec2e99499f799e454b9e7f9488bd9295e47ed466257a5693e3b3fe0632c0f39
  Stored in directory: /private/var/folders/xs/_fh4l1p54zqcl6mbk4zclcfr0000gp/T/pip-ephem-wheel-cache-bxccs9nk/wheels/98/2c/a9/887c16f1cea18317ce1a881fb493f8997892fcbb9393ce1610
Successfully built turbofan
Installing collected packages: turbofan
  Attempting uninstall: turbofan
    Found existing installation: turbofan 0.0.0.0
    Uninstalling turbofan-0.0.0.0:
      Successfully uninstalled turbofan-0.0.0.0
Successfully installed turbofan-0.0.0.0

Running tests...
----------------------------------------------------------------------
adding test for 'turbofan/engine_test.py'
.Starting a sequence of GP solves
 for 43 free variables
  in 14 locally-GP constraints
  and for 244 free variables
       in 492 posynomial inequalities.

GP Solve 1
Using solver 'mosek_conif'
 for 244 free variables
  in 492 posynomial inequalities.
Solving took 0.0698 seconds.
Solved cost was 7.929e+13.

GP Solve 2
Using solver 'mosek_conif'
 for 244 free variables
  in 492 posynomial inequalities.
Solving took 0.0303 seconds.
Solved cost was 30.99.

GP Solve 3
Using solver 'mosek_conif'
 for 244 free variables
  in 492 posynomial inequalities.
Solving took 0.0279 seconds.
Solved cost was 10.15.

GP Solve 4
Using solver 'mosek_conif'
 for 244 free variables
  in 492 posynomial inequalities.
Solving took 0.0297 seconds.
Solved cost was 7.827.

GP Solve 5
Using solver 'mosek_conif'
 for 244 free variables
  in 492 posynomial inequalities.
Solving took 0.033 seconds.
Solved cost was 7.281.

GP Solve 6
Using solver 'mosek_conif'
 for 244 free variables
  in 492 posynomial inequalities.
Solving took 0.0287 seconds.
Solved cost was 7.108.

GP Solve 7
Using solver 'mosek_conif'
 for 244 free variables
  in 492 posynomial inequalities.
Solving took 0.0297 seconds.
Solved cost was 7.029.

GP Solve 8
Using solver 'mosek_conif'
 for 244 free variables
  in 492 posynomial inequalities.
Solving took 0.0273 seconds.
Solved cost was 6.991.

GP Solve 9
Using solver 'mosek_conif'
 for 244 free variables
  in 492 posynomial inequalities.
Solving took 0.0286 seconds.
Solved cost was 6.973.

GP Solve 10
Using solver 'mosek_conif'
 for 244 free variables
  in 492 posynomial inequalities.
Solving took 0.0277 seconds.
Solved cost was 6.965.

GP Solve 11
Using solver 'mosek_conif'
 for 244 free variables
  in 492 posynomial inequalities.
Solving took 0.0293 seconds.
Solved cost was 6.96.

GP Solve 12
Using solver 'mosek_conif'
 for 244 free variables
  in 492 posynomial inequalities.
Solving took 0.0291 seconds.
Solved cost was 6.958.

GP Solve 13
Using solver 'mosek_conif'
 for 244 free variables
  in 492 posynomial inequalities.
Solving took 0.0278 seconds.
Solved cost was 6.957.

Solving took 0.629 seconds and 13 GP solves.

----------------------------------------------------------------------
Ran 1 test in 0.917s

OK

Generating XML reports...
Cloning into 'solar'...
Requirement already satisfied: pandas in /Users/jenkins/workspace/CE_gpkit_PR_research_models/buildnode/macys/optimizer/mosek/venv_jenkins/lib/python3.9/site-packages (1.4.1)
Requirement already satisfied: numpy>=1.18.5 in /Users/jenkins/workspace/CE_gpkit_PR_research_models/buildnode/macys/optimizer/mosek/venv_jenkins/lib/python3.9/site-packages (from pandas) (1.22.2)
Requirement already satisfied: python-dateutil>=2.8.1 in /Users/jenkins/workspace/CE_gpkit_PR_research_models/buildnode/macys/optimizer/mosek/venv_jenkins/lib/python3.9/site-packages (from pandas) (2.8.2)
Requirement already satisfied: pytz>=2020.1 in /Users/jenkins/workspace/CE_gpkit_PR_research_models/buildnode/macys/optimizer/mosek/venv_jenkins/lib/python3.9/site-packages (from pandas) (2021.3)
Requirement already satisfied: six>=1.5 in /Users/jenkins/workspace/CE_gpkit_PR_research_models/buildnode/macys/optimizer/mosek/venv_jenkins/lib/python3.9/site-packages (from python-dateutil>=2.8.1->pandas) (1.16.0)
Collecting git+https://github.com/convexengineering/gpfit.git
  Cloning https://github.com/convexengineering/gpfit.git to /private/var/folders/xs/_fh4l1p54zqcl6mbk4zclcfr0000gp/T/pip-req-build-rpjhvb1l
  Running command git clone --filter=blob:none --quiet https://github.com/convexengineering/gpfit.git /private/var/folders/xs/_fh4l1p54zqcl6mbk4zclcfr0000gp/T/pip-req-build-rpjhvb1l
  Resolved https://github.com/convexengineering/gpfit.git to commit 3c8025f12ba5360fdeb71c270e55d4c93e1676fd
  Preparing metadata (setup.py): started
  Preparing metadata (setup.py): finished with status 'done'
Requirement already satisfied: numpy in /Users/jenkins/workspace/CE_gpkit_PR_research_models/buildnode/macys/optimizer/mosek/venv_jenkins/lib/python3.9/site-packages (from gpfit==0.2.0) (1.22.2)
Requirement already satisfied: scipy in /Users/jenkins/workspace/CE_gpkit_PR_research_models/buildnode/macys/optimizer/mosek/venv_jenkins/lib/python3.9/site-packages (from gpfit==0.2.0) (1.8.0)
Requirement already satisfied: gpkit in /Users/jenkins/workspace/CE_gpkit_PR_research_models/buildnode/macys/optimizer/mosek (from gpfit==0.2.0) (1.1.1)
Requirement already satisfied: matplotlib>=3.3.2 in /Users/jenkins/workspace/CE_gpkit_PR_research_models/buildnode/macys/optimizer/mosek/venv_jenkins/lib/python3.9/site-packages (from gpfit==0.2.0) (3.5.1)
Requirement already satisfied: pytest>=6.2.5 in /Users/jenkins/workspace/CE_gpkit_PR_research_models/buildnode/macys/optimizer/mosek/venv_jenkins/lib/python3.9/site-packages (from gpfit==0.2.0) (7.0.1)
Requirement already satisfied: pytest-mpl>=0.13 in /Users/jenkins/workspace/CE_gpkit_PR_research_models/buildnode/macys/optimizer/mosek/venv_jenkins/lib/python3.9/site-packages (from gpfit==0.2.0) (0.14.0)
Requirement already satisfied: packaging>=20.0 in /Users/jenkins/workspace/CE_gpkit_PR_research_models/buildnode/macys/optimizer/mosek/venv_jenkins/lib/python3.9/site-packages (from matplotlib>=3.3.2->gpfit==0.2.0) (21.3)
Requirement already satisfied: pyparsing>=2.2.1 in /Users/jenkins/workspace/CE_gpkit_PR_research_models/buildnode/macys/optimizer/mosek/venv_jenkins/lib/python3.9/site-packages (from matplotlib>=3.3.2->gpfit==0.2.0) (3.0.7)
Requirement already satisfied: kiwisolver>=1.0.1 in /Users/jenkins/workspace/CE_gpkit_PR_research_models/buildnode/macys/optimizer/mosek/venv_jenkins/lib/python3.9/site-packages (from matplotlib>=3.3.2->gpfit==0.2.0) (1.3.2)
Requirement already satisfied: cycler>=0.10 in /Users/jenkins/workspace/CE_gpkit_PR_research_models/buildnode/macys/optimizer/mosek/venv_jenkins/lib/python3.9/site-packages (from matplotlib>=3.3.2->gpfit==0.2.0) (0.11.0)
Requirement already satisfied: pillow>=6.2.0 in /Users/jenkins/workspace/CE_gpkit_PR_research_models/buildnode/macys/optimizer/mosek/venv_jenkins/lib/python3.9/site-packages (from matplotlib>=3.3.2->gpfit==0.2.0) (9.0.1)
Requirement already satisfied: python-dateutil>=2.7 in /Users/jenkins/workspace/CE_gpkit_PR_research_models/buildnode/macys/optimizer/mosek/venv_jenkins/lib/python3.9/site-packages (from matplotlib>=3.3.2->gpfit==0.2.0) (2.8.2)
Requirement already satisfied: fonttools>=4.22.0 in /Users/jenkins/workspace/CE_gpkit_PR_research_models/buildnode/macys/optimizer/mosek/venv_jenkins/lib/python3.9/site-packages (from matplotlib>=3.3.2->gpfit==0.2.0) (4.29.1)
Requirement already satisfied: py>=1.8.2 in /Users/jenkins/workspace/CE_gpkit_PR_research_models/buildnode/macys/optimizer/mosek/venv_jenkins/lib/python3.9/site-packages (from pytest>=6.2.5->gpfit==0.2.0) (1.11.0)
Requirement already satisfied: pluggy<2.0,>=0.12 in /Users/jenkins/workspace/CE_gpkit_PR_research_models/buildnode/macys/optimizer/mosek/venv_jenkins/lib/python3.9/site-packages (from pytest>=6.2.5->gpfit==0.2.0) (1.0.0)
Requirement already satisfied: iniconfig in /Users/jenkins/workspace/CE_gpkit_PR_research_models/buildnode/macys/optimizer/mosek/venv_jenkins/lib/python3.9/site-packages (from pytest>=6.2.5->gpfit==0.2.0) (1.1.1)
Requirement already satisfied: attrs>=19.2.0 in /Users/jenkins/workspace/CE_gpkit_PR_research_models/buildnode/macys/optimizer/mosek/venv_jenkins/lib/python3.9/site-packages (from pytest>=6.2.5->gpfit==0.2.0) (21.4.0)
Requirement already satisfied: tomli>=1.0.0 in /Users/jenkins/workspace/CE_gpkit_PR_research_models/buildnode/macys/optimizer/mosek/venv_jenkins/lib/python3.9/site-packages (from pytest>=6.2.5->gpfit==0.2.0) (2.0.1)
Requirement already satisfied: Jinja2 in /Users/jenkins/workspace/CE_gpkit_PR_research_models/buildnode/macys/optimizer/mosek/venv_jenkins/lib/python3.9/site-packages (from pytest-mpl>=0.13->gpfit==0.2.0) (3.0.3)
Requirement already satisfied: pint>=0.8.1 in /Users/jenkins/workspace/CE_gpkit_PR_research_models/buildnode/macys/optimizer/mosek/venv_jenkins/lib/python3.9/site-packages (from gpkit->gpfit==0.2.0) (0.18)
Requirement already satisfied: plotly in /Users/jenkins/workspace/CE_gpkit_PR_research_models/buildnode/macys/optimizer/mosek/venv_jenkins/lib/python3.9/site-packages (from gpkit->gpfit==0.2.0) (5.6.0)
Requirement already satisfied: adce in /Users/jenkins/workspace/CE_gpkit_PR_research_models/buildnode/macys/optimizer/mosek/venv_jenkins/lib/python3.9/site-packages (from gpkit->gpfit==0.2.0) (1.3.3.2)
Requirement already satisfied: cvxopt>=1.1.8 in /Users/jenkins/workspace/CE_gpkit_PR_research_models/buildnode/macys/optimizer/mosek/venv_jenkins/lib/python3.9/site-packages (from gpkit->gpfit==0.2.0) (1.2.7)
Requirement already satisfied: six>=1.5 in /Users/jenkins/workspace/CE_gpkit_PR_research_models/buildnode/macys/optimizer/mosek/venv_jenkins/lib/python3.9/site-packages (from python-dateutil>=2.7->matplotlib>=3.3.2->gpfit==0.2.0) (1.16.0)
Requirement already satisfied: MarkupSafe>=2.0 in /Users/jenkins/workspace/CE_gpkit_PR_research_models/buildnode/macys/optimizer/mosek/venv_jenkins/lib/python3.9/site-packages (from Jinja2->pytest-mpl>=0.13->gpfit==0.2.0) (2.1.0)
Requirement already satisfied: tenacity>=6.2.0 in /Users/jenkins/workspace/CE_gpkit_PR_research_models/buildnode/macys/optimizer/mosek/venv_jenkins/lib/python3.9/site-packages (from plotly->gpkit->gpfit==0.2.0) (8.0.1)
Collecting git+https://github.com/convexengineering/gassolar.git
  Cloning https://github.com/convexengineering/gassolar.git to /private/var/folders/xs/_fh4l1p54zqcl6mbk4zclcfr0000gp/T/pip-req-build-w_pxv7t2
  Running command git clone --filter=blob:none --quiet https://github.com/convexengineering/gassolar.git /private/var/folders/xs/_fh4l1p54zqcl6mbk4zclcfr0000gp/T/pip-req-build-w_pxv7t2
  Resolved https://github.com/convexengineering/gassolar.git to commit 90c91cc6b980b44bedaf87ad004654b67a11431c
  Preparing metadata (setup.py): started
  Preparing metadata (setup.py): finished with status 'done'
Requirement already satisfied: numpy in /Users/jenkins/workspace/CE_gpkit_PR_research_models/buildnode/macys/optimizer/mosek/venv_jenkins/lib/python3.9/site-packages (from gassolar==0.0.0.0) (1.22.2)
Requirement already satisfied: scipy in /Users/jenkins/workspace/CE_gpkit_PR_research_models/buildnode/macys/optimizer/mosek/venv_jenkins/lib/python3.9/site-packages (from gassolar==0.0.0.0) (1.8.0)
Requirement already satisfied: gpkit in /Users/jenkins/workspace/CE_gpkit_PR_research_models/buildnode/macys/optimizer/mosek (from gassolar==0.0.0.0) (1.1.1)
Requirement already satisfied: pandas in /Users/jenkins/workspace/CE_gpkit_PR_research_models/buildnode/macys/optimizer/mosek/venv_jenkins/lib/python3.9/site-packages (from gassolar==0.0.0.0) (1.4.1)
Requirement already satisfied: gpfit in /Users/jenkins/workspace/CE_gpkit_PR_research_models/buildnode/macys/optimizer/mosek/venv_jenkins/lib/python3.9/site-packages (from gassolar==0.0.0.0) (0.2.0)
Requirement already satisfied: pytest-mpl>=0.13 in /Users/jenkins/workspace/CE_gpkit_PR_research_models/buildnode/macys/optimizer/mosek/venv_jenkins/lib/python3.9/site-packages (from gpfit->gassolar==0.0.0.0) (0.14.0)
Requirement already satisfied: matplotlib>=3.3.2 in /Users/jenkins/workspace/CE_gpkit_PR_research_models/buildnode/macys/optimizer/mosek/venv_jenkins/lib/python3.9/site-packages (from gpfit->gassolar==0.0.0.0) (3.5.1)
Requirement already satisfied: pytest>=6.2.5 in /Users/jenkins/workspace/CE_gpkit_PR_research_models/buildnode/macys/optimizer/mosek/venv_jenkins/lib/python3.9/site-packages (from gpfit->gassolar==0.0.0.0) (7.0.1)
Requirement already satisfied: pint>=0.8.1 in /Users/jenkins/workspace/CE_gpkit_PR_research_models/buildnode/macys/optimizer/mosek/venv_jenkins/lib/python3.9/site-packages (from gpkit->gassolar==0.0.0.0) (0.18)
Requirement already satisfied: plotly in /Users/jenkins/workspace/CE_gpkit_PR_research_models/buildnode/macys/optimizer/mosek/venv_jenkins/lib/python3.9/site-packages (from gpkit->gassolar==0.0.0.0) (5.6.0)
Requirement already satisfied: adce in /Users/jenkins/workspace/CE_gpkit_PR_research_models/buildnode/macys/optimizer/mosek/venv_jenkins/lib/python3.9/site-packages (from gpkit->gassolar==0.0.0.0) (1.3.3.2)
Requirement already satisfied: cvxopt>=1.1.8 in /Users/jenkins/workspace/CE_gpkit_PR_research_models/buildnode/macys/optimizer/mosek/venv_jenkins/lib/python3.9/site-packages (from gpkit->gassolar==0.0.0.0) (1.2.7)
Requirement already satisfied: pytz>=2020.1 in /Users/jenkins/workspace/CE_gpkit_PR_research_models/buildnode/macys/optimizer/mosek/venv_jenkins/lib/python3.9/site-packages (from pandas->gassolar==0.0.0.0) (2021.3)
Requirement already satisfied: python-dateutil>=2.8.1 in /Users/jenkins/workspace/CE_gpkit_PR_research_models/buildnode/macys/optimizer/mosek/venv_jenkins/lib/python3.9/site-packages (from pandas->gassolar==0.0.0.0) (2.8.2)
Requirement already satisfied: fonttools>=4.22.0 in /Users/jenkins/workspace/CE_gpkit_PR_research_models/buildnode/macys/optimizer/mosek/venv_jenkins/lib/python3.9/site-packages (from matplotlib>=3.3.2->gpfit->gassolar==0.0.0.0) (4.29.1)
Requirement already satisfied: pillow>=6.2.0 in /Users/jenkins/workspace/CE_gpkit_PR_research_models/buildnode/macys/optimizer/mosek/venv_jenkins/lib/python3.9/site-packages (from matplotlib>=3.3.2->gpfit->gassolar==0.0.0.0) (9.0.1)
Requirement already satisfied: pyparsing>=2.2.1 in /Users/jenkins/workspace/CE_gpkit_PR_research_models/buildnode/macys/optimizer/mosek/venv_jenkins/lib/python3.9/site-packages (from matplotlib>=3.3.2->gpfit->gassolar==0.0.0.0) (3.0.7)
Requirement already satisfied: cycler>=0.10 in /Users/jenkins/workspace/CE_gpkit_PR_research_models/buildnode/macys/optimizer/mosek/venv_jenkins/lib/python3.9/site-packages (from matplotlib>=3.3.2->gpfit->gassolar==0.0.0.0) (0.11.0)
Requirement already satisfied: packaging>=20.0 in /Users/jenkins/workspace/CE_gpkit_PR_research_models/buildnode/macys/optimizer/mosek/venv_jenkins/lib/python3.9/site-packages (from matplotlib>=3.3.2->gpfit->gassolar==0.0.0.0) (21.3)
Requirement already satisfied: kiwisolver>=1.0.1 in /Users/jenkins/workspace/CE_gpkit_PR_research_models/buildnode/macys/optimizer/mosek/venv_jenkins/lib/python3.9/site-packages (from matplotlib>=3.3.2->gpfit->gassolar==0.0.0.0) (1.3.2)
Requirement already satisfied: iniconfig in /Users/jenkins/workspace/CE_gpkit_PR_research_models/buildnode/macys/optimizer/mosek/venv_jenkins/lib/python3.9/site-packages (from pytest>=6.2.5->gpfit->gassolar==0.0.0.0) (1.1.1)
Requirement already satisfied: pluggy<2.0,>=0.12 in /Users/jenkins/workspace/CE_gpkit_PR_research_models/buildnode/macys/optimizer/mosek/venv_jenkins/lib/python3.9/site-packages (from pytest>=6.2.5->gpfit->gassolar==0.0.0.0) (1.0.0)
Requirement already satisfied: py>=1.8.2 in /Users/jenkins/workspace/CE_gpkit_PR_research_models/buildnode/macys/optimizer/mosek/venv_jenkins/lib/python3.9/site-packages (from pytest>=6.2.5->gpfit->gassolar==0.0.0.0) (1.11.0)
Requirement already satisfied: tomli>=1.0.0 in /Users/jenkins/workspace/CE_gpkit_PR_research_models/buildnode/macys/optimizer/mosek/venv_jenkins/lib/python3.9/site-packages (from pytest>=6.2.5->gpfit->gassolar==0.0.0.0) (2.0.1)
Requirement already satisfied: attrs>=19.2.0 in /Users/jenkins/workspace/CE_gpkit_PR_research_models/buildnode/macys/optimizer/mosek/venv_jenkins/lib/python3.9/site-packages (from pytest>=6.2.5->gpfit->gassolar==0.0.0.0) (21.4.0)
Requirement already satisfied: Jinja2 in /Users/jenkins/workspace/CE_gpkit_PR_research_models/buildnode/macys/optimizer/mosek/venv_jenkins/lib/python3.9/site-packages (from pytest-mpl>=0.13->gpfit->gassolar==0.0.0.0) (3.0.3)
Requirement already satisfied: six>=1.5 in /Users/jenkins/workspace/CE_gpkit_PR_research_models/buildnode/macys/optimizer/mosek/venv_jenkins/lib/python3.9/site-packages (from python-dateutil>=2.8.1->pandas->gassolar==0.0.0.0) (1.16.0)
Requirement already satisfied: tenacity>=6.2.0 in /Users/jenkins/workspace/CE_gpkit_PR_research_models/buildnode/macys/optimizer/mosek/venv_jenkins/lib/python3.9/site-packages (from plotly->gpkit->gassolar==0.0.0.0) (8.0.1)
Requirement already satisfied: MarkupSafe>=2.0 in /Users/jenkins/workspace/CE_gpkit_PR_research_models/buildnode/macys/optimizer/mosek/venv_jenkins/lib/python3.9/site-packages (from Jinja2->pytest-mpl>=0.13->gpfit->gassolar==0.0.0.0) (2.1.0)
Processing /Users/jenkins/workspace/CE_gpkit_PR_research_models/buildnode/macys/optimizer/mosek/solar
  Preparing metadata (setup.py): started
  Preparing metadata (setup.py): finished with status 'done'
Requirement already satisfied: numpy in /Users/jenkins/workspace/CE_gpkit_PR_research_models/buildnode/macys/optimizer/mosek/venv_jenkins/lib/python3.9/site-packages (from solar==0.0.0.0) (1.22.2)
Requirement already satisfied: scipy in /Users/jenkins/workspace/CE_gpkit_PR_research_models/buildnode/macys/optimizer/mosek/venv_jenkins/lib/python3.9/site-packages (from solar==0.0.0.0) (1.8.0)
Requirement already satisfied: gpkit in /Users/jenkins/workspace/CE_gpkit_PR_research_models/buildnode/macys/optimizer/mosek (from solar==0.0.0.0) (1.1.1)
Requirement already satisfied: pandas in /Users/jenkins/workspace/CE_gpkit_PR_research_models/buildnode/macys/optimizer/mosek/venv_jenkins/lib/python3.9/site-packages (from solar==0.0.0.0) (1.4.1)
Requirement already satisfied: gpfit in /Users/jenkins/workspace/CE_gpkit_PR_research_models/buildnode/macys/optimizer/mosek/venv_jenkins/lib/python3.9/site-packages (from solar==0.0.0.0) (0.2.0)
Requirement already satisfied: gpkitmodels in /Users/jenkins/workspace/CE_gpkit_PR_research_models/buildnode/macys/optimizer/mosek/gplibrary (from solar==0.0.0.0) (0.0.0.0)
Requirement already satisfied: matplotlib>=3.3.2 in /Users/jenkins/workspace/CE_gpkit_PR_research_models/buildnode/macys/optimizer/mosek/venv_jenkins/lib/python3.9/site-packages (from gpfit->solar==0.0.0.0) (3.5.1)
Requirement already satisfied: pytest>=6.2.5 in /Users/jenkins/workspace/CE_gpkit_PR_research_models/buildnode/macys/optimizer/mosek/venv_jenkins/lib/python3.9/site-packages (from gpfit->solar==0.0.0.0) (7.0.1)
Requirement already satisfied: pytest-mpl>=0.13 in /Users/jenkins/workspace/CE_gpkit_PR_research_models/buildnode/macys/optimizer/mosek/venv_jenkins/lib/python3.9/site-packages (from gpfit->solar==0.0.0.0) (0.14.0)
Requirement already satisfied: pint>=0.8.1 in /Users/jenkins/workspace/CE_gpkit_PR_research_models/buildnode/macys/optimizer/mosek/venv_jenkins/lib/python3.9/site-packages (from gpkit->solar==0.0.0.0) (0.18)
Requirement already satisfied: plotly in /Users/jenkins/workspace/CE_gpkit_PR_research_models/buildnode/macys/optimizer/mosek/venv_jenkins/lib/python3.9/site-packages (from gpkit->solar==0.0.0.0) (5.6.0)
Requirement already satisfied: adce in /Users/jenkins/workspace/CE_gpkit_PR_research_models/buildnode/macys/optimizer/mosek/venv_jenkins/lib/python3.9/site-packages (from gpkit->solar==0.0.0.0) (1.3.3.2)
Requirement already satisfied: cvxopt>=1.1.8 in /Users/jenkins/workspace/CE_gpkit_PR_research_models/buildnode/macys/optimizer/mosek/venv_jenkins/lib/python3.9/site-packages (from gpkit->solar==0.0.0.0) (1.2.7)
Requirement already satisfied: future in /Users/jenkins/workspace/CE_gpkit_PR_research_models/buildnode/macys/optimizer/mosek/venv_jenkins/lib/python3.9/site-packages (from gpkitmodels->solar==0.0.0.0) (0.18.2)
Requirement already satisfied: pytz>=2020.1 in /Users/jenkins/workspace/CE_gpkit_PR_research_models/buildnode/macys/optimizer/mosek/venv_jenkins/lib/python3.9/site-packages (from pandas->solar==0.0.0.0) (2021.3)
Requirement already satisfied: python-dateutil>=2.8.1 in /Users/jenkins/workspace/CE_gpkit_PR_research_models/buildnode/macys/optimizer/mosek/venv_jenkins/lib/python3.9/site-packages (from pandas->solar==0.0.0.0) (2.8.2)
Requirement already satisfied: pillow>=6.2.0 in /Users/jenkins/workspace/CE_gpkit_PR_research_models/buildnode/macys/optimizer/mosek/venv_jenkins/lib/python3.9/site-packages (from matplotlib>=3.3.2->gpfit->solar==0.0.0.0) (9.0.1)
Requirement already satisfied: fonttools>=4.22.0 in /Users/jenkins/workspace/CE_gpkit_PR_research_models/buildnode/macys/optimizer/mosek/venv_jenkins/lib/python3.9/site-packages (from matplotlib>=3.3.2->gpfit->solar==0.0.0.0) (4.29.1)
Requirement already satisfied: pyparsing>=2.2.1 in /Users/jenkins/workspace/CE_gpkit_PR_research_models/buildnode/macys/optimizer/mosek/venv_jenkins/lib/python3.9/site-packages (from matplotlib>=3.3.2->gpfit->solar==0.0.0.0) (3.0.7)
Requirement already satisfied: packaging>=20.0 in /Users/jenkins/workspace/CE_gpkit_PR_research_models/buildnode/macys/optimizer/mosek/venv_jenkins/lib/python3.9/site-packages (from matplotlib>=3.3.2->gpfit->solar==0.0.0.0) (21.3)
Requirement already satisfied: cycler>=0.10 in /Users/jenkins/workspace/CE_gpkit_PR_research_models/buildnode/macys/optimizer/mosek/venv_jenkins/lib/python3.9/site-packages (from matplotlib>=3.3.2->gpfit->solar==0.0.0.0) (0.11.0)
Requirement already satisfied: kiwisolver>=1.0.1 in /Users/jenkins/workspace/CE_gpkit_PR_research_models/buildnode/macys/optimizer/mosek/venv_jenkins/lib/python3.9/site-packages (from matplotlib>=3.3.2->gpfit->solar==0.0.0.0) (1.3.2)
Requirement already satisfied: attrs>=19.2.0 in /Users/jenkins/workspace/CE_gpkit_PR_research_models/buildnode/macys/optimizer/mosek/venv_jenkins/lib/python3.9/site-packages (from pytest>=6.2.5->gpfit->solar==0.0.0.0) (21.4.0)
Requirement already satisfied: tomli>=1.0.0 in /Users/jenkins/workspace/CE_gpkit_PR_research_models/buildnode/macys/optimizer/mosek/venv_jenkins/lib/python3.9/site-packages (from pytest>=6.2.5->gpfit->solar==0.0.0.0) (2.0.1)
Requirement already satisfied: py>=1.8.2 in /Users/jenkins/workspace/CE_gpkit_PR_research_models/buildnode/macys/optimizer/mosek/venv_jenkins/lib/python3.9/site-packages (from pytest>=6.2.5->gpfit->solar==0.0.0.0) (1.11.0)
Requirement already satisfied: pluggy<2.0,>=0.12 in /Users/jenkins/workspace/CE_gpkit_PR_research_models/buildnode/macys/optimizer/mosek/venv_jenkins/lib/python3.9/site-packages (from pytest>=6.2.5->gpfit->solar==0.0.0.0) (1.0.0)
Requirement already satisfied: iniconfig in /Users/jenkins/workspace/CE_gpkit_PR_research_models/buildnode/macys/optimizer/mosek/venv_jenkins/lib/python3.9/site-packages (from pytest>=6.2.5->gpfit->solar==0.0.0.0) (1.1.1)
Requirement already satisfied: Jinja2 in /Users/jenkins/workspace/CE_gpkit_PR_research_models/buildnode/macys/optimizer/mosek/venv_jenkins/lib/python3.9/site-packages (from pytest-mpl>=0.13->gpfit->solar==0.0.0.0) (3.0.3)
Requirement already satisfied: six>=1.5 in /Users/jenkins/workspace/CE_gpkit_PR_research_models/buildnode/macys/optimizer/mosek/venv_jenkins/lib/python3.9/site-packages (from python-dateutil>=2.8.1->pandas->solar==0.0.0.0) (1.16.0)
Requirement already satisfied: tenacity>=6.2.0 in /Users/jenkins/workspace/CE_gpkit_PR_research_models/buildnode/macys/optimizer/mosek/venv_jenkins/lib/python3.9/site-packages (from plotly->gpkit->solar==0.0.0.0) (8.0.1)
Requirement already satisfied: MarkupSafe>=2.0 in /Users/jenkins/workspace/CE_gpkit_PR_research_models/buildnode/macys/optimizer/mosek/venv_jenkins/lib/python3.9/site-packages (from Jinja2->pytest-mpl>=0.13->gpfit->solar==0.0.0.0) (2.1.0)
Building wheels for collected packages: solar
  Building wheel for solar (setup.py): started
  Building wheel for solar (setup.py): finished with status 'done'
  Created wheel for solar: filename=solar-0.0.0.0-py3-none-any.whl size=14861 sha256=8169fbe1d1fd2e62806576ea9f2618843817bdb1132fb4c16e3bcac5495a46b7
  Stored in directory: /private/var/folders/xs/_fh4l1p54zqcl6mbk4zclcfr0000gp/T/pip-ephem-wheel-cache-su7q8m8r/wheels/b7/1f/57/8b908b304f4a23044ea2248b4e37221b5b493c5e1b1ab33dbd
Successfully built solar
Installing collected packages: solar
Successfully installed solar-0.0.0.0

Running tests...
----------------------------------------------------------------------
adding test for 'solar/sens_chart.py'
adding test for 'solar/season.py'
adding test for 'solar/npod_trade.py'
/Users/jenkins/workspace/CE_gpkit_PR_research_models/buildnode/macys/optimizer/mosek/solar/solar/solar.py:127: SyntaxWarning: "is not" with a literal. Did you mean "!="?
  if static.Npod is not 0:
/Users/jenkins/workspace/CE_gpkit_PR_research_models/buildnode/macys/optimizer/mosek/solar/solar/solar.py:276: SyntaxWarning: "is not" with a literal. Did you mean "!="?
  if self.Npod is not 0:
/Users/jenkins/workspace/CE_gpkit_PR_research_models/buildnode/macys/optimizer/mosek/solar/solar/solar.py:469: SyntaxWarning: "is not" with a literal. Did you mean "!="?
  if aircraft.Npod is not 0 and aircraft.Npod is not 1:
/Users/jenkins/workspace/CE_gpkit_PR_research_models/buildnode/macys/optimizer/mosek/solar/solar/solar.py:469: SyntaxWarning: "is not" with a literal. Did you mean "!="?
  if aircraft.Npod is not 0 and aircraft.Npod is not 1:
/Users/jenkins/workspace/CE_gpkit_PR_research_models/buildnode/macys/optimizer/mosek/solar/solar/solar.py:524: SyntaxWarning: "is not" with a literal. Did you mean "!="?
  if self.aircraft.Npod is not 0 and self.aircraft.Npod is not 1:
/Users/jenkins/workspace/CE_gpkit_PR_research_models/buildnode/macys/optimizer/mosek/solar/solar/solar.py:524: SyntaxWarning: "is not" with a literal. Did you mean "!="?
  if self.aircraft.Npod is not 0 and self.aircraft.Npod is not 1:
E
N=1

N=1
EEEEE
======================================================================
ERROR [0.896s]: test_solar_npod_trade_py_mosek_cli (gpkit.tests.from_paths.TestFiles)
----------------------------------------------------------------------
Traceback (most recent call last):
  File "/Users/jenkins/workspace/CE_gpkit_PR_research_models/buildnode/macys/optimizer/mosek/gpkit/tests/helpers.py", line 55, in test
    testfn(name, import_dict, path)(self)
  File "/Users/jenkins/workspace/CE_gpkit_PR_research_models/buildnode/macys/optimizer/mosek/gpkit/tests/from_paths.py", line 48, in <lambda>
    lambda self: getattr(self, name)()))  # pylint:disable=undefined-variable
  File "/Users/jenkins/workspace/CE_gpkit_PR_research_models/buildnode/macys/optimizer/mosek/gpkit/tests/from_paths.py", line 37, in test_fn
    mod.test()
  File "/Users/jenkins/workspace/CE_gpkit_PR_research_models/buildnode/macys/optimizer/mosek/solar/solar/npod_trade.py", line 91, in test
    pods(Nplot=100)
  File "/Users/jenkins/workspace/CE_gpkit_PR_research_models/buildnode/macys/optimizer/mosek/solar/solar/npod_trade.py", line 16, in pods
    from solar import Mission, Aircraft
  File "/Users/jenkins/workspace/CE_gpkit_PR_research_models/buildnode/macys/optimizer/mosek/solar/solar/solar.py", line 9, in <module>
    from ad.admath import exp
ModuleNotFoundError: No module named 'ad'

======================================================================
ERROR [0.002s]: test_solar_npod_trade_py_mosek_conif (gpkit.tests.from_paths.TestFiles)
----------------------------------------------------------------------
Traceback (most recent call last):
  File "/Users/jenkins/workspace/CE_gpkit_PR_research_models/buildnode/macys/optimizer/mosek/gpkit/tests/helpers.py", line 55, in test
    testfn(name, import_dict, path)(self)
  File "/Users/jenkins/workspace/CE_gpkit_PR_research_models/buildnode/macys/optimizer/mosek/gpkit/tests/from_paths.py", line 48, in <lambda>
    lambda self: getattr(self, name)()))  # pylint:disable=undefined-variable
  File "/Users/jenkins/workspace/CE_gpkit_PR_research_models/buildnode/macys/optimizer/mosek/gpkit/tests/from_paths.py", line 37, in test_fn
    mod.test()
  File "/Users/jenkins/workspace/CE_gpkit_PR_research_models/buildnode/macys/optimizer/mosek/solar/solar/npod_trade.py", line 91, in test
    pods(Nplot=100)
  File "/Users/jenkins/workspace/CE_gpkit_PR_research_models/buildnode/macys/optimizer/mosek/solar/solar/npod_trade.py", line 16, in pods
    from solar import Mission, Aircraft
  File "/Users/jenkins/workspace/CE_gpkit_PR_research_models/buildnode/macys/optimizer/mosek/solar/solar/solar.py", line 9, in <module>
    from ad.admath import exp
ModuleNotFoundError: No module named 'ad'

======================================================================
ERROR [0.003s]: test_solar_season_py_mosek_cli (gpkit.tests.from_paths.TestFiles)
----------------------------------------------------------------------
Traceback (most recent call last):
  File "/Users/jenkins/workspace/CE_gpkit_PR_research_models/buildnode/macys/optimizer/mosek/gpkit/tests/helpers.py", line 55, in test
    testfn(name, import_dict, path)(self)
  File "/Users/jenkins/workspace/CE_gpkit_PR_research_models/buildnode/macys/optimizer/mosek/gpkit/tests/from_paths.py", line 48, in <lambda>
    lambda self: getattr(self, name)()))  # pylint:disable=undefined-variable
  File "/Users/jenkins/workspace/CE_gpkit_PR_research_models/buildnode/macys/optimizer/mosek/gpkit/tests/from_paths.py", line 34, in test_fn
    mod = __import__(os.path.basename(path)[:-3])
  File "/Users/jenkins/workspace/CE_gpkit_PR_research_models/buildnode/macys/optimizer/mosek/solar/solar/season.py", line 6, in <module>
    from solar import Mission, Aircraft
  File "/Users/jenkins/workspace/CE_gpkit_PR_research_models/buildnode/macys/optimizer/mosek/solar/solar/solar.py", line 9, in <module>
    from ad.admath import exp
ModuleNotFoundError: No module named 'ad'

======================================================================
ERROR [0.002s]: test_solar_season_py_mosek_conif (gpkit.tests.from_paths.TestFiles)
----------------------------------------------------------------------
Traceback (most recent call last):
  File "/Users/jenkins/workspace/CE_gpkit_PR_research_models/buildnode/macys/optimizer/mosek/gpkit/tests/helpers.py", line 55, in test
    testfn(name, import_dict, path)(self)
  File "/Users/jenkins/workspace/CE_gpkit_PR_research_models/buildnode/macys/optimizer/mosek/gpkit/tests/from_paths.py", line 48, in <lambda>
    lambda self: getattr(self, name)()))  # pylint:disable=undefined-variable
  File "/Users/jenkins/workspace/CE_gpkit_PR_research_models/buildnode/macys/optimizer/mosek/gpkit/tests/from_paths.py", line 34, in test_fn
    mod = __import__(os.path.basename(path)[:-3])
  File "/Users/jenkins/workspace/CE_gpkit_PR_research_models/buildnode/macys/optimizer/mosek/solar/solar/season.py", line 6, in <module>
    from solar import Mission, Aircraft
  File "/Users/jenkins/workspace/CE_gpkit_PR_research_models/buildnode/macys/optimizer/mosek/solar/solar/solar.py", line 9, in <module>
    from ad.admath import exp
ModuleNotFoundError: No module named 'ad'

======================================================================
ERROR [0.003s]: test_solar_sens_chart_py_mosek_cli (gpkit.tests.from_paths.TestFiles)
----------------------------------------------------------------------
Traceback (most recent call last):
  File "/Users/jenkins/workspace/CE_gpkit_PR_research_models/buildnode/macys/optimizer/mosek/gpkit/tests/helpers.py", line 55, in test
    testfn(name, import_dict, path)(self)
  File "/Users/jenkins/workspace/CE_gpkit_PR_research_models/buildnode/macys/optimizer/mosek/gpkit/tests/from_paths.py", line 48, in <lambda>
    lambda self: getattr(self, name)()))  # pylint:disable=undefined-variable
  File "/Users/jenkins/workspace/CE_gpkit_PR_research_models/buildnode/macys/optimizer/mosek/gpkit/tests/from_paths.py", line 34, in test_fn
    mod = __import__(os.path.basename(path)[:-3])
  File "/Users/jenkins/workspace/CE_gpkit_PR_research_models/buildnode/macys/optimizer/mosek/solar/solar/sens_chart.py", line 7, in <module>
    from solar import Mission, Aircraft
  File "/Users/jenkins/workspace/CE_gpkit_PR_research_models/buildnode/macys/optimizer/mosek/solar/solar/solar.py", line 9, in <module>
    from ad.admath import exp
ModuleNotFoundError: No module named 'ad'

======================================================================
ERROR [0.002s]: test_solar_sens_chart_py_mosek_conif (gpkit.tests.from_paths.TestFiles)
----------------------------------------------------------------------
Traceback (most recent call last):
  File "/Users/jenkins/workspace/CE_gpkit_PR_research_models/buildnode/macys/optimizer/mosek/gpkit/tests/helpers.py", line 55, in test
    testfn(name, import_dict, path)(self)
  File "/Users/jenkins/workspace/CE_gpkit_PR_research_models/buildnode/macys/optimizer/mosek/gpkit/tests/from_paths.py", line 48, in <lambda>
    lambda self: getattr(self, name)()))  # pylint:disable=undefined-variable
  File "/Users/jenkins/workspace/CE_gpkit_PR_research_models/buildnode/macys/optimizer/mosek/gpkit/tests/from_paths.py", line 34, in test_fn
    mod = __import__(os.path.basename(path)[:-3])
  File "/Users/jenkins/workspace/CE_gpkit_PR_research_models/buildnode/macys/optimizer/mosek/solar/solar/sens_chart.py", line 7, in <module>
    from solar import Mission, Aircraft
  File "/Users/jenkins/workspace/CE_gpkit_PR_research_models/buildnode/macys/optimizer/mosek/solar/solar/solar.py", line 9, in <module>
    from ad.admath import exp
ModuleNotFoundError: No module named 'ad'

----------------------------------------------------------------------
Ran 6 tests in 0.910s

FAILED (errors=6)

Generating XML reports...
fatal: destination path 'gplibrary' already exists and is not an empty directory.
fatal: destination path 'gplibrary' already exists and is not an empty directory.
fatal: destination path 'gplibrary' already exists and is not an empty directory.
fatal: destination path 'gplibrary' already exists and is not an empty directory.
fatal: destination path 'gplibrary' already exists and is not an empty directory.
Requirement already satisfied: pandas in /Users/jenkins/workspace/CE_gpkit_PR_research_models/buildnode/macys/optimizer/mosek/venv_jenkins/lib/python3.9/site-packages (1.4.1)
Requirement already satisfied: pytz>=2020.1 in /Users/jenkins/workspace/CE_gpkit_PR_research_models/buildnode/macys/optimizer/mosek/venv_jenkins/lib/python3.9/site-packages (from pandas) (2021.3)
Requirement already satisfied: python-dateutil>=2.8.1 in /Users/jenkins/workspace/CE_gpkit_PR_research_models/buildnode/macys/optimizer/mosek/venv_jenkins/lib/python3.9/site-packages (from pandas) (2.8.2)
Requirement already satisfied: numpy>=1.18.5 in /Users/jenkins/workspace/CE_gpkit_PR_research_models/buildnode/macys/optimizer/mosek/venv_jenkins/lib/python3.9/site-packages (from pandas) (1.22.2)
Requirement already satisfied: six>=1.5 in /Users/jenkins/workspace/CE_gpkit_PR_research_models/buildnode/macys/optimizer/mosek/venv_jenkins/lib/python3.9/site-packages (from python-dateutil>=2.8.1->pandas) (1.16.0)
Collecting git+https://github.com/hoburg/gpfit.git
  Cloning https://github.com/hoburg/gpfit.git to /private/var/folders/xs/_fh4l1p54zqcl6mbk4zclcfr0000gp/T/pip-req-build-2ra4jw8e
  Running command git clone --filter=blob:none --quiet https://github.com/hoburg/gpfit.git /private/var/folders/xs/_fh4l1p54zqcl6mbk4zclcfr0000gp/T/pip-req-build-2ra4jw8e
  Resolved https://github.com/hoburg/gpfit.git to commit 3c8025f12ba5360fdeb71c270e55d4c93e1676fd
  Preparing metadata (setup.py): started
  Preparing metadata (setup.py): finished with status 'done'
Requirement already satisfied: numpy in /Users/jenkins/workspace/CE_gpkit_PR_research_models/buildnode/macys/optimizer/mosek/venv_jenkins/lib/python3.9/site-packages (from gpfit==0.2.0) (1.22.2)
Requirement already satisfied: scipy in /Users/jenkins/workspace/CE_gpkit_PR_research_models/buildnode/macys/optimizer/mosek/venv_jenkins/lib/python3.9/site-packages (from gpfit==0.2.0) (1.8.0)
Requirement already satisfied: gpkit in /Users/jenkins/workspace/CE_gpkit_PR_research_models/buildnode/macys/optimizer/mosek (from gpfit==0.2.0) (1.1.1)
Requirement already satisfied: matplotlib>=3.3.2 in /Users/jenkins/workspace/CE_gpkit_PR_research_models/buildnode/macys/optimizer/mosek/venv_jenkins/lib/python3.9/site-packages (from gpfit==0.2.0) (3.5.1)
Requirement already satisfied: pytest>=6.2.5 in /Users/jenkins/workspace/CE_gpkit_PR_research_models/buildnode/macys/optimizer/mosek/venv_jenkins/lib/python3.9/site-packages (from gpfit==0.2.0) (7.0.1)
Requirement already satisfied: pytest-mpl>=0.13 in /Users/jenkins/workspace/CE_gpkit_PR_research_models/buildnode/macys/optimizer/mosek/venv_jenkins/lib/python3.9/site-packages (from gpfit==0.2.0) (0.14.0)
Requirement already satisfied: python-dateutil>=2.7 in /Users/jenkins/workspace/CE_gpkit_PR_research_models/buildnode/macys/optimizer/mosek/venv_jenkins/lib/python3.9/site-packages (from matplotlib>=3.3.2->gpfit==0.2.0) (2.8.2)
Requirement already satisfied: cycler>=0.10 in /Users/jenkins/workspace/CE_gpkit_PR_research_models/buildnode/macys/optimizer/mosek/venv_jenkins/lib/python3.9/site-packages (from matplotlib>=3.3.2->gpfit==0.2.0) (0.11.0)
Requirement already satisfied: kiwisolver>=1.0.1 in /Users/jenkins/workspace/CE_gpkit_PR_research_models/buildnode/macys/optimizer/mosek/venv_jenkins/lib/python3.9/site-packages (from matplotlib>=3.3.2->gpfit==0.2.0) (1.3.2)
Requirement already satisfied: pillow>=6.2.0 in /Users/jenkins/workspace/CE_gpkit_PR_research_models/buildnode/macys/optimizer/mosek/venv_jenkins/lib/python3.9/site-packages (from matplotlib>=3.3.2->gpfit==0.2.0) (9.0.1)
Requirement already satisfied: fonttools>=4.22.0 in /Users/jenkins/workspace/CE_gpkit_PR_research_models/buildnode/macys/optimizer/mosek/venv_jenkins/lib/python3.9/site-packages (from matplotlib>=3.3.2->gpfit==0.2.0) (4.29.1)
Requirement already satisfied: pyparsing>=2.2.1 in /Users/jenkins/workspace/CE_gpkit_PR_research_models/buildnode/macys/optimizer/mosek/venv_jenkins/lib/python3.9/site-packages (from matplotlib>=3.3.2->gpfit==0.2.0) (3.0.7)
Requirement already satisfied: packaging>=20.0 in /Users/jenkins/workspace/CE_gpkit_PR_research_models/buildnode/macys/optimizer/mosek/venv_jenkins/lib/python3.9/site-packages (from matplotlib>=3.3.2->gpfit==0.2.0) (21.3)
Requirement already satisfied: attrs>=19.2.0 in /Users/jenkins/workspace/CE_gpkit_PR_research_models/buildnode/macys/optimizer/mosek/venv_jenkins/lib/python3.9/site-packages (from pytest>=6.2.5->gpfit==0.2.0) (21.4.0)
Requirement already satisfied: pluggy<2.0,>=0.12 in /Users/jenkins/workspace/CE_gpkit_PR_research_models/buildnode/macys/optimizer/mosek/venv_jenkins/lib/python3.9/site-packages (from pytest>=6.2.5->gpfit==0.2.0) (1.0.0)
Requirement already satisfied: tomli>=1.0.0 in /Users/jenkins/workspace/CE_gpkit_PR_research_models/buildnode/macys/optimizer/mosek/venv_jenkins/lib/python3.9/site-packages (from pytest>=6.2.5->gpfit==0.2.0) (2.0.1)
Requirement already satisfied: py>=1.8.2 in /Users/jenkins/workspace/CE_gpkit_PR_research_models/buildnode/macys/optimizer/mosek/venv_jenkins/lib/python3.9/site-packages (from pytest>=6.2.5->gpfit==0.2.0) (1.11.0)
Requirement already satisfied: iniconfig in /Users/jenkins/workspace/CE_gpkit_PR_research_models/buildnode/macys/optimizer/mosek/venv_jenkins/lib/python3.9/site-packages (from pytest>=6.2.5->gpfit==0.2.0) (1.1.1)
Requirement already satisfied: Jinja2 in /Users/jenkins/workspace/CE_gpkit_PR_research_models/buildnode/macys/optimizer/mosek/venv_jenkins/lib/python3.9/site-packages (from pytest-mpl>=0.13->gpfit==0.2.0) (3.0.3)
Requirement already satisfied: pint>=0.8.1 in /Users/jenkins/workspace/CE_gpkit_PR_research_models/buildnode/macys/optimizer/mosek/venv_jenkins/lib/python3.9/site-packages (from gpkit->gpfit==0.2.0) (0.18)
Requirement already satisfied: plotly in /Users/jenkins/workspace/CE_gpkit_PR_research_models/buildnode/macys/optimizer/mosek/venv_jenkins/lib/python3.9/site-packages (from gpkit->gpfit==0.2.0) (5.6.0)
Requirement already satisfied: adce in /Users/jenkins/workspace/CE_gpkit_PR_research_models/buildnode/macys/optimizer/mosek/venv_jenkins/lib/python3.9/site-packages (from gpkit->gpfit==0.2.0) (1.3.3.2)
Requirement already satisfied: cvxopt>=1.1.8 in /Users/jenkins/workspace/CE_gpkit_PR_research_models/buildnode/macys/optimizer/mosek/venv_jenkins/lib/python3.9/site-packages (from gpkit->gpfit==0.2.0) (1.2.7)
Requirement already satisfied: six>=1.5 in /Users/jenkins/workspace/CE_gpkit_PR_research_models/buildnode/macys/optimizer/mosek/venv_jenkins/lib/python3.9/site-packages (from python-dateutil>=2.7->matplotlib>=3.3.2->gpfit==0.2.0) (1.16.0)
Requirement already satisfied: MarkupSafe>=2.0 in /Users/jenkins/workspace/CE_gpkit_PR_research_models/buildnode/macys/optimizer/mosek/venv_jenkins/lib/python3.9/site-packages (from Jinja2->pytest-mpl>=0.13->gpfit==0.2.0) (2.1.0)
Requirement already satisfied: tenacity>=6.2.0 in /Users/jenkins/workspace/CE_gpkit_PR_research_models/buildnode/macys/optimizer/mosek/venv_jenkins/lib/python3.9/site-packages (from plotly->gpkit->gpfit==0.2.0) (8.0.1)
Processing /Users/jenkins/workspace/CE_gpkit_PR_research_models/buildnode/macys/optimizer/mosek/gplibrary
  Preparing metadata (setup.py): started
  Preparing metadata (setup.py): finished with status 'done'
Requirement already satisfied: numpy>=1.12 in /Users/jenkins/workspace/CE_gpkit_PR_research_models/buildnode/macys/optimizer/mosek/venv_jenkins/lib/python3.9/site-packages (from gpkitmodels==0.0.0.0) (1.22.2)
Requirement already satisfied: scipy in /Users/jenkins/workspace/CE_gpkit_PR_research_models/buildnode/macys/optimizer/mosek/venv_jenkins/lib/python3.9/site-packages (from gpkitmodels==0.0.0.0) (1.8.0)
Requirement already satisfied: pint in /Users/jenkins/workspace/CE_gpkit_PR_research_models/buildnode/macys/optimizer/mosek/venv_jenkins/lib/python3.9/site-packages (from gpkitmodels==0.0.0.0) (0.18)
Requirement already satisfied: future in /Users/jenkins/workspace/CE_gpkit_PR_research_models/buildnode/macys/optimizer/mosek/venv_jenkins/lib/python3.9/site-packages (from gpkitmodels==0.0.0.0) (0.18.2)
Requirement already satisfied: packaging in /Users/jenkins/workspace/CE_gpkit_PR_research_models/buildnode/macys/optimizer/mosek/venv_jenkins/lib/python3.9/site-packages (from pint->gpkitmodels==0.0.0.0) (21.3)
Requirement already satisfied: pyparsing!=3.0.5,>=2.0.2 in /Users/jenkins/workspace/CE_gpkit_PR_research_models/buildnode/macys/optimizer/mosek/venv_jenkins/lib/python3.9/site-packages (from packaging->pint->gpkitmodels==0.0.0.0) (3.0.7)
Building wheels for collected packages: gpkitmodels
  Building wheel for gpkitmodels (setup.py): started
  Building wheel for gpkitmodels (setup.py): finished with status 'done'
  Created wheel for gpkitmodels: filename=gpkitmodels-0.0.0.0-py3-none-any.whl size=66171 sha256=428845b66a6b91cdf5319bee9fcabf501392a3ef7bf08c1e10d77d59e5b77453
  Stored in directory: /private/var/folders/xs/_fh4l1p54zqcl6mbk4zclcfr0000gp/T/pip-ephem-wheel-cache-r4anr9tt/wheels/ab/f3/a2/7adc7f6ceccf66a90733309e32b32c6c484eb0e0ef0b85f1ca
Successfully built gpkitmodels
Installing collected packages: gpkitmodels
  Attempting uninstall: gpkitmodels
    Found existing installation: gpkitmodels 0.0.0.0
    Uninstalling gpkitmodels-0.0.0.0:
      Successfully uninstalled gpkitmodels-0.0.0.0
Successfully installed gpkitmodels-0.0.0.0

Running tests...
----------------------------------------------------------------------
adding test for 'gpkitmodels/GP/aircraft/wing/wing_test.py'
adding test for 'gpkitmodels/GP/aircraft/tail/tail_tests.py'
adding test for 'gpkitmodels/GP/aircraft/fuselage/test_fuselage.py'
adding test for 'gpkitmodels/GP/aircraft/prop/prop_test.py'
adding test for 'gpkitmodels/GP/aircraft/motor/motor_test.py'
adding test for 'gpkitmodels/SP/SimPleAC/SimPleAC.py'
adding test for 'gpkitmodels/SP/SimPleAC/SimPleAC_mission.py'
adding test for 'gpkitmodels/SP/SimPleAC/SimPleAC_multimission.py'
EEEEEEEEEE/Users/jenkins/workspace/CE_gpkit_PR_research_models/buildnode/macys/optimizer/mosek/gpkit/constraints/sgp.py:177: UserWarning: SGP not convergent: Cost rose by 6.1% (1588.61 to 1685.18) on GP solve 2. Details can be found in `m.program.results` or by solving at a higher verbosity. Note convergence is not guaranteed for models with SignomialEqualities.
  pywarnings.warn(
./Users/jenkins/workspace/CE_gpkit_PR_research_models/buildnode/macys/optimizer/mosek/gpkit/constraints/sgp.py:177: UserWarning: SGP not convergent: Cost rose by 6.1% (1588.61 to 1685.18) on GP solve 2. Details can be found in `m.program.results` or by solving at a higher verbosity. Note convergence is not guaranteed for models with SignomialEqualities.
  pywarnings.warn(
./Users/jenkins/workspace/CE_gpkit_PR_research_models/buildnode/macys/optimizer/mosek/gpkit/constraints/sgp.py:177: UserWarning: SGP not convergent: Cost rose by 25% (3053.31 to 3816.15) on GP solve 2. Details can be found in `m.program.results` or by solving at a higher verbosity. Note convergence is not guaranteed for models with SignomialEqualities.
  pywarnings.warn(
/Users/jenkins/workspace/CE_gpkit_PR_research_models/buildnode/macys/optimizer/mosek/gpkit/constraints/sgp.py:177: UserWarning: SGP not convergent: Cost rose by 0.32% (3808.98 to 3821.21) on GP solve 4. Details can be found in `m.program.results` or by solving at a higher verbosity. Note convergence is not guaranteed for models with SignomialEqualities.
  pywarnings.warn(
./Users/jenkins/workspace/CE_gpkit_PR_research_models/buildnode/macys/optimizer/mosek/gpkit/constraints/sgp.py:177: UserWarning: SGP not convergent: Cost rose by 25% (3053.31 to 3816.14) on GP solve 2. Details can be found in `m.program.results` or by solving at a higher verbosity. Note convergence is not guaranteed for models with SignomialEqualities.
  pywarnings.warn(
/Users/jenkins/workspace/CE_gpkit_PR_research_models/buildnode/macys/optimizer/mosek/gpkit/constraints/sgp.py:177: UserWarning: SGP not convergent: Cost rose by 0.32% (3808.98 to 3821.21) on GP solve 4. Details can be found in `m.program.results` or by solving at a higher verbosity. Note convergence is not guaranteed for models with SignomialEqualities.
  pywarnings.warn(
...Starting a sequence of GP solves
 for 4 free variables
  in 1 locally-GP constraints
  and for 21 free variables
       in 22 posynomial inequalities.

GP Solve 1
Using solver 'mosek_cli'
 for 21 free variables
  in 22 posynomial inequalities.
Solving took 0.0367 seconds.
Solved cost was 5717.

GP Solve 2
Using solver 'mosek_cli'
 for 21 free variables
  in 22 posynomial inequalities.
Solving took 0.0353 seconds.
Solved cost was 4538.

GP Solve 3
Using solver 'mosek_cli'
 for 21 free variables
  in 22 posynomial inequalities.
Solving took 0.0462 seconds.
Solved cost was 4536.

GP Solve 4
Using solver 'mosek_cli'
 for 21 free variables
  in 22 posynomial inequalities.
Solving took 0.0359 seconds.
Solved cost was 4536.

Solving took 0.166 seconds and 4 GP solves.
Starting a sequence of GP solves
 for 4 free variables
  in 1 locally-GP constraints
  and for 21 free variables
       in 22 posynomial inequalities.

GP Solve 1
Using solver 'mosek_conif'
 for 21 free variables
  in 22 posynomial inequalities.
Solving took 0.0189 seconds.
Solved cost was 5717.

GP Solve 2
Using solver 'mosek_conif'
 for 21 free variables
  in 22 posynomial inequalities.
Solving took 0.0182 seconds.
Solved cost was 4538.

GP Solve 3
Using solver 'mosek_conif'
 for 21 free variables
  in 22 posynomial inequalities.
Solving took 0.0148 seconds.
Solved cost was 4536.

GP Solve 4
Using solver 'mosek_conif'
 for 21 free variables
  in 22 posynomial inequalities.
Solving took 0.0203 seconds.
Solved cost was 4536.

Solving took 0.0769 seconds and 4 GP solves.

======================================================================
ERROR [0.036s]: test_gpkitmodels_GP_aircraft_fuselage_test_fuselage_py_mosek_cli (gpkit.tests.from_paths.TestFiles)
----------------------------------------------------------------------
Traceback (most recent call last):
  File "/Users/jenkins/workspace/CE_gpkit_PR_research_models/buildnode/macys/optimizer/mosek/gpkit/tests/helpers.py", line 55, in test
    testfn(name, import_dict, path)(self)
  File "/Users/jenkins/workspace/CE_gpkit_PR_research_models/buildnode/macys/optimizer/mosek/gpkit/tests/from_paths.py", line 48, in <lambda>
    lambda self: getattr(self, name)()))  # pylint:disable=undefined-variable
  File "/Users/jenkins/workspace/CE_gpkit_PR_research_models/buildnode/macys/optimizer/mosek/gpkit/tests/from_paths.py", line 34, in test_fn
    mod = __import__(os.path.basename(path)[:-3])
  File "/Users/jenkins/workspace/CE_gpkit_PR_research_models/buildnode/macys/optimizer/mosek/gplibrary/gpkitmodels/GP/aircraft/fuselage/test_fuselage.py", line 3, in <module>
    from gpkitmodels.GP.aircraft.wing.wing_test import FlightState
  File "/Users/jenkins/workspace/CE_gpkit_PR_research_models/buildnode/macys/optimizer/mosek/venv_jenkins/lib/python3.9/site-packages/gpkitmodels/GP/aircraft/wing/wing_test.py", line 2, in <module>
    from gpkitmodels.GP.aircraft.wing.wing import Wing
  File "/Users/jenkins/workspace/CE_gpkit_PR_research_models/buildnode/macys/optimizer/mosek/venv_jenkins/lib/python3.9/site-packages/gpkitmodels/GP/aircraft/wing/wing.py", line 10, in <module>
    from .capspar import CapSpar
  File "/Users/jenkins/workspace/CE_gpkit_PR_research_models/buildnode/macys/optimizer/mosek/venv_jenkins/lib/python3.9/site-packages/gpkitmodels/GP/aircraft/wing/capspar.py", line 4, in <module>
    from .gustloading import GustL
  File "/Users/jenkins/workspace/CE_gpkit_PR_research_models/buildnode/macys/optimizer/mosek/venv_jenkins/lib/python3.9/site-packages/gpkitmodels/GP/aircraft/wing/gustloading.py", line 4, in <module>
    from ad.admath import cos
ModuleNotFoundError: No module named 'ad'

======================================================================
ERROR [0.003s]: test_gpkitmodels_GP_aircraft_fuselage_test_fuselage_py_mosek_conif (gpkit.tests.from_paths.TestFiles)
----------------------------------------------------------------------
Traceback (most recent call last):
  File "/Users/jenkins/workspace/CE_gpkit_PR_research_models/buildnode/macys/optimizer/mosek/gpkit/tests/helpers.py", line 55, in test
    testfn(name, import_dict, path)(self)
  File "/Users/jenkins/workspace/CE_gpkit_PR_research_models/buildnode/macys/optimizer/mosek/gpkit/tests/from_paths.py", line 48, in <lambda>
    lambda self: getattr(self, name)()))  # pylint:disable=undefined-variable
  File "/Users/jenkins/workspace/CE_gpkit_PR_research_models/buildnode/macys/optimizer/mosek/gpkit/tests/from_paths.py", line 34, in test_fn
    mod = __import__(os.path.basename(path)[:-3])
  File "/Users/jenkins/workspace/CE_gpkit_PR_research_models/buildnode/macys/optimizer/mosek/gplibrary/gpkitmodels/GP/aircraft/fuselage/test_fuselage.py", line 3, in <module>
    from gpkitmodels.GP.aircraft.wing.wing_test import FlightState
  File "/Users/jenkins/workspace/CE_gpkit_PR_research_models/buildnode/macys/optimizer/mosek/venv_jenkins/lib/python3.9/site-packages/gpkitmodels/GP/aircraft/wing/wing_test.py", line 2, in <module>
    from gpkitmodels.GP.aircraft.wing.wing import Wing
  File "/Users/jenkins/workspace/CE_gpkit_PR_research_models/buildnode/macys/optimizer/mosek/venv_jenkins/lib/python3.9/site-packages/gpkitmodels/GP/aircraft/wing/wing.py", line 10, in <module>
    from .capspar import CapSpar
  File "/Users/jenkins/workspace/CE_gpkit_PR_research_models/buildnode/macys/optimizer/mosek/venv_jenkins/lib/python3.9/site-packages/gpkitmodels/GP/aircraft/wing/capspar.py", line 4, in <module>
    from .gustloading import GustL
  File "/Users/jenkins/workspace/CE_gpkit_PR_research_models/buildnode/macys/optimizer/mosek/venv_jenkins/lib/python3.9/site-packages/gpkitmodels/GP/aircraft/wing/gustloading.py", line 4, in <module>
    from ad.admath import cos
ModuleNotFoundError: No module named 'ad'

======================================================================
ERROR [0.947s]: test_gpkitmodels_GP_aircraft_motor_motor_test_py_mosek_cli (gpkit.tests.from_paths.TestFiles)
----------------------------------------------------------------------
Traceback (most recent call last):
  File "/Users/jenkins/workspace/CE_gpkit_PR_research_models/buildnode/macys/optimizer/mosek/gpkit/tests/helpers.py", line 55, in test
    testfn(name, import_dict, path)(self)
  File "/Users/jenkins/workspace/CE_gpkit_PR_research_models/buildnode/macys/optimizer/mosek/gpkit/tests/from_paths.py", line 48, in <lambda>
    lambda self: getattr(self, name)()))  # pylint:disable=undefined-variable
  File "/Users/jenkins/workspace/CE_gpkit_PR_research_models/buildnode/macys/optimizer/mosek/gpkit/tests/from_paths.py", line 34, in test_fn
    mod = __import__(os.path.basename(path)[:-3])
  File "/Users/jenkins/workspace/CE_gpkit_PR_research_models/buildnode/macys/optimizer/mosek/gplibrary/gpkitmodels/GP/aircraft/motor/motor_test.py", line 2, in <module>
    from gpkitmodels.GP.aircraft.motor.motor import Propulsor, Motor, MotorPerf
  File "/Users/jenkins/workspace/CE_gpkit_PR_research_models/buildnode/macys/optimizer/mosek/venv_jenkins/lib/python3.9/site-packages/gpkitmodels/GP/aircraft/motor/motor.py", line 4, in <module>
    from gpkitmodels.GP.aircraft.prop.propeller import Propeller, ActuatorProp
  File "/Users/jenkins/workspace/CE_gpkit_PR_research_models/buildnode/macys/optimizer/mosek/venv_jenkins/lib/python3.9/site-packages/gpkitmodels/GP/aircraft/prop/propeller.py", line 5, in <module>
    from gpfit.fit_constraintset import XfoilFit
ModuleNotFoundError: No module named 'gpfit.fit_constraintset'

======================================================================
ERROR [0.002s]: test_gpkitmodels_GP_aircraft_motor_motor_test_py_mosek_conif (gpkit.tests.from_paths.TestFiles)
----------------------------------------------------------------------
Traceback (most recent call last):
  File "/Users/jenkins/workspace/CE_gpkit_PR_research_models/buildnode/macys/optimizer/mosek/gpkit/tests/helpers.py", line 55, in test
    testfn(name, import_dict, path)(self)
  File "/Users/jenkins/workspace/CE_gpkit_PR_research_models/buildnode/macys/optimizer/mosek/gpkit/tests/from_paths.py", line 48, in <lambda>
    lambda self: getattr(self, name)()))  # pylint:disable=undefined-variable
  File "/Users/jenkins/workspace/CE_gpkit_PR_research_models/buildnode/macys/optimizer/mosek/gpkit/tests/from_paths.py", line 34, in test_fn
    mod = __import__(os.path.basename(path)[:-3])
  File "/Users/jenkins/workspace/CE_gpkit_PR_research_models/buildnode/macys/optimizer/mosek/gplibrary/gpkitmodels/GP/aircraft/motor/motor_test.py", line 2, in <module>
    from gpkitmodels.GP.aircraft.motor.motor import Propulsor, Motor, MotorPerf
  File "/Users/jenkins/workspace/CE_gpkit_PR_research_models/buildnode/macys/optimizer/mosek/venv_jenkins/lib/python3.9/site-packages/gpkitmodels/GP/aircraft/motor/motor.py", line 4, in <module>
    from gpkitmodels.GP.aircraft.prop.propeller import Propeller, ActuatorProp
  File "/Users/jenkins/workspace/CE_gpkit_PR_research_models/buildnode/macys/optimizer/mosek/venv_jenkins/lib/python3.9/site-packages/gpkitmodels/GP/aircraft/prop/propeller.py", line 5, in <module>
    from gpfit.fit_constraintset import XfoilFit
ModuleNotFoundError: No module named 'gpfit.fit_constraintset'

======================================================================
ERROR [0.003s]: test_gpkitmodels_GP_aircraft_prop_prop_test_py_mosek_cli (gpkit.tests.from_paths.TestFiles)
----------------------------------------------------------------------
Traceback (most recent call last):
  File "/Users/jenkins/workspace/CE_gpkit_PR_research_models/buildnode/macys/optimizer/mosek/gpkit/tests/helpers.py", line 55, in test
    testfn(name, import_dict, path)(self)
  File "/Users/jenkins/workspace/CE_gpkit_PR_research_models/buildnode/macys/optimizer/mosek/gpkit/tests/from_paths.py", line 48, in <lambda>
    lambda self: getattr(self, name)()))  # pylint:disable=undefined-variable
  File "/Users/jenkins/workspace/CE_gpkit_PR_research_models/buildnode/macys/optimizer/mosek/gpkit/tests/from_paths.py", line 34, in test_fn
    mod = __import__(os.path.basename(path)[:-3])
  File "/Users/jenkins/workspace/CE_gpkit_PR_research_models/buildnode/macys/optimizer/mosek/gplibrary/gpkitmodels/GP/aircraft/prop/prop_test.py", line 2, in <module>
    from gpkitmodels.GP.aircraft.prop.propeller import Propeller, ActuatorProp
  File "/Users/jenkins/workspace/CE_gpkit_PR_research_models/buildnode/macys/optimizer/mosek/venv_jenkins/lib/python3.9/site-packages/gpkitmodels/GP/aircraft/prop/propeller.py", line 5, in <module>
    from gpfit.fit_constraintset import XfoilFit
ModuleNotFoundError: No module named 'gpfit.fit_constraintset'

======================================================================
ERROR [0.002s]: test_gpkitmodels_GP_aircraft_prop_prop_test_py_mosek_conif (gpkit.tests.from_paths.TestFiles)
----------------------------------------------------------------------
Traceback (most recent call last):
  File "/Users/jenkins/workspace/CE_gpkit_PR_research_models/buildnode/macys/optimizer/mosek/gpkit/tests/helpers.py", line 55, in test
    testfn(name, import_dict, path)(self)
  File "/Users/jenkins/workspace/CE_gpkit_PR_research_models/buildnode/macys/optimizer/mosek/gpkit/tests/from_paths.py", line 48, in <lambda>
    lambda self: getattr(self, name)()))  # pylint:disable=undefined-variable
  File "/Users/jenkins/workspace/CE_gpkit_PR_research_models/buildnode/macys/optimizer/mosek/gpkit/tests/from_paths.py", line 34, in test_fn
    mod = __import__(os.path.basename(path)[:-3])
  File "/Users/jenkins/workspace/CE_gpkit_PR_research_models/buildnode/macys/optimizer/mosek/gplibrary/gpkitmodels/GP/aircraft/prop/prop_test.py", line 2, in <module>
    from gpkitmodels.GP.aircraft.prop.propeller import Propeller, ActuatorProp
  File "/Users/jenkins/workspace/CE_gpkit_PR_research_models/buildnode/macys/optimizer/mosek/venv_jenkins/lib/python3.9/site-packages/gpkitmodels/GP/aircraft/prop/propeller.py", line 5, in <module>
    from gpfit.fit_constraintset import XfoilFit
ModuleNotFoundError: No module named 'gpfit.fit_constraintset'

======================================================================
ERROR [0.005s]: test_gpkitmodels_GP_aircraft_tail_tail_tests_py_mosek_cli (gpkit.tests.from_paths.TestFiles)
----------------------------------------------------------------------
Traceback (most recent call last):
  File "/Users/jenkins/workspace/CE_gpkit_PR_research_models/buildnode/macys/optimizer/mosek/gpkit/tests/helpers.py", line 55, in test
    testfn(name, import_dict, path)(self)
  File "/Users/jenkins/workspace/CE_gpkit_PR_research_models/buildnode/macys/optimizer/mosek/gpkit/tests/from_paths.py", line 48, in <lambda>
    lambda self: getattr(self, name)()))  # pylint:disable=undefined-variable
  File "/Users/jenkins/workspace/CE_gpkit_PR_research_models/buildnode/macys/optimizer/mosek/gpkit/tests/from_paths.py", line 34, in test_fn
    mod = __import__(os.path.basename(path)[:-3])
  File "/Users/jenkins/workspace/CE_gpkit_PR_research_models/buildnode/macys/optimizer/mosek/gplibrary/gpkitmodels/GP/aircraft/tail/tail_tests.py", line 2, in <module>
    from gpkitmodels.GP.aircraft.tail.horizontal_tail import HorizontalTail
  File "/Users/jenkins/workspace/CE_gpkit_PR_research_models/buildnode/macys/optimizer/mosek/venv_jenkins/lib/python3.9/site-packages/gpkitmodels/GP/aircraft/tail/horizontal_tail.py", line 4, in <module>
    from .tail_aero import TailAero
  File "/Users/jenkins/workspace/CE_gpkit_PR_research_models/buildnode/macys/optimizer/mosek/venv_jenkins/lib/python3.9/site-packages/gpkitmodels/GP/aircraft/tail/tail_aero.py", line 5, in <module>
    from gpfit.fit_constraintset import XfoilFit
ModuleNotFoundError: No module named 'gpfit.fit_constraintset'

======================================================================
ERROR [0.002s]: test_gpkitmodels_GP_aircraft_tail_tail_tests_py_mosek_conif (gpkit.tests.from_paths.TestFiles)
----------------------------------------------------------------------
Traceback (most recent call last):
  File "/Users/jenkins/workspace/CE_gpkit_PR_research_models/buildnode/macys/optimizer/mosek/gpkit/tests/helpers.py", line 55, in test
    testfn(name, import_dict, path)(self)
  File "/Users/jenkins/workspace/CE_gpkit_PR_research_models/buildnode/macys/optimizer/mosek/gpkit/tests/from_paths.py", line 48, in <lambda>
    lambda self: getattr(self, name)()))  # pylint:disable=undefined-variable
  File "/Users/jenkins/workspace/CE_gpkit_PR_research_models/buildnode/macys/optimizer/mosek/gpkit/tests/from_paths.py", line 34, in test_fn
    mod = __import__(os.path.basename(path)[:-3])
  File "/Users/jenkins/workspace/CE_gpkit_PR_research_models/buildnode/macys/optimizer/mosek/gplibrary/gpkitmodels/GP/aircraft/tail/tail_tests.py", line 2, in <module>
    from gpkitmodels.GP.aircraft.tail.horizontal_tail import HorizontalTail
  File "/Users/jenkins/workspace/CE_gpkit_PR_research_models/buildnode/macys/optimizer/mosek/venv_jenkins/lib/python3.9/site-packages/gpkitmodels/GP/aircraft/tail/horizontal_tail.py", line 4, in <module>
    from .tail_aero import TailAero
  File "/Users/jenkins/workspace/CE_gpkit_PR_research_models/buildnode/macys/optimizer/mosek/venv_jenkins/lib/python3.9/site-packages/gpkitmodels/GP/aircraft/tail/tail_aero.py", line 5, in <module>
    from gpfit.fit_constraintset import XfoilFit
ModuleNotFoundError: No module named 'gpfit.fit_constraintset'

======================================================================
ERROR [0.004s]: test_gpkitmodels_GP_aircraft_wing_wing_test_py_mosek_cli (gpkit.tests.from_paths.TestFiles)
----------------------------------------------------------------------
Traceback (most recent call last):
  File "/Users/jenkins/workspace/CE_gpkit_PR_research_models/buildnode/macys/optimizer/mosek/gpkit/tests/helpers.py", line 55, in test
    testfn(name, import_dict, path)(self)
  File "/Users/jenkins/workspace/CE_gpkit_PR_research_models/buildnode/macys/optimizer/mosek/gpkit/tests/from_paths.py", line 48, in <lambda>
    lambda self: getattr(self, name)()))  # pylint:disable=undefined-variable
  File "/Users/jenkins/workspace/CE_gpkit_PR_research_models/buildnode/macys/optimizer/mosek/gpkit/tests/from_paths.py", line 34, in test_fn
    mod = __import__(os.path.basename(path)[:-3])
  File "/Users/jenkins/workspace/CE_gpkit_PR_research_models/buildnode/macys/optimizer/mosek/gplibrary/gpkitmodels/GP/aircraft/wing/wing_test.py", line 2, in <module>
    from gpkitmodels.GP.aircraft.wing.wing import Wing
  File "/Users/jenkins/workspace/CE_gpkit_PR_research_models/buildnode/macys/optimizer/mosek/venv_jenkins/lib/python3.9/site-packages/gpkitmodels/GP/aircraft/wing/wing.py", line 10, in <module>
    from .capspar import CapSpar
  File "/Users/jenkins/workspace/CE_gpkit_PR_research_models/buildnode/macys/optimizer/mosek/venv_jenkins/lib/python3.9/site-packages/gpkitmodels/GP/aircraft/wing/capspar.py", line 4, in <module>
    from .gustloading import GustL
  File "/Users/jenkins/workspace/CE_gpkit_PR_research_models/buildnode/macys/optimizer/mosek/venv_jenkins/lib/python3.9/site-packages/gpkitmodels/GP/aircraft/wing/gustloading.py", line 4, in <module>
    from ad.admath import cos
ModuleNotFoundError: No module named 'ad'

======================================================================
ERROR [0.003s]: test_gpkitmodels_GP_aircraft_wing_wing_test_py_mosek_conif (gpkit.tests.from_paths.TestFiles)
----------------------------------------------------------------------
Traceback (most recent call last):
  File "/Users/jenkins/workspace/CE_gpkit_PR_research_models/buildnode/macys/optimizer/mosek/gpkit/tests/helpers.py", line 55, in test
    testfn(name, import_dict, path)(self)
  File "/Users/jenkins/workspace/CE_gpkit_PR_research_models/buildnode/macys/optimizer/mosek/gpkit/tests/from_paths.py", line 48, in <lambda>
    lambda self: getattr(self, name)()))  # pylint:disable=undefined-variable
  File "/Users/jenkins/workspace/CE_gpkit_PR_research_models/buildnode/macys/optimizer/mosek/gpkit/tests/from_paths.py", line 34, in test_fn
    mod = __import__(os.path.basename(path)[:-3])
  File "/Users/jenkins/workspace/CE_gpkit_PR_research_models/buildnode/macys/optimizer/mosek/gplibrary/gpkitmodels/GP/aircraft/wing/wing_test.py", line 2, in <module>
    from gpkitmodels.GP.aircraft.wing.wing import Wing
  File "/Users/jenkins/workspace/CE_gpkit_PR_research_models/buildnode/macys/optimizer/mosek/venv_jenkins/lib/python3.9/site-packages/gpkitmodels/GP/aircraft/wing/wing.py", line 10, in <module>
    from .capspar import CapSpar
  File "/Users/jenkins/workspace/CE_gpkit_PR_research_models/buildnode/macys/optimizer/mosek/venv_jenkins/lib/python3.9/site-packages/gpkitmodels/GP/aircraft/wing/capspar.py", line 4, in <module>
    from .gustloading import GustL
  File "/Users/jenkins/workspace/CE_gpkit_PR_research_models/buildnode/macys/optimizer/mosek/venv_jenkins/lib/python3.9/site-packages/gpkitmodels/GP/aircraft/wing/gustloading.py", line 4, in <module>
    from ad.admath import cos
ModuleNotFoundError: No module named 'ad'

----------------------------------------------------------------------
Ran 16 tests in 3.623s

FAILED (errors=10)

Generating XML reports...
Cloning into 'eVTOL'...

Running tests...
----------------------------------------------------------------------
adding test for 'models/model_tests.py'
..
----------------------------------------------------------------------
Ran 2 tests in 4.355s

OK

Generating XML reports...
Found no installed solvers, beginning a build.
# Building GPkit version 1.1
# Moving to the directory from which GPkit was imported.

Attempting to find and build solvers:

# Looking for `mosek_cli`
#   (A "success" is if mskexpopt complains that
#    we haven't specified a file for it to open.)
#     Calling 'mskexpopt'
##
### CALL BEGINS
### CALL ENDS
##
# Looks like `mskexpopt` was not found in the default PATH,
#  so let's try locating that binary ourselves.
#   Adding /Users/jenkins/mosek/8/tools/platform/osx64x86/bin to the PATH
#     Calling 'mskexpopt'
##
### CALL BEGINS
### CALL ENDS
##

Found mosek_cli in /Users/jenkins/mosek/8/tools/platform/osx64x86/bin

# Looking for `mosek_conif`
#   Trying to import mosek...

Found mosek_conif in the default PYTHONPATH

# Looking for `cvxopt`
#   Trying to import cvxopt...

Found cvxopt in the default PYTHONPATH
Replaced found solvers (['mosek_cli', 'mosek_conif', 'cvxopt']) with environment var GPKITSOLVERS (mosek_cli, mosek_conif)

Found the following solvers: mosek_cli, mosek_conif
#     Replacing directory env

GPkit is now installed with solver(s) ['mosek_cli', 'mosek_conif']
To incorporate new solvers at a later date, run `gpkit.build()`.

If any tests didn't pass, please post the output above
(starting from "Found no installed solvers, beginning a build.")
to gpkit@mit.edu or https://github.com/convexengineering/gpkit/issues/new
so we can prevent others from having these errors.

The same goes for any other bugs you encounter with GPkit:
send 'em our way, along with any interesting models, speculative features,
comments, discussions, or clarifications you feel like sharing.

Finally, we hope you find our documentation (https://gpkit.readthedocs.io/)
and engineering-design models (https://github.com/convexengineering/gplibrary/)
to be useful resources for your own applications.

Enjoy!

calling ['git', 'clone', '--depth', '1', '-b', 'master', 'https://github.com/convexengineering/gplibrary.git']
  attempt 1
calling ['python', '/Users/jenkins/workspace/CE_gpkit_PR_research_models/buildnode/macys/optimizer/mosek/venv_jenkins/bin/pip', 'install', '--no-cache-dir', '--no-deps', '-e', 'gplibrary']
  attempt 1
calling ['git', 'clone', '--depth', '1', '-b', 'master', 'https://github.com/convexengineering/SPaircraft.git']
  attempt 1

SETTINGS
defaultdict(<class 'str'>, {'skipsolvers': 'cvxopt', 'pip install': 'git+https://github.com/hoburg/turbofan.git', 'gpkit-models branch': 'master'})

calling ['python', '/Users/jenkins/workspace/CE_gpkit_PR_research_models/buildnode/macys/optimizer/mosek/venv_jenkins/bin/pip', 'install', 'git+https://github.com/hoburg/turbofan.git']
  attempt 1
calling ['python', '/Users/jenkins/workspace/CE_gpkit_PR_research_models/buildnode/macys/optimizer/mosek/venv_jenkins/bin/pip', 'install', '.']
  attempt 1
calling ['git', 'clone', '--depth', '1', '-b', 'master', 'https://github.com/convexengineering/robust.git']
  attempt 1

SETTINGS
defaultdict(<class 'str'>, {})

calling ['python', '/Users/jenkins/workspace/CE_gpkit_PR_research_models/buildnode/macys/optimizer/mosek/venv_jenkins/bin/pip', 'install', '.']
  attempt 1
  attempt 2
  attempt 3
  attempt 4
  attempt 5
calling ['git', 'clone', '--depth', '1', '-b', 'master', 'https://github.com/convexengineering/shopping.git']
  attempt 1

SETTINGS
defaultdict(<class 'str'>, {})

calling ['git', 'clone', '--depth', '1', '-b', 'master', 'https://github.com/convexengineering/gassolar.git']
  attempt 1

SETTINGS
defaultdict(<class 'str'>, {'pip install': 'pandas, git+https://github.com/hoburg/gpfit.git', 'gpkit-models branch': 'master', 'skipsolvers': 'cvxopt'})

calling ['python', '/Users/jenkins/workspace/CE_gpkit_PR_research_models/buildnode/macys/optimizer/mosek/venv_jenkins/bin/pip', 'install', 'pandas']
  attempt 1
calling ['python', '/Users/jenkins/workspace/CE_gpkit_PR_research_models/buildnode/macys/optimizer/mosek/venv_jenkins/bin/pip', 'install', 'git+https://github.com/hoburg/gpfit.git']
  attempt 1
calling ['python', '/Users/jenkins/workspace/CE_gpkit_PR_research_models/buildnode/macys/optimizer/mosek/venv_jenkins/bin/pip', 'install', '.']
  attempt 1
calling ['git', 'clone', '--depth', '1', '-b', 'master', 'https://github.com/convexengineering/jho.git']
  attempt 1

SETTINGS
defaultdict(<class 'str'>, {'pip install': 'pandas, git+https://github.com/hoburg/gpfit.git', 'gpkit-models branch': 'master', 'skipsolvers': 'cvxopt'})

calling ['python', '/Users/jenkins/workspace/CE_gpkit_PR_research_models/buildnode/macys/optimizer/mosek/venv_jenkins/bin/pip', 'install', 'pandas']
  attempt 1
calling ['python', '/Users/jenkins/workspace/CE_gpkit_PR_research_models/buildnode/macys/optimizer/mosek/venv_jenkins/bin/pip', 'install', 'git+https://github.com/hoburg/gpfit.git']
  attempt 1
calling ['git', 'clone', '--depth', '1', '-b', 'master', 'https://github.com/convexengineering/turbofan.git']
  attempt 1

SETTINGS
defaultdict(<class 'str'>, {'skipsolvers': 'cvxopt, mosek_cli', 'gpkit-models branch': 'master'})

calling ['python', '/Users/jenkins/workspace/CE_gpkit_PR_research_models/buildnode/macys/optimizer/mosek/venv_jenkins/bin/pip', 'install', '.']
  attempt 1
calling ['git', 'clone', '--depth', '1', '-b', 'master', 'https://github.com/convexengineering/solar.git']
  attempt 1

SETTINGS
defaultdict(<class 'str'>, {'pip install': 'pandas, git+https://github.com/convexengineering/gpfit.git, git+https://github.com/convexengineering/gassolar.git', 'gpkit-models branch': 'master', 'skipsolvers': 'cvxopt'})

calling ['python', '/Users/jenkins/workspace/CE_gpkit_PR_research_models/buildnode/macys/optimizer/mosek/venv_jenkins/bin/pip', 'install', 'pandas']
  attempt 1
calling ['python', '/Users/jenkins/workspace/CE_gpkit_PR_research_models/buildnode/macys/optimizer/mosek/venv_jenkins/bin/pip', 'install', 'git+https://github.com/convexengineering/gpfit.git']
  attempt 1
calling ['python', '/Users/jenkins/workspace/CE_gpkit_PR_research_models/buildnode/macys/optimizer/mosek/venv_jenkins/bin/pip', 'install', 'git+https://github.com/convexengineering/gassolar.git']
  attempt 1
calling ['python', '/Users/jenkins/workspace/CE_gpkit_PR_research_models/buildnode/macys/optimizer/mosek/venv_jenkins/bin/pip', 'install', '.']
  attempt 1
calling ['git', 'clone', '--depth', '1', '-b', 'master', 'https://github.com/convexengineering/gplibrary.git']
  attempt 1
  attempt 2
  attempt 3
  attempt 4
  attempt 5

SETTINGS
defaultdict(<class 'str'>, {'pip install': 'pandas, git+https://github.com/hoburg/gpfit.git'})

calling ['python', '/Users/jenkins/workspace/CE_gpkit_PR_research_models/buildnode/macys/optimizer/mosek/venv_jenkins/bin/pip', 'install', 'pandas']
  attempt 1
calling ['python', '/Users/jenkins/workspace/CE_gpkit_PR_research_models/buildnode/macys/optimizer/mosek/venv_jenkins/bin/pip', 'install', 'git+https://github.com/hoburg/gpfit.git']
  attempt 1
calling ['python', '/Users/jenkins/workspace/CE_gpkit_PR_research_models/buildnode/macys/optimizer/mosek/venv_jenkins/bin/pip', 'install', '.']
  attempt 1
calling ['git', 'clone', '--depth', '1', '-b', 'master', 'https://github.com/convexengineering/eVTOL.git']
  attempt 1

SETTINGS
defaultdict(<class 'str'>, {'skipsolvers': 'cvxopt'})

[Execution node] check if [macys] is in [[windows10x64]]
Run condition [Execution node ] preventing perform for step [Execute Windows batch command]
Build step 'Console output (build log) parsing' changed build result to FAILURE
Recording test results
[Checks API] No suitable checks publisher found.
[WS-CLEANUP] Deleting project workspace...
[WS-CLEANUP] Deferred wipeout is used...
[WS-CLEANUP] done
Finished: FAILURE