Console Output

Skipping 10 KB.. Full Log
Seen branch in repository origin/pr/1299/head
Seen branch in repository origin/pr/1300/head
Seen branch in repository origin/pr/1302/head
Seen branch in repository origin/pr/1303/head
Seen branch in repository origin/pr/1304/head
Seen branch in repository origin/pr/1305/head
Seen branch in repository origin/pr/1306/head
Seen branch in repository origin/pr/1307/head
Seen branch in repository origin/pr/1309/head
Seen branch in repository origin/pr/1310/head
Seen branch in repository origin/pr/1311/head
Seen branch in repository origin/pr/1312/head
Seen branch in repository origin/pr/1313/head
Seen branch in repository origin/pr/1315/head
Seen branch in repository origin/pr/1316/head
Seen branch in repository origin/pr/1317/head
Seen branch in repository origin/pr/1319/head
Seen branch in repository origin/pr/1323/head
Seen branch in repository origin/pr/1324/head
Seen branch in repository origin/pr/1326/head
Seen branch in repository origin/pr/1327/head
Seen branch in repository origin/pr/1328/head
Seen branch in repository origin/pr/1329/head
Seen branch in repository origin/pr/1331/head
Seen branch in repository origin/pr/1333/head
Seen branch in repository origin/pr/1335/head
Seen branch in repository origin/pr/1341/head
Seen branch in repository origin/pr/1342/head
Seen branch in repository origin/pr/1344/head
Seen branch in repository origin/pr/1344/merge
Seen branch in repository origin/pr/1346/head
Seen branch in repository origin/pr/1349/head
Seen branch in repository origin/pr/135/head
Seen branch in repository origin/pr/1351/head
Seen branch in repository origin/pr/1352/head
Seen branch in repository origin/pr/1355/head
Seen branch in repository origin/pr/1356/head
Seen branch in repository origin/pr/1357/head
Seen branch in repository origin/pr/1359/head
Seen branch in repository origin/pr/1360/head
Seen branch in repository origin/pr/1361/head
Seen branch in repository origin/pr/1364/head
Seen branch in repository origin/pr/1365/head
Seen branch in repository origin/pr/1366/head
Seen branch in repository origin/pr/1367/head
Seen branch in repository origin/pr/1372/head
Seen branch in repository origin/pr/1373/head
Seen branch in repository origin/pr/1374/head
Seen branch in repository origin/pr/1375/head
Seen branch in repository origin/pr/1377/head
Seen branch in repository origin/pr/1378/head
Seen branch in repository origin/pr/1381/head
Seen branch in repository origin/pr/1382/head
Seen branch in repository origin/pr/1383/head
Seen branch in repository origin/pr/1384/head
Seen branch in repository origin/pr/1385/head
Seen branch in repository origin/pr/1387/head
Seen branch in repository origin/pr/1388/head
Seen branch in repository origin/pr/1389/head
Seen branch in repository origin/pr/1391/head
Seen branch in repository origin/pr/1392/head
Seen branch in repository origin/pr/1393/head
Seen branch in repository origin/pr/1395/head
Seen branch in repository origin/pr/1399/head
Seen branch in repository origin/pr/14/head
Seen branch in repository origin/pr/1401/head
Seen branch in repository origin/pr/1402/head
Seen branch in repository origin/pr/1403/head
Seen branch in repository origin/pr/1404/head
Seen branch in repository origin/pr/1405/head
Seen branch in repository origin/pr/1406/head
Seen branch in repository origin/pr/1407/head
Seen branch in repository origin/pr/1408/head
Seen branch in repository origin/pr/1412/head
Seen branch in repository origin/pr/1413/head
Seen branch in repository origin/pr/1414/head
Seen branch in repository origin/pr/1416/head
Seen branch in repository origin/pr/1419/head
Seen branch in repository origin/pr/1421/head
Seen branch in repository origin/pr/1422/head
Seen branch in repository origin/pr/1423/head
Seen branch in repository origin/pr/1426/head
Seen branch in repository origin/pr/1428/head
Seen branch in repository origin/pr/1429/head
Seen branch in repository origin/pr/1431/head
Seen branch in repository origin/pr/1433/head
Seen branch in repository origin/pr/1434/head
Seen branch in repository origin/pr/1437/head
Seen branch in repository origin/pr/1438/head
Seen branch in repository origin/pr/1438/merge
Seen branch in repository origin/pr/1439/head
Seen branch in repository origin/pr/1440/head
Seen branch in repository origin/pr/1443/head
Seen branch in repository origin/pr/1445/head
Seen branch in repository origin/pr/1446/head
Seen branch in repository origin/pr/1447/head
Seen branch in repository origin/pr/1449/head
Seen branch in repository origin/pr/145/head
Seen branch in repository origin/pr/1452/head
Seen branch in repository origin/pr/1454/head
Seen branch in repository origin/pr/1456/head
Seen branch in repository origin/pr/1459/head
Seen branch in repository origin/pr/1463/head
Seen branch in repository origin/pr/1467/head
Seen branch in repository origin/pr/1468/head
Seen branch in repository origin/pr/1472/head
Seen branch in repository origin/pr/1473/head
Seen branch in repository origin/pr/1475/head
Seen branch in repository origin/pr/1476/head
Seen branch in repository origin/pr/1477/head
Seen branch in repository origin/pr/1479/head
Seen branch in repository origin/pr/1482/head
Seen branch in repository origin/pr/1488/head
Seen branch in repository origin/pr/1489/head
Seen branch in repository origin/pr/1495/head
Seen branch in repository origin/pr/1496/head
Seen branch in repository origin/pr/1498/head
Seen branch in repository origin/pr/1499/head
Seen branch in repository origin/pr/15/head
Seen branch in repository origin/pr/15/merge
Seen branch in repository origin/pr/1501/head
Seen branch in repository origin/pr/1502/head
Seen branch in repository origin/pr/1503/head
Seen branch in repository origin/pr/1504/head
Seen branch in repository origin/pr/1505/head
Seen branch in repository origin/pr/1506/head
Seen branch in repository origin/pr/1507/head
Seen branch in repository origin/pr/1508/head
Seen branch in repository origin/pr/1509/head
Seen branch in repository origin/pr/1511/head
Seen branch in repository origin/pr/1514/head
Seen branch in repository origin/pr/1515/head
Seen branch in repository origin/pr/1517/head
Seen branch in repository origin/pr/1519/head
Seen branch in repository origin/pr/1525/head
Seen branch in repository origin/pr/1527/head
Seen branch in repository origin/pr/1528/head
Seen branch in repository origin/pr/1531/head
Seen branch in repository origin/pr/1532/head
Seen branch in repository origin/pr/1533/head
Seen branch in repository origin/pr/1534/head
Seen branch in repository origin/pr/1537/head
Seen branch in repository origin/pr/1538/head
Seen branch in repository origin/pr/1539/head
Seen branch in repository origin/pr/1540/head
Seen branch in repository origin/pr/1541/head
Seen branch in repository origin/pr/1542/head
Seen branch in repository origin/pr/1543/head
Seen branch in repository origin/pr/1546/head
Seen branch in repository origin/pr/1546/merge
Seen branch in repository origin/pr/1548/head
Seen branch in repository origin/pr/1550/head
Seen branch in repository origin/pr/1553/head
Seen branch in repository origin/pr/1554/head
Seen branch in repository origin/pr/1556/head
Seen branch in repository origin/pr/1557/head
Seen branch in repository origin/pr/1557/merge
Seen branch in repository origin/pr/1561/head
Seen branch in repository origin/pr/1562/head
Seen branch in repository origin/pr/1566/head
Seen branch in repository origin/pr/1567/head
Seen branch in repository origin/pr/1567/merge
Seen branch in repository origin/pr/16/head
Seen branch in repository origin/pr/17/head
Seen branch in repository origin/pr/18/head
Seen branch in repository origin/pr/191/head
Seen branch in repository origin/pr/198/head
Seen branch in repository origin/pr/199/head
Seen branch in repository origin/pr/201/head
Seen branch in repository origin/pr/201/merge
Seen branch in repository origin/pr/203/head
Seen branch in repository origin/pr/206/head
Seen branch in repository origin/pr/206/merge
Seen branch in repository origin/pr/213/head
Seen branch in repository origin/pr/213/merge
Seen branch in repository origin/pr/215/head
Seen branch in repository origin/pr/215/merge
Seen branch in repository origin/pr/216/head
Seen branch in repository origin/pr/227/head
Seen branch in repository origin/pr/228/head
Seen branch in repository origin/pr/235/head
Seen branch in repository origin/pr/236/head
Seen branch in repository origin/pr/236/merge
Seen branch in repository origin/pr/239/head
Seen branch in repository origin/pr/240/head
Seen branch in repository origin/pr/250/head
Seen branch in repository origin/pr/259/head
Seen branch in repository origin/pr/26/head
Seen branch in repository origin/pr/26/merge
Seen branch in repository origin/pr/261/head
Seen branch in repository origin/pr/262/head
Seen branch in repository origin/pr/27/head
Seen branch in repository origin/pr/270/head
Seen branch in repository origin/pr/276/head
Seen branch in repository origin/pr/278/head
Seen branch in repository origin/pr/280/head
Seen branch in repository origin/pr/282/head
Seen branch in repository origin/pr/282/merge
Seen branch in repository origin/pr/285/head
Seen branch in repository origin/pr/287/head
Seen branch in repository origin/pr/288/head
Seen branch in repository origin/pr/295/head
Seen branch in repository origin/pr/298/head
Seen branch in repository origin/pr/298/merge
Seen branch in repository origin/pr/3/head
Seen branch in repository origin/pr/3/merge
Seen branch in repository origin/pr/300/head
Seen branch in repository origin/pr/301/head
Seen branch in repository origin/pr/304/head
Seen branch in repository origin/pr/305/head
Seen branch in repository origin/pr/306/head
Seen branch in repository origin/pr/309/head
Seen branch in repository origin/pr/314/head
Seen branch in repository origin/pr/314/merge
Seen branch in repository origin/pr/317/head
Seen branch in repository origin/pr/32/head
Seen branch in repository origin/pr/32/merge
Seen branch in repository origin/pr/320/head
Seen branch in repository origin/pr/321/head
Seen branch in repository origin/pr/322/head
Seen branch in repository origin/pr/323/head
Seen branch in repository origin/pr/324/head
Seen branch in repository origin/pr/324/merge
Seen branch in repository origin/pr/325/head
Seen branch in repository origin/pr/326/head
Seen branch in repository origin/pr/328/head
Seen branch in repository origin/pr/329/head
Seen branch in repository origin/pr/329/merge
Seen branch in repository origin/pr/331/head
Seen branch in repository origin/pr/337/head
Seen branch in repository origin/pr/339/head
Seen branch in repository origin/pr/340/head
Seen branch in repository origin/pr/340/merge
Seen branch in repository origin/pr/341/head
Seen branch in repository origin/pr/341/merge
Seen branch in repository origin/pr/342/head
Seen branch in repository origin/pr/342/merge
Seen branch in repository origin/pr/343/head
Seen branch in repository origin/pr/343/merge
Seen branch in repository origin/pr/344/head
Seen branch in repository origin/pr/345/head
Seen branch in repository origin/pr/346/head
Seen branch in repository origin/pr/347/head
Seen branch in repository origin/pr/349/head
Seen branch in repository origin/pr/351/head
Seen branch in repository origin/pr/353/head
Seen branch in repository origin/pr/355/head
Seen branch in repository origin/pr/356/head
Seen branch in repository origin/pr/357/head
Seen branch in repository origin/pr/358/head
Seen branch in repository origin/pr/358/merge
Seen branch in repository origin/pr/360/head
Seen branch in repository origin/pr/37/head
Seen branch in repository origin/pr/375/head
Seen branch in repository origin/pr/376/head
Seen branch in repository origin/pr/377/head
Seen branch in repository origin/pr/378/head
Seen branch in repository origin/pr/38/head
Seen branch in repository origin/pr/381/head
Seen branch in repository origin/pr/384/head
Seen branch in repository origin/pr/388/head
Seen branch in repository origin/pr/39/head
Seen branch in repository origin/pr/391/head
Seen branch in repository origin/pr/391/merge
Seen branch in repository origin/pr/393/head
Seen branch in repository origin/pr/394/head
Seen branch in repository origin/pr/395/head
Seen branch in repository origin/pr/398/head
Seen branch in repository origin/pr/4/head
Seen branch in repository origin/pr/4/merge
Seen branch in repository origin/pr/40/head
Seen branch in repository origin/pr/408/head
Seen branch in repository origin/pr/409/head
Seen branch in repository origin/pr/415/head
Seen branch in repository origin/pr/415/merge
Seen branch in repository origin/pr/419/head
Seen branch in repository origin/pr/423/head
Seen branch in repository origin/pr/424/head
Seen branch in repository origin/pr/424/merge
Seen branch in repository origin/pr/426/head
Seen branch in repository origin/pr/427/head
Seen branch in repository origin/pr/429/head
Seen branch in repository origin/pr/430/head
Seen branch in repository origin/pr/434/head
Seen branch in repository origin/pr/439/head
Seen branch in repository origin/pr/445/head
Seen branch in repository origin/pr/448/head
Seen branch in repository origin/pr/45/head
Seen branch in repository origin/pr/45/merge
Seen branch in repository origin/pr/452/head
Seen branch in repository origin/pr/452/merge
Seen branch in repository origin/pr/456/head
Seen branch in repository origin/pr/459/head
Seen branch in repository origin/pr/461/head
Seen branch in repository origin/pr/463/head
Seen branch in repository origin/pr/465/head
Seen branch in repository origin/pr/468/head
Seen branch in repository origin/pr/475/head
Seen branch in repository origin/pr/478/head
Seen branch in repository origin/pr/481/head
Seen branch in repository origin/pr/481/merge
Seen branch in repository origin/pr/482/head
Seen branch in repository origin/pr/483/head
Seen branch in repository origin/pr/483/merge
Seen branch in repository origin/pr/486/head
Seen branch in repository origin/pr/489/head
Seen branch in repository origin/pr/490/head
Seen branch in repository origin/pr/491/head
Seen branch in repository origin/pr/493/head
Seen branch in repository origin/pr/494/head
Seen branch in repository origin/pr/495/head
Seen branch in repository origin/pr/496/head
Seen branch in repository origin/pr/497/head
Seen branch in repository origin/pr/499/head
Seen branch in repository origin/pr/499/merge
Seen branch in repository origin/pr/5/head
Seen branch in repository origin/pr/5/merge
Seen branch in repository origin/pr/500/head
Seen branch in repository origin/pr/500/merge
Seen branch in repository origin/pr/502/head
Seen branch in repository origin/pr/503/head
Seen branch in repository origin/pr/504/head
Seen branch in repository origin/pr/504/merge
Seen branch in repository origin/pr/505/head
Seen branch in repository origin/pr/513/head
Seen branch in repository origin/pr/514/head
Seen branch in repository origin/pr/522/head
Seen branch in repository origin/pr/522/merge
Seen branch in repository origin/pr/523/head
Seen branch in repository origin/pr/529/head
Seen branch in repository origin/pr/531/head
Seen branch in repository origin/pr/532/head
Seen branch in repository origin/pr/533/head
Seen branch in repository origin/pr/542/head
Seen branch in repository origin/pr/543/head
Seen branch in repository origin/pr/545/head
Seen branch in repository origin/pr/547/head
Seen branch in repository origin/pr/547/merge
Seen branch in repository origin/pr/548/head
Seen branch in repository origin/pr/550/head
Seen branch in repository origin/pr/551/head
Seen branch in repository origin/pr/553/head
Seen branch in repository origin/pr/554/head
Seen branch in repository origin/pr/555/head
Seen branch in repository origin/pr/556/head
Seen branch in repository origin/pr/557/head
Seen branch in repository origin/pr/557/merge
Seen branch in repository origin/pr/558/head
Seen branch in repository origin/pr/564/head
Seen branch in repository origin/pr/571/head
Seen branch in repository origin/pr/573/head
Seen branch in repository origin/pr/576/head
Seen branch in repository origin/pr/579/head
Seen branch in repository origin/pr/580/head
Seen branch in repository origin/pr/581/head
Seen branch in repository origin/pr/582/head
Seen branch in repository origin/pr/584/head
Seen branch in repository origin/pr/588/head
Seen branch in repository origin/pr/589/head
Seen branch in repository origin/pr/591/head
Seen branch in repository origin/pr/594/head
Seen branch in repository origin/pr/6/head
Seen branch in repository origin/pr/603/head
Seen branch in repository origin/pr/604/head
Seen branch in repository origin/pr/605/head
Seen branch in repository origin/pr/611/head
Seen branch in repository origin/pr/620/head
Seen branch in repository origin/pr/623/head
Seen branch in repository origin/pr/626/head
Seen branch in repository origin/pr/630/head
Seen branch in repository origin/pr/631/head
Seen branch in repository origin/pr/635/head
Seen branch in repository origin/pr/636/head
Seen branch in repository origin/pr/637/head
Seen branch in repository origin/pr/638/head
Seen branch in repository origin/pr/639/head
Seen branch in repository origin/pr/640/head
Seen branch in repository origin/pr/641/head
Seen branch in repository origin/pr/642/head
Seen branch in repository origin/pr/642/merge
Seen branch in repository origin/pr/648/head
Seen branch in repository origin/pr/652/head
Seen branch in repository origin/pr/654/head
Seen branch in repository origin/pr/656/head
Seen branch in repository origin/pr/656/merge
Seen branch in repository origin/pr/660/head
Seen branch in repository origin/pr/663/head
Seen branch in repository origin/pr/665/head
Seen branch in repository origin/pr/667/head
Seen branch in repository origin/pr/670/head
Seen branch in repository origin/pr/674/head
Seen branch in repository origin/pr/675/head
Seen branch in repository origin/pr/677/head
Seen branch in repository origin/pr/680/head
Seen branch in repository origin/pr/680/merge
Seen branch in repository origin/pr/681/head
Seen branch in repository origin/pr/682/head
Seen branch in repository origin/pr/684/head
Seen branch in repository origin/pr/685/head
Seen branch in repository origin/pr/685/merge
Seen branch in repository origin/pr/686/head
Seen branch in repository origin/pr/687/head
Seen branch in repository origin/pr/688/head
Seen branch in repository origin/pr/690/head
Seen branch in repository origin/pr/695/head
Seen branch in repository origin/pr/696/head
Seen branch in repository origin/pr/697/head
Seen branch in repository origin/pr/703/head
Seen branch in repository origin/pr/706/head
Seen branch in repository origin/pr/708/head
Seen branch in repository origin/pr/709/head
Seen branch in repository origin/pr/712/head
Seen branch in repository origin/pr/714/head
Seen branch in repository origin/pr/716/head
Seen branch in repository origin/pr/719/head
Seen branch in repository origin/pr/720/head
Seen branch in repository origin/pr/721/head
Seen branch in repository origin/pr/722/head
Seen branch in repository origin/pr/722/merge
Seen branch in repository origin/pr/723/head
Seen branch in repository origin/pr/725/head
Seen branch in repository origin/pr/727/head
Seen branch in repository origin/pr/728/head
Seen branch in repository origin/pr/73/head
Seen branch in repository origin/pr/731/head
Seen branch in repository origin/pr/735/head
Seen branch in repository origin/pr/736/head
Seen branch in repository origin/pr/738/head
Seen branch in repository origin/pr/740/head
Seen branch in repository origin/pr/743/head
Seen branch in repository origin/pr/749/head
Seen branch in repository origin/pr/751/head
Seen branch in repository origin/pr/759/head
Seen branch in repository origin/pr/759/merge
Seen branch in repository origin/pr/76/head
Seen branch in repository origin/pr/760/head
Seen branch in repository origin/pr/787/head
Seen branch in repository origin/pr/788/head
Seen branch in repository origin/pr/790/head
Seen branch in repository origin/pr/791/head
Seen branch in repository origin/pr/792/head
Seen branch in repository origin/pr/793/head
Seen branch in repository origin/pr/795/head
Seen branch in repository origin/pr/797/head
Seen branch in repository origin/pr/804/head
Seen branch in repository origin/pr/810/head
Seen branch in repository origin/pr/813/head
Seen branch in repository origin/pr/813/merge
Seen branch in repository origin/pr/815/head
Seen branch in repository origin/pr/815/merge
Seen branch in repository origin/pr/817/head
Seen branch in repository origin/pr/817/merge
Seen branch in repository origin/pr/818/head
Seen branch in repository origin/pr/823/head
Seen branch in repository origin/pr/823/merge
Seen branch in repository origin/pr/826/head
Seen branch in repository origin/pr/830/head
Seen branch in repository origin/pr/831/head
Seen branch in repository origin/pr/833/head
Seen branch in repository origin/pr/835/head
Seen branch in repository origin/pr/836/head
Seen branch in repository origin/pr/838/head
Seen branch in repository origin/pr/839/head
Seen branch in repository origin/pr/840/head
Seen branch in repository origin/pr/841/head
Seen branch in repository origin/pr/845/head
Seen branch in repository origin/pr/850/head
Seen branch in repository origin/pr/853/head
Seen branch in repository origin/pr/854/head
Seen branch in repository origin/pr/855/head
Seen branch in repository origin/pr/856/head
Seen branch in repository origin/pr/856/merge
Seen branch in repository origin/pr/858/head
Seen branch in repository origin/pr/859/head
Seen branch in repository origin/pr/861/head
Seen branch in repository origin/pr/866/head
Seen branch in repository origin/pr/866/merge
Seen branch in repository origin/pr/873/head
Seen branch in repository origin/pr/875/head
Seen branch in repository origin/pr/876/head
Seen branch in repository origin/pr/880/head
Seen branch in repository origin/pr/884/head
Seen branch in repository origin/pr/887/head
Seen branch in repository origin/pr/893/head
Seen branch in repository origin/pr/894/head
Seen branch in repository origin/pr/898/head
Seen branch in repository origin/pr/900/head
Seen branch in repository origin/pr/906/head
Seen branch in repository origin/pr/908/head
Seen branch in repository origin/pr/910/head
Seen branch in repository origin/pr/915/head
Seen branch in repository origin/pr/917/head
Seen branch in repository origin/pr/920/head
Seen branch in repository origin/pr/920/merge
Seen branch in repository origin/pr/921/head
Seen branch in repository origin/pr/922/head
Seen branch in repository origin/pr/923/head
Seen branch in repository origin/pr/925/head
Seen branch in repository origin/pr/932/head
Seen branch in repository origin/pr/932/merge
Seen branch in repository origin/pr/933/head
Seen branch in repository origin/pr/934/head
Seen branch in repository origin/pr/937/head
Seen branch in repository origin/pr/938/head
Seen branch in repository origin/pr/941/head
Seen branch in repository origin/pr/941/merge
Seen branch in repository origin/pr/944/head
Seen branch in repository origin/pr/947/head
Seen branch in repository origin/pr/948/head
Seen branch in repository origin/pr/953/head
Seen branch in repository origin/pr/954/head
Seen branch in repository origin/pr/957/head
Seen branch in repository origin/pr/961/head
Seen branch in repository origin/pr/964/head
Seen branch in repository origin/pr/964/merge
Seen branch in repository origin/pr/965/head
Seen branch in repository origin/pr/966/head
Seen branch in repository origin/pr/973/head
Seen branch in repository origin/pr/974/head
Seen branch in repository origin/pr/976/head
Seen branch in repository origin/pr/977/head
Seen branch in repository origin/pr/978/head
Seen branch in repository origin/pr/980/head
Seen branch in repository origin/pr/981/head
Seen branch in repository origin/pr/982/head
Seen branch in repository origin/pr/984/head
Seen branch in repository origin/pr/986/head
Seen branch in repository origin/pr/987/head
Seen branch in repository origin/pr/988/head
Seen branch in repository origin/pr/989/head
Seen branch in repository origin/pr/991/head
Seen branch in repository origin/pr/994/head
Seen branch in repository origin/pr/994/merge
Seen branch in repository origin/pr/995/head
Seen branch in repository origin/pr/998/head
Seen branch in repository origin/py3only
Seen branch in repository origin/rileyfork
Seen branch in repository origin/robustSPpaper
Seen branch in repository origin/sage
Seen branch in repository origin/smallupdates
Seen branch in repository origin/varexp
Seen branch in repository origin/xu_constraints
Seen branch in repository origin/xu_examples
Seen 698 remote branches
 > git show-ref --tags -d # timeout=10
JENKINS-19022: warning: possible memory leak due to Git plugin usage; see: https://plugins.jenkins.io/git/#remove-git-plugin-buildsbybranch-builddata-script
Checking out Revision e3ed0f96d8d800742ef24f26b1c9127ffa463d90 (origin/pr/1567/merge, origin/master)
 > git config core.sparsecheckout # timeout=10
 > git checkout -f e3ed0f96d8d800742ef24f26b1c9127ffa463d90 # timeout=3
Commit message: "Merge 6f88f9b03926a510267a1933db2c151dfba62122 into 1ac62d2ddd18e93ad499ae3bce248e40cdf382a5"
Using 'Changelog to branch' strategy.
The recommended git tool is: NONE
using credential 3614a4cf-01de-4393-97de-73734b7dd5a2
 > git rev-parse e3ed0f96d8d800742ef24f26b1c9127ffa463d90^{commit} # timeout=10
The recommended git tool is: NONE
using credential 3614a4cf-01de-4393-97de-73734b7dd5a2
[GitCheckoutListener] Recording commits of 'git https://github.com/convexengineering/gpkit'
[GitCheckoutListener] Found previous build 'CE_gpkit_PR_research_models/buildnode=macys,optimizer=cvxopt #498' that contains recorded Git commits
[GitCheckoutListener] -> Starting recording of new commits since '213abc7'
[GitCheckoutListener] -> Using head commit 'e3ed0f9' as starting point
[GitCheckoutListener] -> Git commit decorator successfully obtained 'hudson.plugins.git.browser.GithubWeb@2e284020' to render commit links
[GitCheckoutListener] -> Recorded 200 new commits
Run condition [Execution node ] enabling prebuild for step [Execute shell]
Run condition [Execution node ] enabling prebuild for step [Execute Windows batch command]
[description-setter] Description set: <a title="better sweep printing, clean sgp cost, lint" href="https://github.com/convexengineering/gpkit/pull/1567">PR 1567</a>: better sweep printing, clean sgp cost, lint
[Execution node] check if [macys] is in [[macys, macys_VM, reynolds, reynolds-ubuntu16]]
Run condition [Execution node ] enabling perform for step [Execute shell]
[cvxopt] $ /bin/bash -xe /var/folders/xs/_fh4l1p54zqcl6mbk4zclcfr0000gp/T/jenkins7111342775791943227.sh
+ git clone ssh://acdl.mit.edu/home/svnroot/JenkinsGPkit
Cloning into 'JenkinsGPkit'...
+ source /Users/jenkins/workspace/CE_gpkit_PR_research_models/buildnode/macys/optimizer/cvxopt/JenkinsGPkit/gpkit_PR_research_models.sh
++ source /Users/jenkins/workspace/CE_gpkit_PR_research_models/buildnode/macys/optimizer/cvxopt/JenkinsGPkit/all_machines.sh
+++ export PYTHONHASHSEED=0
+++ PYTHONHASHSEED=0
+++ echo 'Python hash seed set to: 0'
Python hash seed set to: 0
+++ [[ macys == *macys* ]]
+++ export PATH=/usr/bin:/bin:/usr/sbin:/sbin:/usr/local/bin/
+++ PATH=/usr/bin:/bin:/usr/sbin:/sbin:/usr/local/bin/
+++ virtualenv --python=python3 /Users/jenkins/workspace/CE_gpkit_PR_research_models/buildnode/macys/optimizer/cvxopt/venv_jenkins
/usr/local/lib/python3.9/site-packages/setuptools/command/install.py:34: SetuptoolsDeprecationWarning: setup.py install is deprecated. Use build and pip and other standards-based tools.
  warnings.warn(
created virtual environment CPython3.9.10.final.0-64 in 3112ms
  creator CPython3Posix(dest=/Users/jenkins/workspace/CE_gpkit_PR_research_models/buildnode/macys/optimizer/cvxopt/venv_jenkins, clear=False, no_vcs_ignore=False, global=False)
  seeder FromAppData(download=False, pip=bundle, setuptools=bundle, wheel=bundle, via=copy, app_data_dir=/Users/jenkins/Library/Application Support/virtualenv)
    added seed packages: pip==21.3.1, setuptools==60.6.0, wheel==0.37.1
  activators BashActivator,CShellActivator,FishActivator,PowerShellActivator,PythonActivator,XonshActivator
+++ source /Users/jenkins/workspace/CE_gpkit_PR_research_models/buildnode/macys/optimizer/cvxopt/venv_jenkins/bin/activate
++++ '[' /Users/jenkins/workspace/CE_gpkit_PR_research_models/buildnode/macys/optimizer/cvxopt/venv_jenkins/bin/activate = /var/folders/xs/_fh4l1p54zqcl6mbk4zclcfr0000gp/T/jenkins7111342775791943227.sh ']'
++++ deactivate nondestructive
++++ unset -f pydoc
++++ '[' -z '' ']'
++++ '[' -z '' ']'
++++ '[' -n /bin/bash ']'
++++ hash -r
++++ '[' -z '' ']'
++++ unset VIRTUAL_ENV
++++ '[' '!' nondestructive = nondestructive ']'
++++ VIRTUAL_ENV=/Users/jenkins/workspace/CE_gpkit_PR_research_models/buildnode/macys/optimizer/cvxopt/venv_jenkins
++++ '[' darwin20 = cygwin ']'
++++ '[' darwin20 = msys ']'
++++ export VIRTUAL_ENV
++++ _OLD_VIRTUAL_PATH=/usr/bin:/bin:/usr/sbin:/sbin:/usr/local/bin/
++++ PATH=/Users/jenkins/workspace/CE_gpkit_PR_research_models/buildnode/macys/optimizer/cvxopt/venv_jenkins/bin:/usr/bin:/bin:/usr/sbin:/sbin:/usr/local/bin/
++++ export PATH
++++ '[' -z '' ']'
++++ '[' -z '' ']'
++++ _OLD_VIRTUAL_PS1=
++++ '[' x '!=' x ']'
+++++ basename /Users/jenkins/workspace/CE_gpkit_PR_research_models/buildnode/macys/optimizer/cvxopt/venv_jenkins
++++ PS1='(venv_jenkins) '
++++ export PS1
++++ alias pydoc
++++ true
++++ '[' -n /bin/bash ']'
++++ hash -r
+++ ls /Users/jenkins/workspace/CE_gpkit_PR_research_models/buildnode/macys/optimizer/cvxopt
CODE_OF_CONDUCT.md
JenkinsGPkit
LICENSE
MANIFEST
README.md
docs
fulltests.sh
gpkit
linecount.sh
pylint.sh
rtd_requirements.txt
runtests.sh
setup.py
venv_jenkins
++++ which pip
+++ export PIP=/Users/jenkins/workspace/CE_gpkit_PR_research_models/buildnode/macys/optimizer/cvxopt/venv_jenkins/bin/pip
+++ PIP=/Users/jenkins/workspace/CE_gpkit_PR_research_models/buildnode/macys/optimizer/cvxopt/venv_jenkins/bin/pip
+++ pip_install pip
+++ python /Users/jenkins/workspace/CE_gpkit_PR_research_models/buildnode/macys/optimizer/cvxopt/venv_jenkins/bin/pip install --upgrade pip
Requirement already satisfied: pip in ./venv_jenkins/lib/python3.9/site-packages (21.3.1)
Collecting pip
  Using cached pip-22.0.3-py3-none-any.whl (2.1 MB)
Installing collected packages: pip
  Attempting uninstall: pip
    Found existing installation: pip 21.3.1
    Uninstalling pip-21.3.1:
      Successfully uninstalled pip-21.3.1
Successfully installed pip-22.0.3

real	0m8.226s
user	0m3.314s
sys	0m1.100s
++ source /Users/jenkins/workspace/CE_gpkit_PR_research_models/buildnode/macys/optimizer/cvxopt/JenkinsGPkit/mosek_installs.sh
+++ [[ cvxopt == mosek ]]
++ source /Users/jenkins/workspace/CE_gpkit_PR_research_models/buildnode/macys/optimizer/cvxopt/JenkinsGPkit/cvxopt_installs.sh
+++ [[ cvxopt == cvxopt ]]
+++ pip_install cvxopt
+++ python /Users/jenkins/workspace/CE_gpkit_PR_research_models/buildnode/macys/optimizer/cvxopt/venv_jenkins/bin/pip install --upgrade cvxopt
Collecting cvxopt
  Using cached cvxopt-1.2.7-cp39-cp39-macosx_10_9_x86_64.whl (3.1 MB)
Installing collected packages: cvxopt
Successfully installed cvxopt-1.2.7

real	0m1.845s
user	0m1.002s
sys	0m0.184s
+++ python -c 'import cvxopt'
+++ export GPKITSOLVERS=cvxopt
+++ GPKITSOLVERS=cvxopt
+++ COVERAGE_OMIT='gpkit/solvers/mosek*'
++ source /Users/jenkins/workspace/CE_gpkit_PR_research_models/buildnode/macys/optimizer/cvxopt/JenkinsGPkit/pip_installs_base.sh
+++ pip_install adce
+++ python /Users/jenkins/workspace/CE_gpkit_PR_research_models/buildnode/macys/optimizer/cvxopt/venv_jenkins/bin/pip install --upgrade adce
Collecting adce
  Using cached adce-1.3.3.2-py3-none-any.whl
Installing collected packages: adce
Successfully installed adce-1.3.3.2

real	0m1.136s
user	0m0.691s
sys	0m0.117s
+++ pip_install unittest-xml-reporting
+++ python /Users/jenkins/workspace/CE_gpkit_PR_research_models/buildnode/macys/optimizer/cvxopt/venv_jenkins/bin/pip install --upgrade unittest-xml-reporting
Collecting unittest-xml-reporting
  Using cached unittest_xml_reporting-3.2.0-py2.py3-none-any.whl (20 kB)
Collecting lxml
  Using cached lxml-4.8.0-cp39-cp39-macosx_10_15_x86_64.whl (4.6 MB)
Installing collected packages: lxml, unittest-xml-reporting
Successfully installed lxml-4.8.0 unittest-xml-reporting-3.2.0

real	0m2.245s
user	0m1.550s
sys	0m0.207s
+++ pip_install pandas
+++ python /Users/jenkins/workspace/CE_gpkit_PR_research_models/buildnode/macys/optimizer/cvxopt/venv_jenkins/bin/pip install --upgrade pandas
Collecting pandas
  Using cached pandas-1.4.1-cp39-cp39-macosx_10_9_x86_64.whl (11.5 MB)
Collecting numpy>=1.18.5
  Using cached numpy-1.22.2-cp39-cp39-macosx_10_14_x86_64.whl (17.6 MB)
Collecting pytz>=2020.1
  Using cached pytz-2021.3-py2.py3-none-any.whl (503 kB)
Collecting python-dateutil>=2.8.1
  Using cached python_dateutil-2.8.2-py2.py3-none-any.whl (247 kB)
Collecting six>=1.5
  Using cached six-1.16.0-py2.py3-none-any.whl (11 kB)
Installing collected packages: pytz, six, numpy, python-dateutil, pandas
Successfully installed numpy-1.22.2 pandas-1.4.1 python-dateutil-2.8.2 pytz-2021.3 six-1.16.0

real	0m16.879s
user	0m9.869s
sys	0m2.087s
+++ pip_install matplotlib
+++ python /Users/jenkins/workspace/CE_gpkit_PR_research_models/buildnode/macys/optimizer/cvxopt/venv_jenkins/bin/pip install --upgrade matplotlib
Collecting matplotlib
  Using cached matplotlib-3.5.1-cp39-cp39-macosx_10_9_x86_64.whl (7.3 MB)
Collecting cycler>=0.10
  Using cached cycler-0.11.0-py3-none-any.whl (6.4 kB)
Collecting kiwisolver>=1.0.1
  Using cached kiwisolver-1.3.2-cp39-cp39-macosx_10_9_x86_64.whl (61 kB)
Collecting pillow>=6.2.0
  Using cached Pillow-9.0.1-cp39-cp39-macosx_10_10_x86_64.whl (3.0 MB)
Requirement already satisfied: python-dateutil>=2.7 in ./venv_jenkins/lib/python3.9/site-packages (from matplotlib) (2.8.2)
Collecting fonttools>=4.22.0
  Using cached fonttools-4.29.1-py3-none-any.whl (895 kB)
Collecting pyparsing>=2.2.1
  Using cached pyparsing-3.0.7-py3-none-any.whl (98 kB)
Collecting packaging>=20.0
  Using cached packaging-21.3-py3-none-any.whl (40 kB)
Requirement already satisfied: numpy>=1.17 in ./venv_jenkins/lib/python3.9/site-packages (from matplotlib) (1.22.2)
Requirement already satisfied: six>=1.5 in ./venv_jenkins/lib/python3.9/site-packages (from python-dateutil>=2.7->matplotlib) (1.16.0)
Installing collected packages: pyparsing, pillow, kiwisolver, fonttools, cycler, packaging, matplotlib
Successfully installed cycler-0.11.0 fonttools-4.29.1 kiwisolver-1.3.2 matplotlib-3.5.1 packaging-21.3 pillow-9.0.1 pyparsing-3.0.7

real	0m9.261s
user	0m5.308s
sys	0m0.866s
+++ pip_install coverage
+++ python /Users/jenkins/workspace/CE_gpkit_PR_research_models/buildnode/macys/optimizer/cvxopt/venv_jenkins/bin/pip install --upgrade coverage
Collecting coverage
  Using cached coverage-6.3.2-cp39-cp39-macosx_10_9_x86_64.whl (183 kB)
Installing collected packages: coverage
Successfully installed coverage-6.3.2

real	0m2.832s
user	0m1.792s
sys	0m0.167s
+++ pip_install ipywidgets
+++ python /Users/jenkins/workspace/CE_gpkit_PR_research_models/buildnode/macys/optimizer/cvxopt/venv_jenkins/bin/pip install --upgrade ipywidgets
Collecting ipywidgets
  Using cached ipywidgets-7.6.5-py2.py3-none-any.whl (121 kB)
Collecting ipython>=4.0.0
  Downloading ipython-8.1.0-py3-none-any.whl (750 kB)
     ━━━━━━━━━━━━━━━━━━━━━━━━━━━━━━━━━━━━━━ 750.1/750.1 KB 15.8 MB/s eta 0:00:00
Collecting jupyterlab-widgets>=1.0.0
  Using cached jupyterlab_widgets-1.0.2-py3-none-any.whl (243 kB)
Collecting traitlets>=4.3.1
  Using cached traitlets-5.1.1-py3-none-any.whl (102 kB)
Collecting nbformat>=4.2.0
  Using cached nbformat-5.1.3-py3-none-any.whl (178 kB)
Collecting ipython-genutils~=0.2.0
  Using cached ipython_genutils-0.2.0-py2.py3-none-any.whl (26 kB)
Collecting widgetsnbextension~=3.5.0
  Using cached widgetsnbextension-3.5.2-py2.py3-none-any.whl (1.6 MB)
Collecting ipykernel>=4.5.1
  Using cached ipykernel-6.9.1-py3-none-any.whl (128 kB)
Collecting jupyter-client<8.0
  Using cached jupyter_client-7.1.2-py3-none-any.whl (130 kB)
Collecting tornado<7.0,>=4.2
  Using cached tornado-6.1-cp39-cp39-macosx_10_9_x86_64.whl (416 kB)
Collecting matplotlib-inline<0.2.0,>=0.1.0
  Using cached matplotlib_inline-0.1.3-py3-none-any.whl (8.2 kB)
Collecting debugpy<2.0,>=1.0.0
  Using cached debugpy-1.5.1-cp39-cp39-macosx_10_15_x86_64.whl (1.7 MB)
Collecting appnope
  Using cached appnope-0.1.2-py2.py3-none-any.whl (4.3 kB)
Collecting nest-asyncio
  Using cached nest_asyncio-1.5.4-py3-none-any.whl (5.1 kB)
Requirement already satisfied: setuptools>=18.5 in ./venv_jenkins/lib/python3.9/site-packages (from ipython>=4.0.0->ipywidgets) (60.6.0)
Collecting decorator
  Using cached decorator-5.1.1-py3-none-any.whl (9.1 kB)
Collecting pexpect>4.3
  Using cached pexpect-4.8.0-py2.py3-none-any.whl (59 kB)
Collecting pygments>=2.4.0
  Using cached Pygments-2.11.2-py3-none-any.whl (1.1 MB)
Collecting stack-data
  Using cached stack_data-0.2.0-py3-none-any.whl (21 kB)
Collecting backcall
  Using cached backcall-0.2.0-py2.py3-none-any.whl (11 kB)
Collecting prompt-toolkit!=3.0.0,!=3.0.1,<3.1.0,>=2.0.0
  Using cached prompt_toolkit-3.0.28-py3-none-any.whl (380 kB)
Collecting pickleshare
  Using cached pickleshare-0.7.5-py2.py3-none-any.whl (6.9 kB)
Collecting jedi>=0.16
  Using cached jedi-0.18.1-py2.py3-none-any.whl (1.6 MB)
Collecting jupyter-core
  Using cached jupyter_core-4.9.2-py3-none-any.whl (86 kB)
Collecting jsonschema!=2.5.0,>=2.4
  Using cached jsonschema-4.4.0-py3-none-any.whl (72 kB)
Collecting notebook>=4.4.1
  Using cached notebook-6.4.8-py3-none-any.whl (9.9 MB)
Collecting parso<0.9.0,>=0.8.0
  Using cached parso-0.8.3-py2.py3-none-any.whl (100 kB)
Collecting pyrsistent!=0.17.0,!=0.17.1,!=0.17.2,>=0.14.0
  Using cached pyrsistent-0.18.1-cp39-cp39-macosx_10_9_universal2.whl (81 kB)
Collecting attrs>=17.4.0
  Using cached attrs-21.4.0-py2.py3-none-any.whl (60 kB)
Collecting entrypoints
  Using cached entrypoints-0.4-py3-none-any.whl (5.3 kB)
Collecting pyzmq>=13
  Using cached pyzmq-22.3.0-cp39-cp39-macosx_10_15_universal2.whl (2.0 MB)
Requirement already satisfied: python-dateutil>=2.1 in ./venv_jenkins/lib/python3.9/site-packages (from jupyter-client<8.0->ipykernel>=4.5.1->ipywidgets) (2.8.2)
Collecting terminado>=0.8.3
  Using cached terminado-0.13.1-py3-none-any.whl (14 kB)
Collecting argon2-cffi
  Using cached argon2_cffi-21.3.0-py3-none-any.whl (14 kB)
Collecting jinja2
  Using cached Jinja2-3.0.3-py3-none-any.whl (133 kB)
Collecting nbconvert
  Using cached nbconvert-6.4.2-py3-none-any.whl (558 kB)
Collecting Send2Trash>=1.8.0
  Using cached Send2Trash-1.8.0-py3-none-any.whl (18 kB)
Collecting prometheus-client
  Using cached prometheus_client-0.13.1-py3-none-any.whl (57 kB)
Collecting ptyprocess>=0.5
  Using cached ptyprocess-0.7.0-py2.py3-none-any.whl (13 kB)
Collecting wcwidth
  Using cached wcwidth-0.2.5-py2.py3-none-any.whl (30 kB)
Collecting pure-eval
  Using cached pure_eval-0.2.2-py3-none-any.whl (11 kB)
Collecting executing
  Downloading executing-0.8.3-py2.py3-none-any.whl (16 kB)
Collecting asttokens
  Using cached asttokens-2.0.5-py2.py3-none-any.whl (20 kB)
Requirement already satisfied: six>=1.5 in ./venv_jenkins/lib/python3.9/site-packages (from python-dateutil>=2.1->jupyter-client<8.0->ipykernel>=4.5.1->ipywidgets) (1.16.0)
Collecting argon2-cffi-bindings
  Using cached argon2_cffi_bindings-21.2.0-cp38-abi3-macosx_10_9_universal2.whl (53 kB)
Collecting MarkupSafe>=2.0
  Using cached MarkupSafe-2.1.0-cp39-cp39-macosx_10_9_x86_64.whl (13 kB)
Collecting mistune<2,>=0.8.1
  Using cached mistune-0.8.4-py2.py3-none-any.whl (16 kB)
Collecting pandocfilters>=1.4.1
  Using cached pandocfilters-1.5.0-py2.py3-none-any.whl (8.7 kB)
Collecting defusedxml
  Using cached defusedxml-0.7.1-py2.py3-none-any.whl (25 kB)
Collecting testpath
  Downloading testpath-0.6.0-py3-none-any.whl (83 kB)
     ━━━━━━━━━━━━━━━━━━━━━━━━━━━━━━━━━━━━━━━━ 83.9/83.9 KB 1.9 MB/s eta 0:00:00
Collecting nbclient<0.6.0,>=0.5.0
  Using cached nbclient-0.5.11-py3-none-any.whl (71 kB)
Collecting jupyterlab-pygments
  Using cached jupyterlab_pygments-0.1.2-py2.py3-none-any.whl (4.6 kB)
Collecting bleach
  Using cached bleach-4.1.0-py2.py3-none-any.whl (157 kB)
Collecting cffi>=1.0.1
  Using cached cffi-1.15.0-cp39-cp39-macosx_10_9_x86_64.whl (178 kB)
Requirement already satisfied: packaging in ./venv_jenkins/lib/python3.9/site-packages (from bleach->nbconvert->notebook>=4.4.1->widgetsnbextension~=3.5.0->ipywidgets) (21.3)
Collecting webencodings
  Using cached webencodings-0.5.1-py2.py3-none-any.whl (11 kB)
Collecting pycparser
  Using cached pycparser-2.21-py2.py3-none-any.whl (118 kB)
Requirement already satisfied: pyparsing!=3.0.5,>=2.0.2 in ./venv_jenkins/lib/python3.9/site-packages (from packaging->bleach->nbconvert->notebook>=4.4.1->widgetsnbextension~=3.5.0->ipywidgets) (3.0.7)
Installing collected packages: webencodings, wcwidth, Send2Trash, pure-eval, ptyprocess, pickleshare, mistune, ipython-genutils, executing, backcall, appnope, traitlets, tornado, testpath, pyzmq, pyrsistent, pygments, pycparser, prompt-toolkit, prometheus-client, pexpect, parso, pandocfilters, nest-asyncio, MarkupSafe, jupyterlab-widgets, entrypoints, defusedxml, decorator, debugpy, attrs, asttokens, terminado, stack-data, matplotlib-inline, jupyterlab-pygments, jupyter-core, jsonschema, jinja2, jedi, cffi, bleach, nbformat, jupyter-client, ipython, argon2-cffi-bindings, nbclient, ipykernel, argon2-cffi, nbconvert, notebook, widgetsnbextension, ipywidgets
Successfully installed MarkupSafe-2.1.0 Send2Trash-1.8.0 appnope-0.1.2 argon2-cffi-21.3.0 argon2-cffi-bindings-21.2.0 asttokens-2.0.5 attrs-21.4.0 backcall-0.2.0 bleach-4.1.0 cffi-1.15.0 debugpy-1.5.1 decorator-5.1.1 defusedxml-0.7.1 entrypoints-0.4 executing-0.8.3 ipykernel-6.9.1 ipython-8.1.0 ipython-genutils-0.2.0 ipywidgets-7.6.5 jedi-0.18.1 jinja2-3.0.3 jsonschema-4.4.0 jupyter-client-7.1.2 jupyter-core-4.9.2 jupyterlab-pygments-0.1.2 jupyterlab-widgets-1.0.2 matplotlib-inline-0.1.3 mistune-0.8.4 nbclient-0.5.11 nbconvert-6.4.2 nbformat-5.1.3 nest-asyncio-1.5.4 notebook-6.4.8 pandocfilters-1.5.0 parso-0.8.3 pexpect-4.8.0 pickleshare-0.7.5 prometheus-client-0.13.1 prompt-toolkit-3.0.28 ptyprocess-0.7.0 pure-eval-0.2.2 pycparser-2.21 pygments-2.11.2 pyrsistent-0.18.1 pyzmq-22.3.0 stack-data-0.2.0 terminado-0.13.1 testpath-0.6.0 tornado-6.1 traitlets-5.1.1 wcwidth-0.2.5 webencodings-0.5.1 widgetsnbextension-3.5.2

real	0m23.043s
user	0m12.504s
sys	0m3.004s
+++ pip_install ipysankeywidget
+++ python /Users/jenkins/workspace/CE_gpkit_PR_research_models/buildnode/macys/optimizer/cvxopt/venv_jenkins/bin/pip install --upgrade ipysankeywidget
Collecting ipysankeywidget
  Using cached ipysankeywidget-0.4.1-py2.py3-none-any.whl (1.2 MB)
Requirement already satisfied: ipywidgets>=7.0.0 in ./venv_jenkins/lib/python3.9/site-packages (from ipysankeywidget) (7.6.5)
Requirement already satisfied: widgetsnbextension~=3.5.0 in ./venv_jenkins/lib/python3.9/site-packages (from ipywidgets>=7.0.0->ipysankeywidget) (3.5.2)
Requirement already satisfied: ipykernel>=4.5.1 in ./venv_jenkins/lib/python3.9/site-packages (from ipywidgets>=7.0.0->ipysankeywidget) (6.9.1)
Requirement already satisfied: ipython>=4.0.0 in ./venv_jenkins/lib/python3.9/site-packages (from ipywidgets>=7.0.0->ipysankeywidget) (8.1.0)
Requirement already satisfied: traitlets>=4.3.1 in ./venv_jenkins/lib/python3.9/site-packages (from ipywidgets>=7.0.0->ipysankeywidget) (5.1.1)
Requirement already satisfied: jupyterlab-widgets>=1.0.0 in ./venv_jenkins/lib/python3.9/site-packages (from ipywidgets>=7.0.0->ipysankeywidget) (1.0.2)
Requirement already satisfied: nbformat>=4.2.0 in ./venv_jenkins/lib/python3.9/site-packages (from ipywidgets>=7.0.0->ipysankeywidget) (5.1.3)
Requirement already satisfied: ipython-genutils~=0.2.0 in ./venv_jenkins/lib/python3.9/site-packages (from ipywidgets>=7.0.0->ipysankeywidget) (0.2.0)
Requirement already satisfied: debugpy<2.0,>=1.0.0 in ./venv_jenkins/lib/python3.9/site-packages (from ipykernel>=4.5.1->ipywidgets>=7.0.0->ipysankeywidget) (1.5.1)
Requirement already satisfied: matplotlib-inline<0.2.0,>=0.1.0 in ./venv_jenkins/lib/python3.9/site-packages (from ipykernel>=4.5.1->ipywidgets>=7.0.0->ipysankeywidget) (0.1.3)
Requirement already satisfied: jupyter-client<8.0 in ./venv_jenkins/lib/python3.9/site-packages (from ipykernel>=4.5.1->ipywidgets>=7.0.0->ipysankeywidget) (7.1.2)
Requirement already satisfied: nest-asyncio in ./venv_jenkins/lib/python3.9/site-packages (from ipykernel>=4.5.1->ipywidgets>=7.0.0->ipysankeywidget) (1.5.4)
Requirement already satisfied: tornado<7.0,>=4.2 in ./venv_jenkins/lib/python3.9/site-packages (from ipykernel>=4.5.1->ipywidgets>=7.0.0->ipysankeywidget) (6.1)
Requirement already satisfied: appnope in ./venv_jenkins/lib/python3.9/site-packages (from ipykernel>=4.5.1->ipywidgets>=7.0.0->ipysankeywidget) (0.1.2)
Requirement already satisfied: decorator in ./venv_jenkins/lib/python3.9/site-packages (from ipython>=4.0.0->ipywidgets>=7.0.0->ipysankeywidget) (5.1.1)
Requirement already satisfied: stack-data in ./venv_jenkins/lib/python3.9/site-packages (from ipython>=4.0.0->ipywidgets>=7.0.0->ipysankeywidget) (0.2.0)
Requirement already satisfied: backcall in ./venv_jenkins/lib/python3.9/site-packages (from ipython>=4.0.0->ipywidgets>=7.0.0->ipysankeywidget) (0.2.0)
Requirement already satisfied: jedi>=0.16 in ./venv_jenkins/lib/python3.9/site-packages (from ipython>=4.0.0->ipywidgets>=7.0.0->ipysankeywidget) (0.18.1)
Requirement already satisfied: prompt-toolkit!=3.0.0,!=3.0.1,<3.1.0,>=2.0.0 in ./venv_jenkins/lib/python3.9/site-packages (from ipython>=4.0.0->ipywidgets>=7.0.0->ipysankeywidget) (3.0.28)
Requirement already satisfied: pickleshare in ./venv_jenkins/lib/python3.9/site-packages (from ipython>=4.0.0->ipywidgets>=7.0.0->ipysankeywidget) (0.7.5)
Requirement already satisfied: setuptools>=18.5 in ./venv_jenkins/lib/python3.9/site-packages (from ipython>=4.0.0->ipywidgets>=7.0.0->ipysankeywidget) (60.6.0)
Requirement already satisfied: pexpect>4.3 in ./venv_jenkins/lib/python3.9/site-packages (from ipython>=4.0.0->ipywidgets>=7.0.0->ipysankeywidget) (4.8.0)
Requirement already satisfied: pygments>=2.4.0 in ./venv_jenkins/lib/python3.9/site-packages (from ipython>=4.0.0->ipywidgets>=7.0.0->ipysankeywidget) (2.11.2)
Requirement already satisfied: jsonschema!=2.5.0,>=2.4 in ./venv_jenkins/lib/python3.9/site-packages (from nbformat>=4.2.0->ipywidgets>=7.0.0->ipysankeywidget) (4.4.0)
Requirement already satisfied: jupyter-core in ./venv_jenkins/lib/python3.9/site-packages (from nbformat>=4.2.0->ipywidgets>=7.0.0->ipysankeywidget) (4.9.2)
Requirement already satisfied: notebook>=4.4.1 in ./venv_jenkins/lib/python3.9/site-packages (from widgetsnbextension~=3.5.0->ipywidgets>=7.0.0->ipysankeywidget) (6.4.8)
Requirement already satisfied: parso<0.9.0,>=0.8.0 in ./venv_jenkins/lib/python3.9/site-packages (from jedi>=0.16->ipython>=4.0.0->ipywidgets>=7.0.0->ipysankeywidget) (0.8.3)
Requirement already satisfied: attrs>=17.4.0 in ./venv_jenkins/lib/python3.9/site-packages (from jsonschema!=2.5.0,>=2.4->nbformat>=4.2.0->ipywidgets>=7.0.0->ipysankeywidget) (21.4.0)
Requirement already satisfied: pyrsistent!=0.17.0,!=0.17.1,!=0.17.2,>=0.14.0 in ./venv_jenkins/lib/python3.9/site-packages (from jsonschema!=2.5.0,>=2.4->nbformat>=4.2.0->ipywidgets>=7.0.0->ipysankeywidget) (0.18.1)
Requirement already satisfied: entrypoints in ./venv_jenkins/lib/python3.9/site-packages (from jupyter-client<8.0->ipykernel>=4.5.1->ipywidgets>=7.0.0->ipysankeywidget) (0.4)
Requirement already satisfied: python-dateutil>=2.1 in ./venv_jenkins/lib/python3.9/site-packages (from jupyter-client<8.0->ipykernel>=4.5.1->ipywidgets>=7.0.0->ipysankeywidget) (2.8.2)
Requirement already satisfied: pyzmq>=13 in ./venv_jenkins/lib/python3.9/site-packages (from jupyter-client<8.0->ipykernel>=4.5.1->ipywidgets>=7.0.0->ipysankeywidget) (22.3.0)
Requirement already satisfied: argon2-cffi in ./venv_jenkins/lib/python3.9/site-packages (from notebook>=4.4.1->widgetsnbextension~=3.5.0->ipywidgets>=7.0.0->ipysankeywidget) (21.3.0)
Requirement already satisfied: jinja2 in ./venv_jenkins/lib/python3.9/site-packages (from notebook>=4.4.1->widgetsnbextension~=3.5.0->ipywidgets>=7.0.0->ipysankeywidget) (3.0.3)
Requirement already satisfied: Send2Trash>=1.8.0 in ./venv_jenkins/lib/python3.9/site-packages (from notebook>=4.4.1->widgetsnbextension~=3.5.0->ipywidgets>=7.0.0->ipysankeywidget) (1.8.0)
Requirement already satisfied: terminado>=0.8.3 in ./venv_jenkins/lib/python3.9/site-packages (from notebook>=4.4.1->widgetsnbextension~=3.5.0->ipywidgets>=7.0.0->ipysankeywidget) (0.13.1)
Requirement already satisfied: prometheus-client in ./venv_jenkins/lib/python3.9/site-packages (from notebook>=4.4.1->widgetsnbextension~=3.5.0->ipywidgets>=7.0.0->ipysankeywidget) (0.13.1)
Requirement already satisfied: nbconvert in ./venv_jenkins/lib/python3.9/site-packages (from notebook>=4.4.1->widgetsnbextension~=3.5.0->ipywidgets>=7.0.0->ipysankeywidget) (6.4.2)
Requirement already satisfied: ptyprocess>=0.5 in ./venv_jenkins/lib/python3.9/site-packages (from pexpect>4.3->ipython>=4.0.0->ipywidgets>=7.0.0->ipysankeywidget) (0.7.0)
Requirement already satisfied: wcwidth in ./venv_jenkins/lib/python3.9/site-packages (from prompt-toolkit!=3.0.0,!=3.0.1,<3.1.0,>=2.0.0->ipython>=4.0.0->ipywidgets>=7.0.0->ipysankeywidget) (0.2.5)
Requirement already satisfied: asttokens in ./venv_jenkins/lib/python3.9/site-packages (from stack-data->ipython>=4.0.0->ipywidgets>=7.0.0->ipysankeywidget) (2.0.5)
Requirement already satisfied: executing in ./venv_jenkins/lib/python3.9/site-packages (from stack-data->ipython>=4.0.0->ipywidgets>=7.0.0->ipysankeywidget) (0.8.3)
Requirement already satisfied: pure-eval in ./venv_jenkins/lib/python3.9/site-packages (from stack-data->ipython>=4.0.0->ipywidgets>=7.0.0->ipysankeywidget) (0.2.2)
Requirement already satisfied: six>=1.5 in ./venv_jenkins/lib/python3.9/site-packages (from python-dateutil>=2.1->jupyter-client<8.0->ipykernel>=4.5.1->ipywidgets>=7.0.0->ipysankeywidget) (1.16.0)
Requirement already satisfied: argon2-cffi-bindings in ./venv_jenkins/lib/python3.9/site-packages (from argon2-cffi->notebook>=4.4.1->widgetsnbextension~=3.5.0->ipywidgets>=7.0.0->ipysankeywidget) (21.2.0)
Requirement already satisfied: MarkupSafe>=2.0 in ./venv_jenkins/lib/python3.9/site-packages (from jinja2->notebook>=4.4.1->widgetsnbextension~=3.5.0->ipywidgets>=7.0.0->ipysankeywidget) (2.1.0)
Requirement already satisfied: pandocfilters>=1.4.1 in ./venv_jenkins/lib/python3.9/site-packages (from nbconvert->notebook>=4.4.1->widgetsnbextension~=3.5.0->ipywidgets>=7.0.0->ipysankeywidget) (1.5.0)
Requirement already satisfied: defusedxml in ./venv_jenkins/lib/python3.9/site-packages (from nbconvert->notebook>=4.4.1->widgetsnbextension~=3.5.0->ipywidgets>=7.0.0->ipysankeywidget) (0.7.1)
Requirement already satisfied: bleach in ./venv_jenkins/lib/python3.9/site-packages (from nbconvert->notebook>=4.4.1->widgetsnbextension~=3.5.0->ipywidgets>=7.0.0->ipysankeywidget) (4.1.0)
Requirement already satisfied: jupyterlab-pygments in ./venv_jenkins/lib/python3.9/site-packages (from nbconvert->notebook>=4.4.1->widgetsnbextension~=3.5.0->ipywidgets>=7.0.0->ipysankeywidget) (0.1.2)
Requirement already satisfied: nbclient<0.6.0,>=0.5.0 in ./venv_jenkins/lib/python3.9/site-packages (from nbconvert->notebook>=4.4.1->widgetsnbextension~=3.5.0->ipywidgets>=7.0.0->ipysankeywidget) (0.5.11)
Requirement already satisfied: mistune<2,>=0.8.1 in ./venv_jenkins/lib/python3.9/site-packages (from nbconvert->notebook>=4.4.1->widgetsnbextension~=3.5.0->ipywidgets>=7.0.0->ipysankeywidget) (0.8.4)
Requirement already satisfied: testpath in ./venv_jenkins/lib/python3.9/site-packages (from nbconvert->notebook>=4.4.1->widgetsnbextension~=3.5.0->ipywidgets>=7.0.0->ipysankeywidget) (0.6.0)
Requirement already satisfied: cffi>=1.0.1 in ./venv_jenkins/lib/python3.9/site-packages (from argon2-cffi-bindings->argon2-cffi->notebook>=4.4.1->widgetsnbextension~=3.5.0->ipywidgets>=7.0.0->ipysankeywidget) (1.15.0)
Requirement already satisfied: packaging in ./venv_jenkins/lib/python3.9/site-packages (from bleach->nbconvert->notebook>=4.4.1->widgetsnbextension~=3.5.0->ipywidgets>=7.0.0->ipysankeywidget) (21.3)
Requirement already satisfied: webencodings in ./venv_jenkins/lib/python3.9/site-packages (from bleach->nbconvert->notebook>=4.4.1->widgetsnbextension~=3.5.0->ipywidgets>=7.0.0->ipysankeywidget) (0.5.1)
Requirement already satisfied: pycparser in ./venv_jenkins/lib/python3.9/site-packages (from cffi>=1.0.1->argon2-cffi-bindings->argon2-cffi->notebook>=4.4.1->widgetsnbextension~=3.5.0->ipywidgets>=7.0.0->ipysankeywidget) (2.21)
Requirement already satisfied: pyparsing!=3.0.5,>=2.0.2 in ./venv_jenkins/lib/python3.9/site-packages (from packaging->bleach->nbconvert->notebook>=4.4.1->widgetsnbextension~=3.5.0->ipywidgets>=7.0.0->ipysankeywidget) (3.0.7)
Installing collected packages: ipysankeywidget
Successfully installed ipysankeywidget-0.4.1

real	0m2.189s
user	0m1.574s
sys	0m0.173s
+++ pip_install plotly
+++ python /Users/jenkins/workspace/CE_gpkit_PR_research_models/buildnode/macys/optimizer/cvxopt/venv_jenkins/bin/pip install --upgrade plotly
Collecting plotly
  Using cached plotly-5.6.0-py2.py3-none-any.whl (27.7 MB)
Requirement already satisfied: six in ./venv_jenkins/lib/python3.9/site-packages (from plotly) (1.16.0)
Collecting tenacity>=6.2.0
  Using cached tenacity-8.0.1-py3-none-any.whl (24 kB)
Installing collected packages: tenacity, plotly
Successfully installed plotly-5.6.0 tenacity-8.0.1

real	0m28.193s
user	0m11.053s
sys	0m8.574s
+++ pip_install pytest
+++ python /Users/jenkins/workspace/CE_gpkit_PR_research_models/buildnode/macys/optimizer/cvxopt/venv_jenkins/bin/pip install --upgrade pytest
Collecting pytest
  Using cached pytest-7.0.1-py3-none-any.whl (296 kB)
Collecting tomli>=1.0.0
  Using cached tomli-2.0.1-py3-none-any.whl (12 kB)
Collecting py>=1.8.2
  Using cached py-1.11.0-py2.py3-none-any.whl (98 kB)
Collecting pluggy<2.0,>=0.12
  Using cached pluggy-1.0.0-py2.py3-none-any.whl (13 kB)
Collecting iniconfig
  Using cached iniconfig-1.1.1-py2.py3-none-any.whl (5.0 kB)
Requirement already satisfied: packaging in ./venv_jenkins/lib/python3.9/site-packages (from pytest) (21.3)
Requirement already satisfied: attrs>=19.2.0 in ./venv_jenkins/lib/python3.9/site-packages (from pytest) (21.4.0)
Requirement already satisfied: pyparsing!=3.0.5,>=2.0.2 in ./venv_jenkins/lib/python3.9/site-packages (from packaging->pytest) (3.0.7)
Installing collected packages: iniconfig, tomli, py, pluggy, pytest
Successfully installed iniconfig-1.1.1 pluggy-1.0.0 py-1.11.0 pytest-7.0.1 tomli-2.0.1

real	0m3.438s
user	0m1.998s
sys	0m0.281s
++++ which coverage
+++ export COVERAGE=/Users/jenkins/workspace/CE_gpkit_PR_research_models/buildnode/macys/optimizer/cvxopt/venv_jenkins/bin/coverage
+++ COVERAGE=/Users/jenkins/workspace/CE_gpkit_PR_research_models/buildnode/macys/optimizer/cvxopt/venv_jenkins/bin/coverage
++ pip_install numpy
++ python /Users/jenkins/workspace/CE_gpkit_PR_research_models/buildnode/macys/optimizer/cvxopt/venv_jenkins/bin/pip install --upgrade numpy
Requirement already satisfied: numpy in ./venv_jenkins/lib/python3.9/site-packages (1.22.2)

real	0m3.061s
user	0m2.121s
sys	0m0.146s
++ pip_install scipy
++ python /Users/jenkins/workspace/CE_gpkit_PR_research_models/buildnode/macys/optimizer/cvxopt/venv_jenkins/bin/pip install --upgrade scipy
Collecting scipy
  Using cached scipy-1.8.0-cp39-cp39-macosx_12_0_universal2.macosx_10_9_x86_64.whl (55.6 MB)
Requirement already satisfied: numpy<1.25.0,>=1.17.3 in ./venv_jenkins/lib/python3.9/site-packages (from scipy) (1.22.2)
Installing collected packages: scipy
Successfully installed scipy-1.8.0

real	0m10.362s
user	0m5.984s
sys	0m1.336s
++ pip_install pint
++ python /Users/jenkins/workspace/CE_gpkit_PR_research_models/buildnode/macys/optimizer/cvxopt/venv_jenkins/bin/pip install --upgrade pint
Collecting pint
  Using cached Pint-0.18-py2.py3-none-any.whl (209 kB)
Requirement already satisfied: packaging in ./venv_jenkins/lib/python3.9/site-packages (from pint) (21.3)
Requirement already satisfied: pyparsing!=3.0.5,>=2.0.2 in ./venv_jenkins/lib/python3.9/site-packages (from packaging->pint) (3.0.7)
Installing collected packages: pint
Successfully installed pint-0.18

real	0m2.288s
user	0m1.505s
sys	0m0.197s
++ source /Users/jenkins/workspace/CE_gpkit_PR_research_models/buildnode/macys/optimizer/cvxopt/JenkinsGPkit/print_versions.sh
+++ python -c 'import scipy; print(scipy.__version__)'
1.8.0
+++ python -c 'import numpy; print(numpy.__version__)'
1.22.2
+++ python -c 'import pint; print(pint.__version__)'
0.18
+++ python -c 'import gpkit; print(gpkit.settings)'
/bin/sh: mskexpopt: command not found
No filename given.
Usage:
     mskexpopt FILENAME [-primal] [-dual] [-p parameterfile]
Return code: 1052
Description: MSK_RES_ERR_FILE_OPEN [An error occurred while opening a file.]
/Users/jenkins/workspace/CE_gpkit_PR_research_models/buildnode/macys/optimizer/cvxopt/gpkit/small_scripts.py:71: SyntaxWarning: "is" with a literal. Did you mean "=="?
  if sweep is "sweep" and (isinstance(value, Iterable) or  # pylint: disable=literal-comparison
/Users/jenkins/workspace/CE_gpkit_PR_research_models/buildnode/macys/optimizer/cvxopt/gpkit/nomials/math.py:586: SyntaxWarning: "is" with a literal. Did you mean "=="?
  if posy is 0:  # pylint: disable=literal-comparison
/Users/jenkins/workspace/CE_gpkit_PR_research_models/buildnode/macys/optimizer/cvxopt/gpkit/nomials/math.py:590: SyntaxWarning: "is" with a literal. Did you mean "=="?
  if negy is 0:  # pylint: disable=literal-comparison
/Users/jenkins/workspace/CE_gpkit_PR_research_models/buildnode/macys/optimizer/cvxopt/gpkit/breakdowns.py:390: SyntaxWarning: "is" with a literal. Did you mean "=="?
  subhmap.units = None if units is 1 else units
.................................................................................................................................................................................................................
----------------------------------------------------------------------
Ran 209 tests in 16.853s

OK
Found no installed solvers, beginning a build.
# Building GPkit version 1.1
# Moving to the directory from which GPkit was imported.

Attempting to find and build solvers:

# Looking for `mosek_cli`
#   (A "success" is if mskexpopt complains that
#    we haven't specified a file for it to open.)
#     Calling 'mskexpopt'
##
### CALL BEGINS
### CALL ENDS
##
# Looks like `mskexpopt` was not found in the default PATH,
#  so let's try locating that binary ourselves.
#   Adding /Users/jenkins/mosek/8/tools/platform/osx64x86/bin to the PATH
#     Calling 'mskexpopt'
##
### CALL BEGINS
### CALL ENDS
##

Found mosek_cli in /Users/jenkins/mosek/8/tools/platform/osx64x86/bin

# Looking for `mosek_conif`
#   Trying to import mosek...
# Did not find
# mosek_conif

# Looking for `cvxopt`
#   Trying to import cvxopt...

Found cvxopt in the default PYTHONPATH
Replaced found solvers (['mosek_cli', 'cvxopt']) with environment var GPKITSOLVERS (cvxopt)

Found the following solvers: cvxopt
#     Replacing directory env

GPkit is now installed with solver(s) ['cvxopt']
To incorporate new solvers at a later date, run `gpkit.build()`.

If any tests didn't pass, please post the output above
(starting from "Found no installed solvers, beginning a build.")
to gpkit@mit.edu or https://github.com/convexengineering/gpkit/issues/new
so we can prevent others from having these errors.

The same goes for any other bugs you encounter with GPkit:
send 'em our way, along with any interesting models, speculative features,
comments, discussions, or clarifications you feel like sharing.

Finally, we hope you find our documentation (https://gpkit.readthedocs.io/)
and engineering-design models (https://github.com/convexengineering/gplibrary/)
to be useful resources for your own applications.

Enjoy!

{'installed_solvers': ['cvxopt'], 'mosek_bin_dir': '/Users/jenkins/mosek/8/tools/platform/osx64x86/bin', 'default_solver': 'cvxopt', 'just built!': True}
++ python /Users/jenkins/workspace/CE_gpkit_PR_research_models/buildnode/macys/optimizer/cvxopt/venv_jenkins/bin/pip install --no-cache-dir -e /Users/jenkins/workspace/CE_gpkit_PR_research_models/buildnode/macys/optimizer/cvxopt/
Obtaining file:///Users/jenkins/workspace/CE_gpkit_PR_research_models/buildnode/macys/optimizer/cvxopt
  Preparing metadata (setup.py): started
  Preparing metadata (setup.py): finished with status 'done'
Requirement already satisfied: numpy>=1.16.4 in ./venv_jenkins/lib/python3.9/site-packages (from gpkit==1.1.1) (1.22.2)
Requirement already satisfied: pint>=0.8.1 in ./venv_jenkins/lib/python3.9/site-packages (from gpkit==1.1.1) (0.18)
Requirement already satisfied: plotly in ./venv_jenkins/lib/python3.9/site-packages (from gpkit==1.1.1) (5.6.0)
Requirement already satisfied: scipy in ./venv_jenkins/lib/python3.9/site-packages (from gpkit==1.1.1) (1.8.0)
Requirement already satisfied: adce in ./venv_jenkins/lib/python3.9/site-packages (from gpkit==1.1.1) (1.3.3.2)
Requirement already satisfied: cvxopt>=1.1.8 in ./venv_jenkins/lib/python3.9/site-packages (from gpkit==1.1.1) (1.2.7)
Requirement already satisfied: matplotlib in ./venv_jenkins/lib/python3.9/site-packages (from gpkit==1.1.1) (3.5.1)
Requirement already satisfied: packaging in ./venv_jenkins/lib/python3.9/site-packages (from pint>=0.8.1->gpkit==1.1.1) (21.3)
Requirement already satisfied: python-dateutil>=2.7 in ./venv_jenkins/lib/python3.9/site-packages (from matplotlib->gpkit==1.1.1) (2.8.2)
Requirement already satisfied: pillow>=6.2.0 in ./venv_jenkins/lib/python3.9/site-packages (from matplotlib->gpkit==1.1.1) (9.0.1)
Requirement already satisfied: pyparsing>=2.2.1 in ./venv_jenkins/lib/python3.9/site-packages (from matplotlib->gpkit==1.1.1) (3.0.7)
Requirement already satisfied: cycler>=0.10 in ./venv_jenkins/lib/python3.9/site-packages (from matplotlib->gpkit==1.1.1) (0.11.0)
Requirement already satisfied: fonttools>=4.22.0 in ./venv_jenkins/lib/python3.9/site-packages (from matplotlib->gpkit==1.1.1) (4.29.1)
Requirement already satisfied: kiwisolver>=1.0.1 in ./venv_jenkins/lib/python3.9/site-packages (from matplotlib->gpkit==1.1.1) (1.3.2)
Requirement already satisfied: six in ./venv_jenkins/lib/python3.9/site-packages (from plotly->gpkit==1.1.1) (1.16.0)
Requirement already satisfied: tenacity>=6.2.0 in ./venv_jenkins/lib/python3.9/site-packages (from plotly->gpkit==1.1.1) (8.0.1)
Installing collected packages: gpkit
  Running setup.py develop for gpkit
Successfully installed gpkit-1.1.1
++ export MSK_IPAR_NUM_THREADS=2
++ MSK_IPAR_NUM_THREADS=2
++ export MKL_NUM_THREADS=2
++ MKL_NUM_THREADS=2
++ export NUMEXPR_NUM_THREADS=2
++ NUMEXPR_NUM_THREADS=2
++ export OPENBLAS_NUM_THREADS=2
++ OPENBLAS_NUM_THREADS=2
++ export OMP_NUM_THREADS=2
++ OMP_NUM_THREADS=2
++ python -c 'from gpkit.tests.test_repo import test_repos; test_repos(xmloutput=True)'
/bin/sh: mskexpopt: command not found
No filename given.
Usage:
     mskexpopt FILENAME [-primal] [-dual] [-p parameterfile]
Return code: 1052
Description: MSK_RES_ERR_FILE_OPEN [An error occurred while opening a file.]
.................................................................................................................................................................................................................
----------------------------------------------------------------------
Ran 209 tests in 11.717s

OK
Cloning into 'gplibrary'...
Obtaining file:///Users/jenkins/workspace/CE_gpkit_PR_research_models/buildnode/macys/optimizer/cvxopt/gplibrary
  Preparing metadata (setup.py): started
  Preparing metadata (setup.py): finished with status 'done'
Installing collected packages: gpkitmodels
  Running setup.py develop for gpkitmodels
Successfully installed gpkitmodels
Cloning into 'SPaircraft'...
Collecting git+https://github.com/hoburg/turbofan.git
  Cloning https://github.com/hoburg/turbofan.git to /private/var/folders/xs/_fh4l1p54zqcl6mbk4zclcfr0000gp/T/pip-req-build-v3y_psyv
  Running command git clone --filter=blob:none --quiet https://github.com/hoburg/turbofan.git /private/var/folders/xs/_fh4l1p54zqcl6mbk4zclcfr0000gp/T/pip-req-build-v3y_psyv
  Resolved https://github.com/hoburg/turbofan.git to commit 4ebac5743e608d110117dc34537add84f63ccd19
  Preparing metadata (setup.py): started
  Preparing metadata (setup.py): finished with status 'done'
Requirement already satisfied: numpy in /Users/jenkins/workspace/CE_gpkit_PR_research_models/buildnode/macys/optimizer/cvxopt/venv_jenkins/lib/python3.9/site-packages (from turbofan==0.0.0.0) (1.22.2)
Requirement already satisfied: scipy in /Users/jenkins/workspace/CE_gpkit_PR_research_models/buildnode/macys/optimizer/cvxopt/venv_jenkins/lib/python3.9/site-packages (from turbofan==0.0.0.0) (1.8.0)
Requirement already satisfied: pint in /Users/jenkins/workspace/CE_gpkit_PR_research_models/buildnode/macys/optimizer/cvxopt/venv_jenkins/lib/python3.9/site-packages (from turbofan==0.0.0.0) (0.18)
Collecting future
  Using cached future-0.18.2-py3-none-any.whl
Requirement already satisfied: packaging in /Users/jenkins/workspace/CE_gpkit_PR_research_models/buildnode/macys/optimizer/cvxopt/venv_jenkins/lib/python3.9/site-packages (from pint->turbofan==0.0.0.0) (21.3)
Requirement already satisfied: pyparsing!=3.0.5,>=2.0.2 in /Users/jenkins/workspace/CE_gpkit_PR_research_models/buildnode/macys/optimizer/cvxopt/venv_jenkins/lib/python3.9/site-packages (from packaging->pint->turbofan==0.0.0.0) (3.0.7)
Building wheels for collected packages: turbofan
  Building wheel for turbofan (setup.py): started
  Building wheel for turbofan (setup.py): finished with status 'done'
  Created wheel for turbofan: filename=turbofan-0.0.0.0-py3-none-any.whl size=43849 sha256=81e3afbd49e31025a1cc1f0f25e83cc800cbb3dfe2794b35b45e6b741817425c
  Stored in directory: /private/var/folders/xs/_fh4l1p54zqcl6mbk4zclcfr0000gp/T/pip-ephem-wheel-cache-y9itpb3c/wheels/d7/9f/b9/a8875d37f2740d561f7ca84d6af59091975c6b21d1b7f0369c
Successfully built turbofan
Installing collected packages: future, turbofan
Successfully installed future-0.18.2 turbofan-0.0.0.0
Processing /Users/jenkins/workspace/CE_gpkit_PR_research_models/buildnode/macys/optimizer/cvxopt/SPaircraft
  Preparing metadata (setup.py): started
  Preparing metadata (setup.py): finished with status 'done'
Requirement already satisfied: turbofan in /Users/jenkins/workspace/CE_gpkit_PR_research_models/buildnode/macys/optimizer/cvxopt/venv_jenkins/lib/python3.9/site-packages (from SPaircraft==0.0.0) (0.0.0.0)
Requirement already satisfied: gpkit in /Users/jenkins/workspace/CE_gpkit_PR_research_models/buildnode/macys/optimizer/cvxopt (from SPaircraft==0.0.0) (1.1.1)
Requirement already satisfied: future in /Users/jenkins/workspace/CE_gpkit_PR_research_models/buildnode/macys/optimizer/cvxopt/venv_jenkins/lib/python3.9/site-packages (from SPaircraft==0.0.0) (0.18.2)
Requirement already satisfied: numpy>=1.16.4 in /Users/jenkins/workspace/CE_gpkit_PR_research_models/buildnode/macys/optimizer/cvxopt/venv_jenkins/lib/python3.9/site-packages (from gpkit->SPaircraft==0.0.0) (1.22.2)
Requirement already satisfied: pint>=0.8.1 in /Users/jenkins/workspace/CE_gpkit_PR_research_models/buildnode/macys/optimizer/cvxopt/venv_jenkins/lib/python3.9/site-packages (from gpkit->SPaircraft==0.0.0) (0.18)
Requirement already satisfied: plotly in /Users/jenkins/workspace/CE_gpkit_PR_research_models/buildnode/macys/optimizer/cvxopt/venv_jenkins/lib/python3.9/site-packages (from gpkit->SPaircraft==0.0.0) (5.6.0)
Requirement already satisfied: scipy in /Users/jenkins/workspace/CE_gpkit_PR_research_models/buildnode/macys/optimizer/cvxopt/venv_jenkins/lib/python3.9/site-packages (from gpkit->SPaircraft==0.0.0) (1.8.0)
Requirement already satisfied: adce in /Users/jenkins/workspace/CE_gpkit_PR_research_models/buildnode/macys/optimizer/cvxopt/venv_jenkins/lib/python3.9/site-packages (from gpkit->SPaircraft==0.0.0) (1.3.3.2)
Requirement already satisfied: cvxopt>=1.1.8 in /Users/jenkins/workspace/CE_gpkit_PR_research_models/buildnode/macys/optimizer/cvxopt/venv_jenkins/lib/python3.9/site-packages (from gpkit->SPaircraft==0.0.0) (1.2.7)
Requirement already satisfied: matplotlib in /Users/jenkins/workspace/CE_gpkit_PR_research_models/buildnode/macys/optimizer/cvxopt/venv_jenkins/lib/python3.9/site-packages (from gpkit->SPaircraft==0.0.0) (3.5.1)
Requirement already satisfied: packaging in /Users/jenkins/workspace/CE_gpkit_PR_research_models/buildnode/macys/optimizer/cvxopt/venv_jenkins/lib/python3.9/site-packages (from pint>=0.8.1->gpkit->SPaircraft==0.0.0) (21.3)
Requirement already satisfied: fonttools>=4.22.0 in /Users/jenkins/workspace/CE_gpkit_PR_research_models/buildnode/macys/optimizer/cvxopt/venv_jenkins/lib/python3.9/site-packages (from matplotlib->gpkit->SPaircraft==0.0.0) (4.29.1)
Requirement already satisfied: python-dateutil>=2.7 in /Users/jenkins/workspace/CE_gpkit_PR_research_models/buildnode/macys/optimizer/cvxopt/venv_jenkins/lib/python3.9/site-packages (from matplotlib->gpkit->SPaircraft==0.0.0) (2.8.2)
Requirement already satisfied: pillow>=6.2.0 in /Users/jenkins/workspace/CE_gpkit_PR_research_models/buildnode/macys/optimizer/cvxopt/venv_jenkins/lib/python3.9/site-packages (from matplotlib->gpkit->SPaircraft==0.0.0) (9.0.1)
Requirement already satisfied: kiwisolver>=1.0.1 in /Users/jenkins/workspace/CE_gpkit_PR_research_models/buildnode/macys/optimizer/cvxopt/venv_jenkins/lib/python3.9/site-packages (from matplotlib->gpkit->SPaircraft==0.0.0) (1.3.2)
Requirement already satisfied: pyparsing>=2.2.1 in /Users/jenkins/workspace/CE_gpkit_PR_research_models/buildnode/macys/optimizer/cvxopt/venv_jenkins/lib/python3.9/site-packages (from matplotlib->gpkit->SPaircraft==0.0.0) (3.0.7)
Requirement already satisfied: cycler>=0.10 in /Users/jenkins/workspace/CE_gpkit_PR_research_models/buildnode/macys/optimizer/cvxopt/venv_jenkins/lib/python3.9/site-packages (from matplotlib->gpkit->SPaircraft==0.0.0) (0.11.0)
Requirement already satisfied: six in /Users/jenkins/workspace/CE_gpkit_PR_research_models/buildnode/macys/optimizer/cvxopt/venv_jenkins/lib/python3.9/site-packages (from plotly->gpkit->SPaircraft==0.0.0) (1.16.0)
Requirement already satisfied: tenacity>=6.2.0 in /Users/jenkins/workspace/CE_gpkit_PR_research_models/buildnode/macys/optimizer/cvxopt/venv_jenkins/lib/python3.9/site-packages (from plotly->gpkit->SPaircraft==0.0.0) (8.0.1)
Building wheels for collected packages: SPaircraft
  Building wheel for SPaircraft (setup.py): started
  Building wheel for SPaircraft (setup.py): finished with status 'done'
  Created wheel for SPaircraft: filename=SPaircraft-0.0.0-py3-none-any.whl size=1771 sha256=5f6d49bba4a192c996db86ae9825db49413abe4fe8c58f5b7e60f9b27c20f7de
  Stored in directory: /private/var/folders/xs/_fh4l1p54zqcl6mbk4zclcfr0000gp/T/pip-ephem-wheel-cache-3visbfni/wheels/0e/77/e0/2ff04e2375729082786ceda71041d0f289960daa7ca5cd23fd
Successfully built SPaircraft
Installing collected packages: SPaircraft
Successfully installed SPaircraft-0.0.0

Running tests...
----------------------------------------------------------------------
adding test for 'SPaircraft.py'
.
----------------------------------------------------------------------
Ran 1 test in 0.001s

OK

Generating XML reports...
Cloning into 'robust'...
Processing /Users/jenkins/workspace/CE_gpkit_PR_research_models/buildnode/macys/optimizer/cvxopt/robust
  Preparing metadata (setup.py): started
  Preparing metadata (setup.py): finished with status 'done'
Requirement already satisfied: gpkit in /Users/jenkins/workspace/CE_gpkit_PR_research_models/buildnode/macys/optimizer/cvxopt (from robust==0.0.0) (1.1.1)
ERROR: Could not find a version that satisfies the requirement gplibrary (from robust) (from versions: none)
ERROR: No matching distribution found for gplibrary
Processing /Users/jenkins/workspace/CE_gpkit_PR_research_models/buildnode/macys/optimizer/cvxopt/robust
  Preparing metadata (setup.py): started
  Preparing metadata (setup.py): finished with status 'done'
Requirement already satisfied: gpkit in /Users/jenkins/workspace/CE_gpkit_PR_research_models/buildnode/macys/optimizer/cvxopt (from robust==0.0.0) (1.1.1)
ERROR: Could not find a version that satisfies the requirement gplibrary (from robust) (from versions: none)
ERROR: No matching distribution found for gplibrary
Processing /Users/jenkins/workspace/CE_gpkit_PR_research_models/buildnode/macys/optimizer/cvxopt/robust
  Preparing metadata (setup.py): started
  Preparing metadata (setup.py): finished with status 'done'
Requirement already satisfied: gpkit in /Users/jenkins/workspace/CE_gpkit_PR_research_models/buildnode/macys/optimizer/cvxopt (from robust==0.0.0) (1.1.1)
ERROR: Could not find a version that satisfies the requirement gplibrary (from robust) (from versions: none)
ERROR: No matching distribution found for gplibrary
Processing /Users/jenkins/workspace/CE_gpkit_PR_research_models/buildnode/macys/optimizer/cvxopt/robust
  Preparing metadata (setup.py): started
  Preparing metadata (setup.py): finished with status 'done'
Requirement already satisfied: gpkit in /Users/jenkins/workspace/CE_gpkit_PR_research_models/buildnode/macys/optimizer/cvxopt (from robust==0.0.0) (1.1.1)
ERROR: Could not find a version that satisfies the requirement gplibrary (from robust) (from versions: none)
ERROR: No matching distribution found for gplibrary
Processing /Users/jenkins/workspace/CE_gpkit_PR_research_models/buildnode/macys/optimizer/cvxopt/robust
  Preparing metadata (setup.py): started
  Preparing metadata (setup.py): finished with status 'done'
Requirement already satisfied: gpkit in /Users/jenkins/workspace/CE_gpkit_PR_research_models/buildnode/macys/optimizer/cvxopt (from robust==0.0.0) (1.1.1)
ERROR: Could not find a version that satisfies the requirement gplibrary (from robust) (from versions: none)
ERROR: No matching distribution found for gplibrary

Running tests...
----------------------------------------------------------------------
adding test for 'run_tests.py'

Running tests...
----------------------------------------------------------------------
.F..........FF..F....
======================================================================
FAIL [0.010s]: test_correlated_monomials (run_tests.TestEquivalentPosynomials_cvxopt)
----------------------------------------------------------------------
Traceback (most recent call last):
  File "/Users/jenkins/workspace/CE_gpkit_PR_research_models/buildnode/macys/optimizer/cvxopt/robust/robust/testing/t_equivalent_posynomials.py", line 99, in test_correlated_monomials
    self.assertSetEqual(set(actual_posynomials), set(theoretical_posynomials))
AssertionError: Items in the first set but not the second:
gpkit.Posynomial(x_0^3·x_1^3.1·u_0^3.8/x_2^2.5 + x_1^1.2·x_0^3.8/x_2^4.2 + x_0^4.9·x_2^4.9/x_1^0.68)
Items in the second set but not the first:
gpkit.Posynomial(x_0^3·x_1^3.1·u_0^3.8/x_2^2.5 + x_0^2.266887911902451·x_1^-1.3729623929201349·x_2^1.8315703553659972·u_0^2.0890993299906944·u_1^0.0 + x_0^-2.756799532102602·x_1^-1.8377087295616135·x_2^-1.321079765211831·u_0^-2.4052169524731286·u_1^0.0)

======================================================================
FAIL [0.467s]: test_conservativeness (run_tests.TestPrimitives_cvxopt)
Testing conservativeness of solution methods
----------------------------------------------------------------------
Traceback (most recent call last):
  File "/Users/jenkins/workspace/CE_gpkit_PR_research_models/buildnode/macys/optimizer/cvxopt/robust/robust/testing/t_primitives.py", line 66, in test_conservativeness
    self.assertTrue(sm['cost'] <= sem['cost'] <= smm['cost'] <= sbm['cost'])
AssertionError: False is not true

======================================================================
FAIL [0.087s]: test_methods (run_tests.TestPrimitives_cvxopt)
----------------------------------------------------------------------
Traceback (most recent call last):
  File "/Users/jenkins/workspace/CE_gpkit_PR_research_models/buildnode/macys/optimizer/cvxopt/robust/robust/testing/t_primitives.py", line 117, in test_methods
    self.assertAlmostEqual(sol(vk), prev_sol(vk), places=5)
AssertionError: <Quantity(0.636130631, 'dimensionless')> != <Quantity(0.631384596, 'dimensionless')> within 5 places (<Quantity(0.0047460356, 'dimensionless')> difference)

======================================================================
FAIL [0.279s]: test_bad_relations (run_tests.TestTwoTermApproximation_cvxopt)
----------------------------------------------------------------------
Traceback (most recent call last):
  File "/Users/jenkins/workspace/CE_gpkit_PR_research_models/buildnode/macys/optimizer/cvxopt/robust/robust/testing/t_two_term_approximation.py", line 202, in test_bad_relations
    self.assertEqual(actual_relations_mons, relations_mons)
AssertionError: {gpkit.Monomial(9.99·u_54^0.023·u_25^0.57·x_5^1.2·x_4^1.3[25074 chars] 13}} != {gpkit.Monomial((π/1.2)·x_0^-4.79244535129725·x_1^-0.8772[100246 chars] 11}}
Diff is 212806 characters long. Set self.maxDiff to None to see it.

----------------------------------------------------------------------
Ran 21 tests in 21.429s

FAILED (failures=4)

Generating XML reports...
.
----------------------------------------------------------------------
Ran 1 test in 40.773s

OK

Generating XML reports...
Cloning into 'shopping'...

Running tests...
----------------------------------------------------------------------
adding test for 'test.py'
..Using solver 'cvxopt'
 for 25 free variables
  in 40 posynomial inequalities.
Solving took 0.0643 seconds.
Using solver 'cvxopt'
 for 25 free variables
  in 40 posynomial inequalities.
Solving took 0.0277 seconds.

----------------------------------------------------------------------
Ran 2 tests in 0.159s

OK

Generating XML reports...
Cloning into 'gassolar'...
Requirement already satisfied: pandas in /Users/jenkins/workspace/CE_gpkit_PR_research_models/buildnode/macys/optimizer/cvxopt/venv_jenkins/lib/python3.9/site-packages (1.4.1)
Requirement already satisfied: numpy>=1.18.5 in /Users/jenkins/workspace/CE_gpkit_PR_research_models/buildnode/macys/optimizer/cvxopt/venv_jenkins/lib/python3.9/site-packages (from pandas) (1.22.2)
Requirement already satisfied: pytz>=2020.1 in /Users/jenkins/workspace/CE_gpkit_PR_research_models/buildnode/macys/optimizer/cvxopt/venv_jenkins/lib/python3.9/site-packages (from pandas) (2021.3)
Requirement already satisfied: python-dateutil>=2.8.1 in /Users/jenkins/workspace/CE_gpkit_PR_research_models/buildnode/macys/optimizer/cvxopt/venv_jenkins/lib/python3.9/site-packages (from pandas) (2.8.2)
Requirement already satisfied: six>=1.5 in /Users/jenkins/workspace/CE_gpkit_PR_research_models/buildnode/macys/optimizer/cvxopt/venv_jenkins/lib/python3.9/site-packages (from python-dateutil>=2.8.1->pandas) (1.16.0)
Collecting git+https://github.com/hoburg/gpfit.git
  Cloning https://github.com/hoburg/gpfit.git to /private/var/folders/xs/_fh4l1p54zqcl6mbk4zclcfr0000gp/T/pip-req-build-qnamnvb2
  Running command git clone --filter=blob:none --quiet https://github.com/hoburg/gpfit.git /private/var/folders/xs/_fh4l1p54zqcl6mbk4zclcfr0000gp/T/pip-req-build-qnamnvb2
  Resolved https://github.com/hoburg/gpfit.git to commit 3c8025f12ba5360fdeb71c270e55d4c93e1676fd
  Preparing metadata (setup.py): started
  Preparing metadata (setup.py): finished with status 'done'
Requirement already satisfied: numpy in /Users/jenkins/workspace/CE_gpkit_PR_research_models/buildnode/macys/optimizer/cvxopt/venv_jenkins/lib/python3.9/site-packages (from gpfit==0.2.0) (1.22.2)
Requirement already satisfied: scipy in /Users/jenkins/workspace/CE_gpkit_PR_research_models/buildnode/macys/optimizer/cvxopt/venv_jenkins/lib/python3.9/site-packages (from gpfit==0.2.0) (1.8.0)
Requirement already satisfied: gpkit in /Users/jenkins/workspace/CE_gpkit_PR_research_models/buildnode/macys/optimizer/cvxopt (from gpfit==0.2.0) (1.1.1)
Requirement already satisfied: matplotlib>=3.3.2 in /Users/jenkins/workspace/CE_gpkit_PR_research_models/buildnode/macys/optimizer/cvxopt/venv_jenkins/lib/python3.9/site-packages (from gpfit==0.2.0) (3.5.1)
Requirement already satisfied: pytest>=6.2.5 in /Users/jenkins/workspace/CE_gpkit_PR_research_models/buildnode/macys/optimizer/cvxopt/venv_jenkins/lib/python3.9/site-packages (from gpfit==0.2.0) (7.0.1)
Collecting pytest-mpl>=0.13
  Downloading pytest_mpl-0.14.0-py3-none-any.whl (27 kB)
Requirement already satisfied: pillow>=6.2.0 in /Users/jenkins/workspace/CE_gpkit_PR_research_models/buildnode/macys/optimizer/cvxopt/venv_jenkins/lib/python3.9/site-packages (from matplotlib>=3.3.2->gpfit==0.2.0) (9.0.1)
Requirement already satisfied: fonttools>=4.22.0 in /Users/jenkins/workspace/CE_gpkit_PR_research_models/buildnode/macys/optimizer/cvxopt/venv_jenkins/lib/python3.9/site-packages (from matplotlib>=3.3.2->gpfit==0.2.0) (4.29.1)
Requirement already satisfied: python-dateutil>=2.7 in /Users/jenkins/workspace/CE_gpkit_PR_research_models/buildnode/macys/optimizer/cvxopt/venv_jenkins/lib/python3.9/site-packages (from matplotlib>=3.3.2->gpfit==0.2.0) (2.8.2)
Requirement already satisfied: cycler>=0.10 in /Users/jenkins/workspace/CE_gpkit_PR_research_models/buildnode/macys/optimizer/cvxopt/venv_jenkins/lib/python3.9/site-packages (from matplotlib>=3.3.2->gpfit==0.2.0) (0.11.0)
Requirement already satisfied: kiwisolver>=1.0.1 in /Users/jenkins/workspace/CE_gpkit_PR_research_models/buildnode/macys/optimizer/cvxopt/venv_jenkins/lib/python3.9/site-packages (from matplotlib>=3.3.2->gpfit==0.2.0) (1.3.2)
Requirement already satisfied: pyparsing>=2.2.1 in /Users/jenkins/workspace/CE_gpkit_PR_research_models/buildnode/macys/optimizer/cvxopt/venv_jenkins/lib/python3.9/site-packages (from matplotlib>=3.3.2->gpfit==0.2.0) (3.0.7)
Requirement already satisfied: packaging>=20.0 in /Users/jenkins/workspace/CE_gpkit_PR_research_models/buildnode/macys/optimizer/cvxopt/venv_jenkins/lib/python3.9/site-packages (from matplotlib>=3.3.2->gpfit==0.2.0) (21.3)
Requirement already satisfied: tomli>=1.0.0 in /Users/jenkins/workspace/CE_gpkit_PR_research_models/buildnode/macys/optimizer/cvxopt/venv_jenkins/lib/python3.9/site-packages (from pytest>=6.2.5->gpfit==0.2.0) (2.0.1)
Requirement already satisfied: pluggy<2.0,>=0.12 in /Users/jenkins/workspace/CE_gpkit_PR_research_models/buildnode/macys/optimizer/cvxopt/venv_jenkins/lib/python3.9/site-packages (from pytest>=6.2.5->gpfit==0.2.0) (1.0.0)
Requirement already satisfied: iniconfig in /Users/jenkins/workspace/CE_gpkit_PR_research_models/buildnode/macys/optimizer/cvxopt/venv_jenkins/lib/python3.9/site-packages (from pytest>=6.2.5->gpfit==0.2.0) (1.1.1)
Requirement already satisfied: py>=1.8.2 in /Users/jenkins/workspace/CE_gpkit_PR_research_models/buildnode/macys/optimizer/cvxopt/venv_jenkins/lib/python3.9/site-packages (from pytest>=6.2.5->gpfit==0.2.0) (1.11.0)
Requirement already satisfied: attrs>=19.2.0 in /Users/jenkins/workspace/CE_gpkit_PR_research_models/buildnode/macys/optimizer/cvxopt/venv_jenkins/lib/python3.9/site-packages (from pytest>=6.2.5->gpfit==0.2.0) (21.4.0)
Requirement already satisfied: Jinja2 in /Users/jenkins/workspace/CE_gpkit_PR_research_models/buildnode/macys/optimizer/cvxopt/venv_jenkins/lib/python3.9/site-packages (from pytest-mpl>=0.13->gpfit==0.2.0) (3.0.3)
Requirement already satisfied: pint>=0.8.1 in /Users/jenkins/workspace/CE_gpkit_PR_research_models/buildnode/macys/optimizer/cvxopt/venv_jenkins/lib/python3.9/site-packages (from gpkit->gpfit==0.2.0) (0.18)
Requirement already satisfied: plotly in /Users/jenkins/workspace/CE_gpkit_PR_research_models/buildnode/macys/optimizer/cvxopt/venv_jenkins/lib/python3.9/site-packages (from gpkit->gpfit==0.2.0) (5.6.0)
Requirement already satisfied: adce in /Users/jenkins/workspace/CE_gpkit_PR_research_models/buildnode/macys/optimizer/cvxopt/venv_jenkins/lib/python3.9/site-packages (from gpkit->gpfit==0.2.0) (1.3.3.2)
Requirement already satisfied: cvxopt>=1.1.8 in /Users/jenkins/workspace/CE_gpkit_PR_research_models/buildnode/macys/optimizer/cvxopt/venv_jenkins/lib/python3.9/site-packages (from gpkit->gpfit==0.2.0) (1.2.7)
Requirement already satisfied: six>=1.5 in /Users/jenkins/workspace/CE_gpkit_PR_research_models/buildnode/macys/optimizer/cvxopt/venv_jenkins/lib/python3.9/site-packages (from python-dateutil>=2.7->matplotlib>=3.3.2->gpfit==0.2.0) (1.16.0)
Requirement already satisfied: MarkupSafe>=2.0 in /Users/jenkins/workspace/CE_gpkit_PR_research_models/buildnode/macys/optimizer/cvxopt/venv_jenkins/lib/python3.9/site-packages (from Jinja2->pytest-mpl>=0.13->gpfit==0.2.0) (2.1.0)
Requirement already satisfied: tenacity>=6.2.0 in /Users/jenkins/workspace/CE_gpkit_PR_research_models/buildnode/macys/optimizer/cvxopt/venv_jenkins/lib/python3.9/site-packages (from plotly->gpkit->gpfit==0.2.0) (8.0.1)
Building wheels for collected packages: gpfit
  Building wheel for gpfit (setup.py): started
  Building wheel for gpfit (setup.py): finished with status 'done'
  Created wheel for gpfit: filename=gpfit-0.2.0-py3-none-any.whl size=493939 sha256=b427c78d088db5f1ce7a95a2388d4cfbbf23fbcf2a84b283bb2e5c5524a5df34
  Stored in directory: /private/var/folders/xs/_fh4l1p54zqcl6mbk4zclcfr0000gp/T/pip-ephem-wheel-cache-9vpejur6/wheels/7d/c7/e2/9c7f9a2bc07099a39824267dca90eb5f2bc4114dcffca7aced
Successfully built gpfit
Installing collected packages: pytest-mpl, gpfit
Successfully installed gpfit-0.2.0 pytest-mpl-0.14.0
Processing /Users/jenkins/workspace/CE_gpkit_PR_research_models/buildnode/macys/optimizer/cvxopt/gassolar
  Preparing metadata (setup.py): started
  Preparing metadata (setup.py): finished with status 'done'
Requirement already satisfied: numpy in /Users/jenkins/workspace/CE_gpkit_PR_research_models/buildnode/macys/optimizer/cvxopt/venv_jenkins/lib/python3.9/site-packages (from gassolar==0.0.0.0) (1.22.2)
Requirement already satisfied: scipy in /Users/jenkins/workspace/CE_gpkit_PR_research_models/buildnode/macys/optimizer/cvxopt/venv_jenkins/lib/python3.9/site-packages (from gassolar==0.0.0.0) (1.8.0)
Requirement already satisfied: gpkit in /Users/jenkins/workspace/CE_gpkit_PR_research_models/buildnode/macys/optimizer/cvxopt (from gassolar==0.0.0.0) (1.1.1)
Requirement already satisfied: pandas in /Users/jenkins/workspace/CE_gpkit_PR_research_models/buildnode/macys/optimizer/cvxopt/venv_jenkins/lib/python3.9/site-packages (from gassolar==0.0.0.0) (1.4.1)
Requirement already satisfied: gpfit in /Users/jenkins/workspace/CE_gpkit_PR_research_models/buildnode/macys/optimizer/cvxopt/venv_jenkins/lib/python3.9/site-packages (from gassolar==0.0.0.0) (0.2.0)
Requirement already satisfied: pytest>=6.2.5 in /Users/jenkins/workspace/CE_gpkit_PR_research_models/buildnode/macys/optimizer/cvxopt/venv_jenkins/lib/python3.9/site-packages (from gpfit->gassolar==0.0.0.0) (7.0.1)
Requirement already satisfied: pytest-mpl>=0.13 in /Users/jenkins/workspace/CE_gpkit_PR_research_models/buildnode/macys/optimizer/cvxopt/venv_jenkins/lib/python3.9/site-packages (from gpfit->gassolar==0.0.0.0) (0.14.0)
Requirement already satisfied: matplotlib>=3.3.2 in /Users/jenkins/workspace/CE_gpkit_PR_research_models/buildnode/macys/optimizer/cvxopt/venv_jenkins/lib/python3.9/site-packages (from gpfit->gassolar==0.0.0.0) (3.5.1)
Requirement already satisfied: pint>=0.8.1 in /Users/jenkins/workspace/CE_gpkit_PR_research_models/buildnode/macys/optimizer/cvxopt/venv_jenkins/lib/python3.9/site-packages (from gpkit->gassolar==0.0.0.0) (0.18)
Requirement already satisfied: plotly in /Users/jenkins/workspace/CE_gpkit_PR_research_models/buildnode/macys/optimizer/cvxopt/venv_jenkins/lib/python3.9/site-packages (from gpkit->gassolar==0.0.0.0) (5.6.0)
Requirement already satisfied: adce in /Users/jenkins/workspace/CE_gpkit_PR_research_models/buildnode/macys/optimizer/cvxopt/venv_jenkins/lib/python3.9/site-packages (from gpkit->gassolar==0.0.0.0) (1.3.3.2)
Requirement already satisfied: cvxopt>=1.1.8 in /Users/jenkins/workspace/CE_gpkit_PR_research_models/buildnode/macys/optimizer/cvxopt/venv_jenkins/lib/python3.9/site-packages (from gpkit->gassolar==0.0.0.0) (1.2.7)
Requirement already satisfied: python-dateutil>=2.8.1 in /Users/jenkins/workspace/CE_gpkit_PR_research_models/buildnode/macys/optimizer/cvxopt/venv_jenkins/lib/python3.9/site-packages (from pandas->gassolar==0.0.0.0) (2.8.2)
Requirement already satisfied: pytz>=2020.1 in /Users/jenkins/workspace/CE_gpkit_PR_research_models/buildnode/macys/optimizer/cvxopt/venv_jenkins/lib/python3.9/site-packages (from pandas->gassolar==0.0.0.0) (2021.3)
Requirement already satisfied: fonttools>=4.22.0 in /Users/jenkins/workspace/CE_gpkit_PR_research_models/buildnode/macys/optimizer/cvxopt/venv_jenkins/lib/python3.9/site-packages (from matplotlib>=3.3.2->gpfit->gassolar==0.0.0.0) (4.29.1)
Requirement already satisfied: cycler>=0.10 in /Users/jenkins/workspace/CE_gpkit_PR_research_models/buildnode/macys/optimizer/cvxopt/venv_jenkins/lib/python3.9/site-packages (from matplotlib>=3.3.2->gpfit->gassolar==0.0.0.0) (0.11.0)
Requirement already satisfied: pillow>=6.2.0 in /Users/jenkins/workspace/CE_gpkit_PR_research_models/buildnode/macys/optimizer/cvxopt/venv_jenkins/lib/python3.9/site-packages (from matplotlib>=3.3.2->gpfit->gassolar==0.0.0.0) (9.0.1)
Requirement already satisfied: pyparsing>=2.2.1 in /Users/jenkins/workspace/CE_gpkit_PR_research_models/buildnode/macys/optimizer/cvxopt/venv_jenkins/lib/python3.9/site-packages (from matplotlib>=3.3.2->gpfit->gassolar==0.0.0.0) (3.0.7)
Requirement already satisfied: packaging>=20.0 in /Users/jenkins/workspace/CE_gpkit_PR_research_models/buildnode/macys/optimizer/cvxopt/venv_jenkins/lib/python3.9/site-packages (from matplotlib>=3.3.2->gpfit->gassolar==0.0.0.0) (21.3)
Requirement already satisfied: kiwisolver>=1.0.1 in /Users/jenkins/workspace/CE_gpkit_PR_research_models/buildnode/macys/optimizer/cvxopt/venv_jenkins/lib/python3.9/site-packages (from matplotlib>=3.3.2->gpfit->gassolar==0.0.0.0) (1.3.2)
Requirement already satisfied: attrs>=19.2.0 in /Users/jenkins/workspace/CE_gpkit_PR_research_models/buildnode/macys/optimizer/cvxopt/venv_jenkins/lib/python3.9/site-packages (from pytest>=6.2.5->gpfit->gassolar==0.0.0.0) (21.4.0)
Requirement already satisfied: tomli>=1.0.0 in /Users/jenkins/workspace/CE_gpkit_PR_research_models/buildnode/macys/optimizer/cvxopt/venv_jenkins/lib/python3.9/site-packages (from pytest>=6.2.5->gpfit->gassolar==0.0.0.0) (2.0.1)
Requirement already satisfied: py>=1.8.2 in /Users/jenkins/workspace/CE_gpkit_PR_research_models/buildnode/macys/optimizer/cvxopt/venv_jenkins/lib/python3.9/site-packages (from pytest>=6.2.5->gpfit->gassolar==0.0.0.0) (1.11.0)
Requirement already satisfied: pluggy<2.0,>=0.12 in /Users/jenkins/workspace/CE_gpkit_PR_research_models/buildnode/macys/optimizer/cvxopt/venv_jenkins/lib/python3.9/site-packages (from pytest>=6.2.5->gpfit->gassolar==0.0.0.0) (1.0.0)
Requirement already satisfied: iniconfig in /Users/jenkins/workspace/CE_gpkit_PR_research_models/buildnode/macys/optimizer/cvxopt/venv_jenkins/lib/python3.9/site-packages (from pytest>=6.2.5->gpfit->gassolar==0.0.0.0) (1.1.1)
Requirement already satisfied: Jinja2 in /Users/jenkins/workspace/CE_gpkit_PR_research_models/buildnode/macys/optimizer/cvxopt/venv_jenkins/lib/python3.9/site-packages (from pytest-mpl>=0.13->gpfit->gassolar==0.0.0.0) (3.0.3)
Requirement already satisfied: six>=1.5 in /Users/jenkins/workspace/CE_gpkit_PR_research_models/buildnode/macys/optimizer/cvxopt/venv_jenkins/lib/python3.9/site-packages (from python-dateutil>=2.8.1->pandas->gassolar==0.0.0.0) (1.16.0)
Requirement already satisfied: tenacity>=6.2.0 in /Users/jenkins/workspace/CE_gpkit_PR_research_models/buildnode/macys/optimizer/cvxopt/venv_jenkins/lib/python3.9/site-packages (from plotly->gpkit->gassolar==0.0.0.0) (8.0.1)
Requirement already satisfied: MarkupSafe>=2.0 in /Users/jenkins/workspace/CE_gpkit_PR_research_models/buildnode/macys/optimizer/cvxopt/venv_jenkins/lib/python3.9/site-packages (from Jinja2->pytest-mpl>=0.13->gpfit->gassolar==0.0.0.0) (2.1.0)
Building wheels for collected packages: gassolar
  Building wheel for gassolar (setup.py): started
  Building wheel for gassolar (setup.py): finished with status 'done'
  Created wheel for gassolar: filename=gassolar-0.0.0.0-py3-none-any.whl size=4876528 sha256=324fbad54bb4b1e6801b132e4bfa3c4633f55ffe10968d2a86df5c381c3d4392
  Stored in directory: /private/var/folders/xs/_fh4l1p54zqcl6mbk4zclcfr0000gp/T/pip-ephem-wheel-cache-4awzi47f/wheels/02/dc/f6/a95db4888e9a81cd93e7e2f87062ba3e4c21cc402f980a9fd4
Successfully built gassolar
Installing collected packages: gassolar
Successfully installed gassolar-0.0.0.0

Running tests...
----------------------------------------------------------------------
adding test for 'gassolar/gas/gas.py'
adding test for 'gassolar/solar/solar.py'
.
----------------------------------------------------------------------
Ran 1 test in 0.001s

OK

Generating XML reports...
Cloning into 'jho'...
Requirement already satisfied: pandas in /Users/jenkins/workspace/CE_gpkit_PR_research_models/buildnode/macys/optimizer/cvxopt/venv_jenkins/lib/python3.9/site-packages (1.4.1)
Requirement already satisfied: numpy>=1.18.5 in /Users/jenkins/workspace/CE_gpkit_PR_research_models/buildnode/macys/optimizer/cvxopt/venv_jenkins/lib/python3.9/site-packages (from pandas) (1.22.2)
Requirement already satisfied: python-dateutil>=2.8.1 in /Users/jenkins/workspace/CE_gpkit_PR_research_models/buildnode/macys/optimizer/cvxopt/venv_jenkins/lib/python3.9/site-packages (from pandas) (2.8.2)
Requirement already satisfied: pytz>=2020.1 in /Users/jenkins/workspace/CE_gpkit_PR_research_models/buildnode/macys/optimizer/cvxopt/venv_jenkins/lib/python3.9/site-packages (from pandas) (2021.3)
Requirement already satisfied: six>=1.5 in /Users/jenkins/workspace/CE_gpkit_PR_research_models/buildnode/macys/optimizer/cvxopt/venv_jenkins/lib/python3.9/site-packages (from python-dateutil>=2.8.1->pandas) (1.16.0)
Collecting git+https://github.com/hoburg/gpfit.git
  Cloning https://github.com/hoburg/gpfit.git to /private/var/folders/xs/_fh4l1p54zqcl6mbk4zclcfr0000gp/T/pip-req-build-4egkt74v
  Running command git clone --filter=blob:none --quiet https://github.com/hoburg/gpfit.git /private/var/folders/xs/_fh4l1p54zqcl6mbk4zclcfr0000gp/T/pip-req-build-4egkt74v
  Resolved https://github.com/hoburg/gpfit.git to commit 3c8025f12ba5360fdeb71c270e55d4c93e1676fd
  Preparing metadata (setup.py): started
  Preparing metadata (setup.py): finished with status 'done'
Requirement already satisfied: numpy in /Users/jenkins/workspace/CE_gpkit_PR_research_models/buildnode/macys/optimizer/cvxopt/venv_jenkins/lib/python3.9/site-packages (from gpfit==0.2.0) (1.22.2)
Requirement already satisfied: scipy in /Users/jenkins/workspace/CE_gpkit_PR_research_models/buildnode/macys/optimizer/cvxopt/venv_jenkins/lib/python3.9/site-packages (from gpfit==0.2.0) (1.8.0)
Requirement already satisfied: gpkit in /Users/jenkins/workspace/CE_gpkit_PR_research_models/buildnode/macys/optimizer/cvxopt (from gpfit==0.2.0) (1.1.1)
Requirement already satisfied: matplotlib>=3.3.2 in /Users/jenkins/workspace/CE_gpkit_PR_research_models/buildnode/macys/optimizer/cvxopt/venv_jenkins/lib/python3.9/site-packages (from gpfit==0.2.0) (3.5.1)
Requirement already satisfied: pytest>=6.2.5 in /Users/jenkins/workspace/CE_gpkit_PR_research_models/buildnode/macys/optimizer/cvxopt/venv_jenkins/lib/python3.9/site-packages (from gpfit==0.2.0) (7.0.1)
Requirement already satisfied: pytest-mpl>=0.13 in /Users/jenkins/workspace/CE_gpkit_PR_research_models/buildnode/macys/optimizer/cvxopt/venv_jenkins/lib/python3.9/site-packages (from gpfit==0.2.0) (0.14.0)
Requirement already satisfied: cycler>=0.10 in /Users/jenkins/workspace/CE_gpkit_PR_research_models/buildnode/macys/optimizer/cvxopt/venv_jenkins/lib/python3.9/site-packages (from matplotlib>=3.3.2->gpfit==0.2.0) (0.11.0)
Requirement already satisfied: python-dateutil>=2.7 in /Users/jenkins/workspace/CE_gpkit_PR_research_models/buildnode/macys/optimizer/cvxopt/venv_jenkins/lib/python3.9/site-packages (from matplotlib>=3.3.2->gpfit==0.2.0) (2.8.2)
Requirement already satisfied: pillow>=6.2.0 in /Users/jenkins/workspace/CE_gpkit_PR_research_models/buildnode/macys/optimizer/cvxopt/venv_jenkins/lib/python3.9/site-packages (from matplotlib>=3.3.2->gpfit==0.2.0) (9.0.1)
Requirement already satisfied: pyparsing>=2.2.1 in /Users/jenkins/workspace/CE_gpkit_PR_research_models/buildnode/macys/optimizer/cvxopt/venv_jenkins/lib/python3.9/site-packages (from matplotlib>=3.3.2->gpfit==0.2.0) (3.0.7)
Requirement already satisfied: packaging>=20.0 in /Users/jenkins/workspace/CE_gpkit_PR_research_models/buildnode/macys/optimizer/cvxopt/venv_jenkins/lib/python3.9/site-packages (from matplotlib>=3.3.2->gpfit==0.2.0) (21.3)
Requirement already satisfied: kiwisolver>=1.0.1 in /Users/jenkins/workspace/CE_gpkit_PR_research_models/buildnode/macys/optimizer/cvxopt/venv_jenkins/lib/python3.9/site-packages (from matplotlib>=3.3.2->gpfit==0.2.0) (1.3.2)
Requirement already satisfied: fonttools>=4.22.0 in /Users/jenkins/workspace/CE_gpkit_PR_research_models/buildnode/macys/optimizer/cvxopt/venv_jenkins/lib/python3.9/site-packages (from matplotlib>=3.3.2->gpfit==0.2.0) (4.29.1)
Requirement already satisfied: iniconfig in /Users/jenkins/workspace/CE_gpkit_PR_research_models/buildnode/macys/optimizer/cvxopt/venv_jenkins/lib/python3.9/site-packages (from pytest>=6.2.5->gpfit==0.2.0) (1.1.1)
Requirement already satisfied: pluggy<2.0,>=0.12 in /Users/jenkins/workspace/CE_gpkit_PR_research_models/buildnode/macys/optimizer/cvxopt/venv_jenkins/lib/python3.9/site-packages (from pytest>=6.2.5->gpfit==0.2.0) (1.0.0)
Requirement already satisfied: tomli>=1.0.0 in /Users/jenkins/workspace/CE_gpkit_PR_research_models/buildnode/macys/optimizer/cvxopt/venv_jenkins/lib/python3.9/site-packages (from pytest>=6.2.5->gpfit==0.2.0) (2.0.1)
Requirement already satisfied: py>=1.8.2 in /Users/jenkins/workspace/CE_gpkit_PR_research_models/buildnode/macys/optimizer/cvxopt/venv_jenkins/lib/python3.9/site-packages (from pytest>=6.2.5->gpfit==0.2.0) (1.11.0)
Requirement already satisfied: attrs>=19.2.0 in /Users/jenkins/workspace/CE_gpkit_PR_research_models/buildnode/macys/optimizer/cvxopt/venv_jenkins/lib/python3.9/site-packages (from pytest>=6.2.5->gpfit==0.2.0) (21.4.0)
Requirement already satisfied: Jinja2 in /Users/jenkins/workspace/CE_gpkit_PR_research_models/buildnode/macys/optimizer/cvxopt/venv_jenkins/lib/python3.9/site-packages (from pytest-mpl>=0.13->gpfit==0.2.0) (3.0.3)
Requirement already satisfied: pint>=0.8.1 in /Users/jenkins/workspace/CE_gpkit_PR_research_models/buildnode/macys/optimizer/cvxopt/venv_jenkins/lib/python3.9/site-packages (from gpkit->gpfit==0.2.0) (0.18)
Requirement already satisfied: plotly in /Users/jenkins/workspace/CE_gpkit_PR_research_models/buildnode/macys/optimizer/cvxopt/venv_jenkins/lib/python3.9/site-packages (from gpkit->gpfit==0.2.0) (5.6.0)
Requirement already satisfied: adce in /Users/jenkins/workspace/CE_gpkit_PR_research_models/buildnode/macys/optimizer/cvxopt/venv_jenkins/lib/python3.9/site-packages (from gpkit->gpfit==0.2.0) (1.3.3.2)
Requirement already satisfied: cvxopt>=1.1.8 in /Users/jenkins/workspace/CE_gpkit_PR_research_models/buildnode/macys/optimizer/cvxopt/venv_jenkins/lib/python3.9/site-packages (from gpkit->gpfit==0.2.0) (1.2.7)
Requirement already satisfied: six>=1.5 in /Users/jenkins/workspace/CE_gpkit_PR_research_models/buildnode/macys/optimizer/cvxopt/venv_jenkins/lib/python3.9/site-packages (from python-dateutil>=2.7->matplotlib>=3.3.2->gpfit==0.2.0) (1.16.0)
Requirement already satisfied: MarkupSafe>=2.0 in /Users/jenkins/workspace/CE_gpkit_PR_research_models/buildnode/macys/optimizer/cvxopt/venv_jenkins/lib/python3.9/site-packages (from Jinja2->pytest-mpl>=0.13->gpfit==0.2.0) (2.1.0)
Requirement already satisfied: tenacity>=6.2.0 in /Users/jenkins/workspace/CE_gpkit_PR_research_models/buildnode/macys/optimizer/cvxopt/venv_jenkins/lib/python3.9/site-packages (from plotly->gpkit->gpfit==0.2.0) (8.0.1)

Running tests...
----------------------------------------------------------------------
adding test for 'model/jho.py'
adding test for 'model/print_perf.py'
.
----------------------------------------------------------------------
Ran 1 test in 0.001s

OK

Generating XML reports...
Cloning into 'turbofan'...
Processing /Users/jenkins/workspace/CE_gpkit_PR_research_models/buildnode/macys/optimizer/cvxopt/turbofan
  Preparing metadata (setup.py): started
  Preparing metadata (setup.py): finished with status 'done'
Requirement already satisfied: numpy in /Users/jenkins/workspace/CE_gpkit_PR_research_models/buildnode/macys/optimizer/cvxopt/venv_jenkins/lib/python3.9/site-packages (from turbofan==0.0.0.0) (1.22.2)
Requirement already satisfied: scipy in /Users/jenkins/workspace/CE_gpkit_PR_research_models/buildnode/macys/optimizer/cvxopt/venv_jenkins/lib/python3.9/site-packages (from turbofan==0.0.0.0) (1.8.0)
Requirement already satisfied: pint in /Users/jenkins/workspace/CE_gpkit_PR_research_models/buildnode/macys/optimizer/cvxopt/venv_jenkins/lib/python3.9/site-packages (from turbofan==0.0.0.0) (0.18)
Requirement already satisfied: future in /Users/jenkins/workspace/CE_gpkit_PR_research_models/buildnode/macys/optimizer/cvxopt/venv_jenkins/lib/python3.9/site-packages (from turbofan==0.0.0.0) (0.18.2)
Requirement already satisfied: packaging in /Users/jenkins/workspace/CE_gpkit_PR_research_models/buildnode/macys/optimizer/cvxopt/venv_jenkins/lib/python3.9/site-packages (from pint->turbofan==0.0.0.0) (21.3)
Requirement already satisfied: pyparsing!=3.0.5,>=2.0.2 in /Users/jenkins/workspace/CE_gpkit_PR_research_models/buildnode/macys/optimizer/cvxopt/venv_jenkins/lib/python3.9/site-packages (from packaging->pint->turbofan==0.0.0.0) (3.0.7)
Building wheels for collected packages: turbofan
  Building wheel for turbofan (setup.py): started
  Building wheel for turbofan (setup.py): finished with status 'done'
  Created wheel for turbofan: filename=turbofan-0.0.0.0-py3-none-any.whl size=43849 sha256=7499e7495f40e4146dd4d88ddc6221ad3973a9f6f755268472ea3b6577e4b2f0
  Stored in directory: /private/var/folders/xs/_fh4l1p54zqcl6mbk4zclcfr0000gp/T/pip-ephem-wheel-cache-dvoog74o/wheels/91/d9/11/ec7b61ee52b8a464c3fa75261a057ae047b5f63c888d119f47
Successfully built turbofan
Installing collected packages: turbofan
  Attempting uninstall: turbofan
    Found existing installation: turbofan 0.0.0.0
    Uninstalling turbofan-0.0.0.0:
      Successfully uninstalled turbofan-0.0.0.0
Successfully installed turbofan-0.0.0.0

Running tests...
----------------------------------------------------------------------
adding test for 'turbofan/engine_test.py'
.
----------------------------------------------------------------------
Ran 1 test in 0.001s

OK

Generating XML reports...
Cloning into 'solar'...
Requirement already satisfied: pandas in /Users/jenkins/workspace/CE_gpkit_PR_research_models/buildnode/macys/optimizer/cvxopt/venv_jenkins/lib/python3.9/site-packages (1.4.1)
Requirement already satisfied: pytz>=2020.1 in /Users/jenkins/workspace/CE_gpkit_PR_research_models/buildnode/macys/optimizer/cvxopt/venv_jenkins/lib/python3.9/site-packages (from pandas) (2021.3)
Requirement already satisfied: python-dateutil>=2.8.1 in /Users/jenkins/workspace/CE_gpkit_PR_research_models/buildnode/macys/optimizer/cvxopt/venv_jenkins/lib/python3.9/site-packages (from pandas) (2.8.2)
Requirement already satisfied: numpy>=1.18.5 in /Users/jenkins/workspace/CE_gpkit_PR_research_models/buildnode/macys/optimizer/cvxopt/venv_jenkins/lib/python3.9/site-packages (from pandas) (1.22.2)
Requirement already satisfied: six>=1.5 in /Users/jenkins/workspace/CE_gpkit_PR_research_models/buildnode/macys/optimizer/cvxopt/venv_jenkins/lib/python3.9/site-packages (from python-dateutil>=2.8.1->pandas) (1.16.0)
Collecting git+https://github.com/convexengineering/gpfit.git
  Cloning https://github.com/convexengineering/gpfit.git to /private/var/folders/xs/_fh4l1p54zqcl6mbk4zclcfr0000gp/T/pip-req-build-57i3hu0p
  Running command git clone --filter=blob:none --quiet https://github.com/convexengineering/gpfit.git /private/var/folders/xs/_fh4l1p54zqcl6mbk4zclcfr0000gp/T/pip-req-build-57i3hu0p
  Resolved https://github.com/convexengineering/gpfit.git to commit 3c8025f12ba5360fdeb71c270e55d4c93e1676fd
  Preparing metadata (setup.py): started
  Preparing metadata (setup.py): finished with status 'done'
Requirement already satisfied: numpy in /Users/jenkins/workspace/CE_gpkit_PR_research_models/buildnode/macys/optimizer/cvxopt/venv_jenkins/lib/python3.9/site-packages (from gpfit==0.2.0) (1.22.2)
Requirement already satisfied: scipy in /Users/jenkins/workspace/CE_gpkit_PR_research_models/buildnode/macys/optimizer/cvxopt/venv_jenkins/lib/python3.9/site-packages (from gpfit==0.2.0) (1.8.0)
Requirement already satisfied: gpkit in /Users/jenkins/workspace/CE_gpkit_PR_research_models/buildnode/macys/optimizer/cvxopt (from gpfit==0.2.0) (1.1.1)
Requirement already satisfied: matplotlib>=3.3.2 in /Users/jenkins/workspace/CE_gpkit_PR_research_models/buildnode/macys/optimizer/cvxopt/venv_jenkins/lib/python3.9/site-packages (from gpfit==0.2.0) (3.5.1)
Requirement already satisfied: pytest>=6.2.5 in /Users/jenkins/workspace/CE_gpkit_PR_research_models/buildnode/macys/optimizer/cvxopt/venv_jenkins/lib/python3.9/site-packages (from gpfit==0.2.0) (7.0.1)
Requirement already satisfied: pytest-mpl>=0.13 in /Users/jenkins/workspace/CE_gpkit_PR_research_models/buildnode/macys/optimizer/cvxopt/venv_jenkins/lib/python3.9/site-packages (from gpfit==0.2.0) (0.14.0)
Requirement already satisfied: pillow>=6.2.0 in /Users/jenkins/workspace/CE_gpkit_PR_research_models/buildnode/macys/optimizer/cvxopt/venv_jenkins/lib/python3.9/site-packages (from matplotlib>=3.3.2->gpfit==0.2.0) (9.0.1)
Requirement already satisfied: pyparsing>=2.2.1 in /Users/jenkins/workspace/CE_gpkit_PR_research_models/buildnode/macys/optimizer/cvxopt/venv_jenkins/lib/python3.9/site-packages (from matplotlib>=3.3.2->gpfit==0.2.0) (3.0.7)
Requirement already satisfied: python-dateutil>=2.7 in /Users/jenkins/workspace/CE_gpkit_PR_research_models/buildnode/macys/optimizer/cvxopt/venv_jenkins/lib/python3.9/site-packages (from matplotlib>=3.3.2->gpfit==0.2.0) (2.8.2)
Requirement already satisfied: fonttools>=4.22.0 in /Users/jenkins/workspace/CE_gpkit_PR_research_models/buildnode/macys/optimizer/cvxopt/venv_jenkins/lib/python3.9/site-packages (from matplotlib>=3.3.2->gpfit==0.2.0) (4.29.1)
Requirement already satisfied: kiwisolver>=1.0.1 in /Users/jenkins/workspace/CE_gpkit_PR_research_models/buildnode/macys/optimizer/cvxopt/venv_jenkins/lib/python3.9/site-packages (from matplotlib>=3.3.2->gpfit==0.2.0) (1.3.2)
Requirement already satisfied: packaging>=20.0 in /Users/jenkins/workspace/CE_gpkit_PR_research_models/buildnode/macys/optimizer/cvxopt/venv_jenkins/lib/python3.9/site-packages (from matplotlib>=3.3.2->gpfit==0.2.0) (21.3)
Requirement already satisfied: cycler>=0.10 in /Users/jenkins/workspace/CE_gpkit_PR_research_models/buildnode/macys/optimizer/cvxopt/venv_jenkins/lib/python3.9/site-packages (from matplotlib>=3.3.2->gpfit==0.2.0) (0.11.0)
Requirement already satisfied: tomli>=1.0.0 in /Users/jenkins/workspace/CE_gpkit_PR_research_models/buildnode/macys/optimizer/cvxopt/venv_jenkins/lib/python3.9/site-packages (from pytest>=6.2.5->gpfit==0.2.0) (2.0.1)
Requirement already satisfied: py>=1.8.2 in /Users/jenkins/workspace/CE_gpkit_PR_research_models/buildnode/macys/optimizer/cvxopt/venv_jenkins/lib/python3.9/site-packages (from pytest>=6.2.5->gpfit==0.2.0) (1.11.0)
Requirement already satisfied: iniconfig in /Users/jenkins/workspace/CE_gpkit_PR_research_models/buildnode/macys/optimizer/cvxopt/venv_jenkins/lib/python3.9/site-packages (from pytest>=6.2.5->gpfit==0.2.0) (1.1.1)
Requirement already satisfied: attrs>=19.2.0 in /Users/jenkins/workspace/CE_gpkit_PR_research_models/buildnode/macys/optimizer/cvxopt/venv_jenkins/lib/python3.9/site-packages (from pytest>=6.2.5->gpfit==0.2.0) (21.4.0)
Requirement already satisfied: pluggy<2.0,>=0.12 in /Users/jenkins/workspace/CE_gpkit_PR_research_models/buildnode/macys/optimizer/cvxopt/venv_jenkins/lib/python3.9/site-packages (from pytest>=6.2.5->gpfit==0.2.0) (1.0.0)
Requirement already satisfied: Jinja2 in /Users/jenkins/workspace/CE_gpkit_PR_research_models/buildnode/macys/optimizer/cvxopt/venv_jenkins/lib/python3.9/site-packages (from pytest-mpl>=0.13->gpfit==0.2.0) (3.0.3)
Requirement already satisfied: pint>=0.8.1 in /Users/jenkins/workspace/CE_gpkit_PR_research_models/buildnode/macys/optimizer/cvxopt/venv_jenkins/lib/python3.9/site-packages (from gpkit->gpfit==0.2.0) (0.18)
Requirement already satisfied: plotly in /Users/jenkins/workspace/CE_gpkit_PR_research_models/buildnode/macys/optimizer/cvxopt/venv_jenkins/lib/python3.9/site-packages (from gpkit->gpfit==0.2.0) (5.6.0)
Requirement already satisfied: adce in /Users/jenkins/workspace/CE_gpkit_PR_research_models/buildnode/macys/optimizer/cvxopt/venv_jenkins/lib/python3.9/site-packages (from gpkit->gpfit==0.2.0) (1.3.3.2)
Requirement already satisfied: cvxopt>=1.1.8 in /Users/jenkins/workspace/CE_gpkit_PR_research_models/buildnode/macys/optimizer/cvxopt/venv_jenkins/lib/python3.9/site-packages (from gpkit->gpfit==0.2.0) (1.2.7)
Requirement already satisfied: six>=1.5 in /Users/jenkins/workspace/CE_gpkit_PR_research_models/buildnode/macys/optimizer/cvxopt/venv_jenkins/lib/python3.9/site-packages (from python-dateutil>=2.7->matplotlib>=3.3.2->gpfit==0.2.0) (1.16.0)
Requirement already satisfied: MarkupSafe>=2.0 in /Users/jenkins/workspace/CE_gpkit_PR_research_models/buildnode/macys/optimizer/cvxopt/venv_jenkins/lib/python3.9/site-packages (from Jinja2->pytest-mpl>=0.13->gpfit==0.2.0) (2.1.0)
Requirement already satisfied: tenacity>=6.2.0 in /Users/jenkins/workspace/CE_gpkit_PR_research_models/buildnode/macys/optimizer/cvxopt/venv_jenkins/lib/python3.9/site-packages (from plotly->gpkit->gpfit==0.2.0) (8.0.1)
Collecting git+https://github.com/convexengineering/gassolar.git
  Cloning https://github.com/convexengineering/gassolar.git to /private/var/folders/xs/_fh4l1p54zqcl6mbk4zclcfr0000gp/T/pip-req-build-aqg2_77o
  Running command git clone --filter=blob:none --quiet https://github.com/convexengineering/gassolar.git /private/var/folders/xs/_fh4l1p54zqcl6mbk4zclcfr0000gp/T/pip-req-build-aqg2_77o
  Resolved https://github.com/convexengineering/gassolar.git to commit 90c91cc6b980b44bedaf87ad004654b67a11431c
  Preparing metadata (setup.py): started
  Preparing metadata (setup.py): finished with status 'done'
Requirement already satisfied: numpy in /Users/jenkins/workspace/CE_gpkit_PR_research_models/buildnode/macys/optimizer/cvxopt/venv_jenkins/lib/python3.9/site-packages (from gassolar==0.0.0.0) (1.22.2)
Requirement already satisfied: scipy in /Users/jenkins/workspace/CE_gpkit_PR_research_models/buildnode/macys/optimizer/cvxopt/venv_jenkins/lib/python3.9/site-packages (from gassolar==0.0.0.0) (1.8.0)
Requirement already satisfied: gpkit in /Users/jenkins/workspace/CE_gpkit_PR_research_models/buildnode/macys/optimizer/cvxopt (from gassolar==0.0.0.0) (1.1.1)
Requirement already satisfied: pandas in /Users/jenkins/workspace/CE_gpkit_PR_research_models/buildnode/macys/optimizer/cvxopt/venv_jenkins/lib/python3.9/site-packages (from gassolar==0.0.0.0) (1.4.1)
Requirement already satisfied: gpfit in /Users/jenkins/workspace/CE_gpkit_PR_research_models/buildnode/macys/optimizer/cvxopt/venv_jenkins/lib/python3.9/site-packages (from gassolar==0.0.0.0) (0.2.0)
Requirement already satisfied: matplotlib>=3.3.2 in /Users/jenkins/workspace/CE_gpkit_PR_research_models/buildnode/macys/optimizer/cvxopt/venv_jenkins/lib/python3.9/site-packages (from gpfit->gassolar==0.0.0.0) (3.5.1)
Requirement already satisfied: pytest>=6.2.5 in /Users/jenkins/workspace/CE_gpkit_PR_research_models/buildnode/macys/optimizer/cvxopt/venv_jenkins/lib/python3.9/site-packages (from gpfit->gassolar==0.0.0.0) (7.0.1)
Requirement already satisfied: pytest-mpl>=0.13 in /Users/jenkins/workspace/CE_gpkit_PR_research_models/buildnode/macys/optimizer/cvxopt/venv_jenkins/lib/python3.9/site-packages (from gpfit->gassolar==0.0.0.0) (0.14.0)
Requirement already satisfied: pint>=0.8.1 in /Users/jenkins/workspace/CE_gpkit_PR_research_models/buildnode/macys/optimizer/cvxopt/venv_jenkins/lib/python3.9/site-packages (from gpkit->gassolar==0.0.0.0) (0.18)
Requirement already satisfied: plotly in /Users/jenkins/workspace/CE_gpkit_PR_research_models/buildnode/macys/optimizer/cvxopt/venv_jenkins/lib/python3.9/site-packages (from gpkit->gassolar==0.0.0.0) (5.6.0)
Requirement already satisfied: adce in /Users/jenkins/workspace/CE_gpkit_PR_research_models/buildnode/macys/optimizer/cvxopt/venv_jenkins/lib/python3.9/site-packages (from gpkit->gassolar==0.0.0.0) (1.3.3.2)
Requirement already satisfied: cvxopt>=1.1.8 in /Users/jenkins/workspace/CE_gpkit_PR_research_models/buildnode/macys/optimizer/cvxopt/venv_jenkins/lib/python3.9/site-packages (from gpkit->gassolar==0.0.0.0) (1.2.7)
Requirement already satisfied: python-dateutil>=2.8.1 in /Users/jenkins/workspace/CE_gpkit_PR_research_models/buildnode/macys/optimizer/cvxopt/venv_jenkins/lib/python3.9/site-packages (from pandas->gassolar==0.0.0.0) (2.8.2)
Requirement already satisfied: pytz>=2020.1 in /Users/jenkins/workspace/CE_gpkit_PR_research_models/buildnode/macys/optimizer/cvxopt/venv_jenkins/lib/python3.9/site-packages (from pandas->gassolar==0.0.0.0) (2021.3)
Requirement already satisfied: pillow>=6.2.0 in /Users/jenkins/workspace/CE_gpkit_PR_research_models/buildnode/macys/optimizer/cvxopt/venv_jenkins/lib/python3.9/site-packages (from matplotlib>=3.3.2->gpfit->gassolar==0.0.0.0) (9.0.1)
Requirement already satisfied: cycler>=0.10 in /Users/jenkins/workspace/CE_gpkit_PR_research_models/buildnode/macys/optimizer/cvxopt/venv_jenkins/lib/python3.9/site-packages (from matplotlib>=3.3.2->gpfit->gassolar==0.0.0.0) (0.11.0)
Requirement already satisfied: fonttools>=4.22.0 in /Users/jenkins/workspace/CE_gpkit_PR_research_models/buildnode/macys/optimizer/cvxopt/venv_jenkins/lib/python3.9/site-packages (from matplotlib>=3.3.2->gpfit->gassolar==0.0.0.0) (4.29.1)
Requirement already satisfied: pyparsing>=2.2.1 in /Users/jenkins/workspace/CE_gpkit_PR_research_models/buildnode/macys/optimizer/cvxopt/venv_jenkins/lib/python3.9/site-packages (from matplotlib>=3.3.2->gpfit->gassolar==0.0.0.0) (3.0.7)
Requirement already satisfied: packaging>=20.0 in /Users/jenkins/workspace/CE_gpkit_PR_research_models/buildnode/macys/optimizer/cvxopt/venv_jenkins/lib/python3.9/site-packages (from matplotlib>=3.3.2->gpfit->gassolar==0.0.0.0) (21.3)
Requirement already satisfied: kiwisolver>=1.0.1 in /Users/jenkins/workspace/CE_gpkit_PR_research_models/buildnode/macys/optimizer/cvxopt/venv_jenkins/lib/python3.9/site-packages (from matplotlib>=3.3.2->gpfit->gassolar==0.0.0.0) (1.3.2)
Requirement already satisfied: iniconfig in /Users/jenkins/workspace/CE_gpkit_PR_research_models/buildnode/macys/optimizer/cvxopt/venv_jenkins/lib/python3.9/site-packages (from pytest>=6.2.5->gpfit->gassolar==0.0.0.0) (1.1.1)
Requirement already satisfied: tomli>=1.0.0 in /Users/jenkins/workspace/CE_gpkit_PR_research_models/buildnode/macys/optimizer/cvxopt/venv_jenkins/lib/python3.9/site-packages (from pytest>=6.2.5->gpfit->gassolar==0.0.0.0) (2.0.1)
Requirement already satisfied: py>=1.8.2 in /Users/jenkins/workspace/CE_gpkit_PR_research_models/buildnode/macys/optimizer/cvxopt/venv_jenkins/lib/python3.9/site-packages (from pytest>=6.2.5->gpfit->gassolar==0.0.0.0) (1.11.0)
Requirement already satisfied: pluggy<2.0,>=0.12 in /Users/jenkins/workspace/CE_gpkit_PR_research_models/buildnode/macys/optimizer/cvxopt/venv_jenkins/lib/python3.9/site-packages (from pytest>=6.2.5->gpfit->gassolar==0.0.0.0) (1.0.0)
Requirement already satisfied: attrs>=19.2.0 in /Users/jenkins/workspace/CE_gpkit_PR_research_models/buildnode/macys/optimizer/cvxopt/venv_jenkins/lib/python3.9/site-packages (from pytest>=6.2.5->gpfit->gassolar==0.0.0.0) (21.4.0)
Requirement already satisfied: Jinja2 in /Users/jenkins/workspace/CE_gpkit_PR_research_models/buildnode/macys/optimizer/cvxopt/venv_jenkins/lib/python3.9/site-packages (from pytest-mpl>=0.13->gpfit->gassolar==0.0.0.0) (3.0.3)
Requirement already satisfied: six>=1.5 in /Users/jenkins/workspace/CE_gpkit_PR_research_models/buildnode/macys/optimizer/cvxopt/venv_jenkins/lib/python3.9/site-packages (from python-dateutil>=2.8.1->pandas->gassolar==0.0.0.0) (1.16.0)
Requirement already satisfied: tenacity>=6.2.0 in /Users/jenkins/workspace/CE_gpkit_PR_research_models/buildnode/macys/optimizer/cvxopt/venv_jenkins/lib/python3.9/site-packages (from plotly->gpkit->gassolar==0.0.0.0) (8.0.1)
Requirement already satisfied: MarkupSafe>=2.0 in /Users/jenkins/workspace/CE_gpkit_PR_research_models/buildnode/macys/optimizer/cvxopt/venv_jenkins/lib/python3.9/site-packages (from Jinja2->pytest-mpl>=0.13->gpfit->gassolar==0.0.0.0) (2.1.0)
Processing /Users/jenkins/workspace/CE_gpkit_PR_research_models/buildnode/macys/optimizer/cvxopt/solar
  Preparing metadata (setup.py): started
  Preparing metadata (setup.py): finished with status 'done'
Requirement already satisfied: numpy in /Users/jenkins/workspace/CE_gpkit_PR_research_models/buildnode/macys/optimizer/cvxopt/venv_jenkins/lib/python3.9/site-packages (from solar==0.0.0.0) (1.22.2)
Requirement already satisfied: scipy in /Users/jenkins/workspace/CE_gpkit_PR_research_models/buildnode/macys/optimizer/cvxopt/venv_jenkins/lib/python3.9/site-packages (from solar==0.0.0.0) (1.8.0)
Requirement already satisfied: gpkit in /Users/jenkins/workspace/CE_gpkit_PR_research_models/buildnode/macys/optimizer/cvxopt (from solar==0.0.0.0) (1.1.1)
Requirement already satisfied: pandas in /Users/jenkins/workspace/CE_gpkit_PR_research_models/buildnode/macys/optimizer/cvxopt/venv_jenkins/lib/python3.9/site-packages (from solar==0.0.0.0) (1.4.1)
Requirement already satisfied: gpfit in /Users/jenkins/workspace/CE_gpkit_PR_research_models/buildnode/macys/optimizer/cvxopt/venv_jenkins/lib/python3.9/site-packages (from solar==0.0.0.0) (0.2.0)
Requirement already satisfied: gpkitmodels in /Users/jenkins/workspace/CE_gpkit_PR_research_models/buildnode/macys/optimizer/cvxopt/gplibrary (from solar==0.0.0.0) (0.0.0.0)
Requirement already satisfied: pytest>=6.2.5 in /Users/jenkins/workspace/CE_gpkit_PR_research_models/buildnode/macys/optimizer/cvxopt/venv_jenkins/lib/python3.9/site-packages (from gpfit->solar==0.0.0.0) (7.0.1)
Requirement already satisfied: pytest-mpl>=0.13 in /Users/jenkins/workspace/CE_gpkit_PR_research_models/buildnode/macys/optimizer/cvxopt/venv_jenkins/lib/python3.9/site-packages (from gpfit->solar==0.0.0.0) (0.14.0)
Requirement already satisfied: matplotlib>=3.3.2 in /Users/jenkins/workspace/CE_gpkit_PR_research_models/buildnode/macys/optimizer/cvxopt/venv_jenkins/lib/python3.9/site-packages (from gpfit->solar==0.0.0.0) (3.5.1)
Requirement already satisfied: pint>=0.8.1 in /Users/jenkins/workspace/CE_gpkit_PR_research_models/buildnode/macys/optimizer/cvxopt/venv_jenkins/lib/python3.9/site-packages (from gpkit->solar==0.0.0.0) (0.18)
Requirement already satisfied: plotly in /Users/jenkins/workspace/CE_gpkit_PR_research_models/buildnode/macys/optimizer/cvxopt/venv_jenkins/lib/python3.9/site-packages (from gpkit->solar==0.0.0.0) (5.6.0)
Requirement already satisfied: adce in /Users/jenkins/workspace/CE_gpkit_PR_research_models/buildnode/macys/optimizer/cvxopt/venv_jenkins/lib/python3.9/site-packages (from gpkit->solar==0.0.0.0) (1.3.3.2)
Requirement already satisfied: cvxopt>=1.1.8 in /Users/jenkins/workspace/CE_gpkit_PR_research_models/buildnode/macys/optimizer/cvxopt/venv_jenkins/lib/python3.9/site-packages (from gpkit->solar==0.0.0.0) (1.2.7)
Requirement already satisfied: future in /Users/jenkins/workspace/CE_gpkit_PR_research_models/buildnode/macys/optimizer/cvxopt/venv_jenkins/lib/python3.9/site-packages (from gpkitmodels->solar==0.0.0.0) (0.18.2)
Requirement already satisfied: pytz>=2020.1 in /Users/jenkins/workspace/CE_gpkit_PR_research_models/buildnode/macys/optimizer/cvxopt/venv_jenkins/lib/python3.9/site-packages (from pandas->solar==0.0.0.0) (2021.3)
Requirement already satisfied: python-dateutil>=2.8.1 in /Users/jenkins/workspace/CE_gpkit_PR_research_models/buildnode/macys/optimizer/cvxopt/venv_jenkins/lib/python3.9/site-packages (from pandas->solar==0.0.0.0) (2.8.2)
Requirement already satisfied: packaging>=20.0 in /Users/jenkins/workspace/CE_gpkit_PR_research_models/buildnode/macys/optimizer/cvxopt/venv_jenkins/lib/python3.9/site-packages (from matplotlib>=3.3.2->gpfit->solar==0.0.0.0) (21.3)
Requirement already satisfied: fonttools>=4.22.0 in /Users/jenkins/workspace/CE_gpkit_PR_research_models/buildnode/macys/optimizer/cvxopt/venv_jenkins/lib/python3.9/site-packages (from matplotlib>=3.3.2->gpfit->solar==0.0.0.0) (4.29.1)
Requirement already satisfied: kiwisolver>=1.0.1 in /Users/jenkins/workspace/CE_gpkit_PR_research_models/buildnode/macys/optimizer/cvxopt/venv_jenkins/lib/python3.9/site-packages (from matplotlib>=3.3.2->gpfit->solar==0.0.0.0) (1.3.2)
Requirement already satisfied: cycler>=0.10 in /Users/jenkins/workspace/CE_gpkit_PR_research_models/buildnode/macys/optimizer/cvxopt/venv_jenkins/lib/python3.9/site-packages (from matplotlib>=3.3.2->gpfit->solar==0.0.0.0) (0.11.0)
Requirement already satisfied: pyparsing>=2.2.1 in /Users/jenkins/workspace/CE_gpkit_PR_research_models/buildnode/macys/optimizer/cvxopt/venv_jenkins/lib/python3.9/site-packages (from matplotlib>=3.3.2->gpfit->solar==0.0.0.0) (3.0.7)
Requirement already satisfied: pillow>=6.2.0 in /Users/jenkins/workspace/CE_gpkit_PR_research_models/buildnode/macys/optimizer/cvxopt/venv_jenkins/lib/python3.9/site-packages (from matplotlib>=3.3.2->gpfit->solar==0.0.0.0) (9.0.1)
Requirement already satisfied: tomli>=1.0.0 in /Users/jenkins/workspace/CE_gpkit_PR_research_models/buildnode/macys/optimizer/cvxopt/venv_jenkins/lib/python3.9/site-packages (from pytest>=6.2.5->gpfit->solar==0.0.0.0) (2.0.1)
Requirement already satisfied: attrs>=19.2.0 in /Users/jenkins/workspace/CE_gpkit_PR_research_models/buildnode/macys/optimizer/cvxopt/venv_jenkins/lib/python3.9/site-packages (from pytest>=6.2.5->gpfit->solar==0.0.0.0) (21.4.0)
Requirement already satisfied: iniconfig in /Users/jenkins/workspace/CE_gpkit_PR_research_models/buildnode/macys/optimizer/cvxopt/venv_jenkins/lib/python3.9/site-packages (from pytest>=6.2.5->gpfit->solar==0.0.0.0) (1.1.1)
Requirement already satisfied: py>=1.8.2 in /Users/jenkins/workspace/CE_gpkit_PR_research_models/buildnode/macys/optimizer/cvxopt/venv_jenkins/lib/python3.9/site-packages (from pytest>=6.2.5->gpfit->solar==0.0.0.0) (1.11.0)
Requirement already satisfied: pluggy<2.0,>=0.12 in /Users/jenkins/workspace/CE_gpkit_PR_research_models/buildnode/macys/optimizer/cvxopt/venv_jenkins/lib/python3.9/site-packages (from pytest>=6.2.5->gpfit->solar==0.0.0.0) (1.0.0)
Requirement already satisfied: Jinja2 in /Users/jenkins/workspace/CE_gpkit_PR_research_models/buildnode/macys/optimizer/cvxopt/venv_jenkins/lib/python3.9/site-packages (from pytest-mpl>=0.13->gpfit->solar==0.0.0.0) (3.0.3)
Requirement already satisfied: six>=1.5 in /Users/jenkins/workspace/CE_gpkit_PR_research_models/buildnode/macys/optimizer/cvxopt/venv_jenkins/lib/python3.9/site-packages (from python-dateutil>=2.8.1->pandas->solar==0.0.0.0) (1.16.0)
Requirement already satisfied: tenacity>=6.2.0 in /Users/jenkins/workspace/CE_gpkit_PR_research_models/buildnode/macys/optimizer/cvxopt/venv_jenkins/lib/python3.9/site-packages (from plotly->gpkit->solar==0.0.0.0) (8.0.1)
Requirement already satisfied: MarkupSafe>=2.0 in /Users/jenkins/workspace/CE_gpkit_PR_research_models/buildnode/macys/optimizer/cvxopt/venv_jenkins/lib/python3.9/site-packages (from Jinja2->pytest-mpl>=0.13->gpfit->solar==0.0.0.0) (2.1.0)
Building wheels for collected packages: solar
  Building wheel for solar (setup.py): started
  Building wheel for solar (setup.py): finished with status 'done'
  Created wheel for solar: filename=solar-0.0.0.0-py3-none-any.whl size=14861 sha256=30c5e01eb14ded6900566eacfb614247d67adfdd75c354ef77ed56c880ae047a
  Stored in directory: /private/var/folders/xs/_fh4l1p54zqcl6mbk4zclcfr0000gp/T/pip-ephem-wheel-cache-j_9m69km/wheels/46/77/80/601130e121c163eb1513b9cb67ad58cca853b76dd325cf204f
Successfully built solar
Installing collected packages: solar
Successfully installed solar-0.0.0.0

Running tests...
----------------------------------------------------------------------
adding test for 'solar/sens_chart.py'
adding test for 'solar/season.py'
adding test for 'solar/npod_trade.py'
.
----------------------------------------------------------------------
Ran 1 test in 0.001s

OK

Generating XML reports...
fatal: destination path 'gplibrary' already exists and is not an empty directory.
fatal: destination path 'gplibrary' already exists and is not an empty directory.
fatal: destination path 'gplibrary' already exists and is not an empty directory.
fatal: destination path 'gplibrary' already exists and is not an empty directory.
fatal: destination path 'gplibrary' already exists and is not an empty directory.
Requirement already satisfied: pandas in /Users/jenkins/workspace/CE_gpkit_PR_research_models/buildnode/macys/optimizer/cvxopt/venv_jenkins/lib/python3.9/site-packages (1.4.1)
Requirement already satisfied: numpy>=1.18.5 in /Users/jenkins/workspace/CE_gpkit_PR_research_models/buildnode/macys/optimizer/cvxopt/venv_jenkins/lib/python3.9/site-packages (from pandas) (1.22.2)
Requirement already satisfied: pytz>=2020.1 in /Users/jenkins/workspace/CE_gpkit_PR_research_models/buildnode/macys/optimizer/cvxopt/venv_jenkins/lib/python3.9/site-packages (from pandas) (2021.3)
Requirement already satisfied: python-dateutil>=2.8.1 in /Users/jenkins/workspace/CE_gpkit_PR_research_models/buildnode/macys/optimizer/cvxopt/venv_jenkins/lib/python3.9/site-packages (from pandas) (2.8.2)
Requirement already satisfied: six>=1.5 in /Users/jenkins/workspace/CE_gpkit_PR_research_models/buildnode/macys/optimizer/cvxopt/venv_jenkins/lib/python3.9/site-packages (from python-dateutil>=2.8.1->pandas) (1.16.0)
Collecting git+https://github.com/hoburg/gpfit.git
  Cloning https://github.com/hoburg/gpfit.git to /private/var/folders/xs/_fh4l1p54zqcl6mbk4zclcfr0000gp/T/pip-req-build-92i2m2q8
  Running command git clone --filter=blob:none --quiet https://github.com/hoburg/gpfit.git /private/var/folders/xs/_fh4l1p54zqcl6mbk4zclcfr0000gp/T/pip-req-build-92i2m2q8
  Resolved https://github.com/hoburg/gpfit.git to commit 3c8025f12ba5360fdeb71c270e55d4c93e1676fd
  Preparing metadata (setup.py): started
  Preparing metadata (setup.py): finished with status 'done'
Requirement already satisfied: numpy in /Users/jenkins/workspace/CE_gpkit_PR_research_models/buildnode/macys/optimizer/cvxopt/venv_jenkins/lib/python3.9/site-packages (from gpfit==0.2.0) (1.22.2)
Requirement already satisfied: scipy in /Users/jenkins/workspace/CE_gpkit_PR_research_models/buildnode/macys/optimizer/cvxopt/venv_jenkins/lib/python3.9/site-packages (from gpfit==0.2.0) (1.8.0)
Requirement already satisfied: gpkit in /Users/jenkins/workspace/CE_gpkit_PR_research_models/buildnode/macys/optimizer/cvxopt (from gpfit==0.2.0) (1.1.1)
Requirement already satisfied: matplotlib>=3.3.2 in /Users/jenkins/workspace/CE_gpkit_PR_research_models/buildnode/macys/optimizer/cvxopt/venv_jenkins/lib/python3.9/site-packages (from gpfit==0.2.0) (3.5.1)
Requirement already satisfied: pytest>=6.2.5 in /Users/jenkins/workspace/CE_gpkit_PR_research_models/buildnode/macys/optimizer/cvxopt/venv_jenkins/lib/python3.9/site-packages (from gpfit==0.2.0) (7.0.1)
Requirement already satisfied: pytest-mpl>=0.13 in /Users/jenkins/workspace/CE_gpkit_PR_research_models/buildnode/macys/optimizer/cvxopt/venv_jenkins/lib/python3.9/site-packages (from gpfit==0.2.0) (0.14.0)
Requirement already satisfied: packaging>=20.0 in /Users/jenkins/workspace/CE_gpkit_PR_research_models/buildnode/macys/optimizer/cvxopt/venv_jenkins/lib/python3.9/site-packages (from matplotlib>=3.3.2->gpfit==0.2.0) (21.3)
Requirement already satisfied: kiwisolver>=1.0.1 in /Users/jenkins/workspace/CE_gpkit_PR_research_models/buildnode/macys/optimizer/cvxopt/venv_jenkins/lib/python3.9/site-packages (from matplotlib>=3.3.2->gpfit==0.2.0) (1.3.2)
Requirement already satisfied: pyparsing>=2.2.1 in /Users/jenkins/workspace/CE_gpkit_PR_research_models/buildnode/macys/optimizer/cvxopt/venv_jenkins/lib/python3.9/site-packages (from matplotlib>=3.3.2->gpfit==0.2.0) (3.0.7)
Requirement already satisfied: cycler>=0.10 in /Users/jenkins/workspace/CE_gpkit_PR_research_models/buildnode/macys/optimizer/cvxopt/venv_jenkins/lib/python3.9/site-packages (from matplotlib>=3.3.2->gpfit==0.2.0) (0.11.0)
Requirement already satisfied: pillow>=6.2.0 in /Users/jenkins/workspace/CE_gpkit_PR_research_models/buildnode/macys/optimizer/cvxopt/venv_jenkins/lib/python3.9/site-packages (from matplotlib>=3.3.2->gpfit==0.2.0) (9.0.1)
Requirement already satisfied: python-dateutil>=2.7 in /Users/jenkins/workspace/CE_gpkit_PR_research_models/buildnode/macys/optimizer/cvxopt/venv_jenkins/lib/python3.9/site-packages (from matplotlib>=3.3.2->gpfit==0.2.0) (2.8.2)
Requirement already satisfied: fonttools>=4.22.0 in /Users/jenkins/workspace/CE_gpkit_PR_research_models/buildnode/macys/optimizer/cvxopt/venv_jenkins/lib/python3.9/site-packages (from matplotlib>=3.3.2->gpfit==0.2.0) (4.29.1)
Requirement already satisfied: tomli>=1.0.0 in /Users/jenkins/workspace/CE_gpkit_PR_research_models/buildnode/macys/optimizer/cvxopt/venv_jenkins/lib/python3.9/site-packages (from pytest>=6.2.5->gpfit==0.2.0) (2.0.1)
Requirement already satisfied: attrs>=19.2.0 in /Users/jenkins/workspace/CE_gpkit_PR_research_models/buildnode/macys/optimizer/cvxopt/venv_jenkins/lib/python3.9/site-packages (from pytest>=6.2.5->gpfit==0.2.0) (21.4.0)
Requirement already satisfied: pluggy<2.0,>=0.12 in /Users/jenkins/workspace/CE_gpkit_PR_research_models/buildnode/macys/optimizer/cvxopt/venv_jenkins/lib/python3.9/site-packages (from pytest>=6.2.5->gpfit==0.2.0) (1.0.0)
Requirement already satisfied: iniconfig in /Users/jenkins/workspace/CE_gpkit_PR_research_models/buildnode/macys/optimizer/cvxopt/venv_jenkins/lib/python3.9/site-packages (from pytest>=6.2.5->gpfit==0.2.0) (1.1.1)
Requirement already satisfied: py>=1.8.2 in /Users/jenkins/workspace/CE_gpkit_PR_research_models/buildnode/macys/optimizer/cvxopt/venv_jenkins/lib/python3.9/site-packages (from pytest>=6.2.5->gpfit==0.2.0) (1.11.0)
Requirement already satisfied: Jinja2 in /Users/jenkins/workspace/CE_gpkit_PR_research_models/buildnode/macys/optimizer/cvxopt/venv_jenkins/lib/python3.9/site-packages (from pytest-mpl>=0.13->gpfit==0.2.0) (3.0.3)
Requirement already satisfied: pint>=0.8.1 in /Users/jenkins/workspace/CE_gpkit_PR_research_models/buildnode/macys/optimizer/cvxopt/venv_jenkins/lib/python3.9/site-packages (from gpkit->gpfit==0.2.0) (0.18)
Requirement already satisfied: plotly in /Users/jenkins/workspace/CE_gpkit_PR_research_models/buildnode/macys/optimizer/cvxopt/venv_jenkins/lib/python3.9/site-packages (from gpkit->gpfit==0.2.0) (5.6.0)
Requirement already satisfied: adce in /Users/jenkins/workspace/CE_gpkit_PR_research_models/buildnode/macys/optimizer/cvxopt/venv_jenkins/lib/python3.9/site-packages (from gpkit->gpfit==0.2.0) (1.3.3.2)
Requirement already satisfied: cvxopt>=1.1.8 in /Users/jenkins/workspace/CE_gpkit_PR_research_models/buildnode/macys/optimizer/cvxopt/venv_jenkins/lib/python3.9/site-packages (from gpkit->gpfit==0.2.0) (1.2.7)
Requirement already satisfied: six>=1.5 in /Users/jenkins/workspace/CE_gpkit_PR_research_models/buildnode/macys/optimizer/cvxopt/venv_jenkins/lib/python3.9/site-packages (from python-dateutil>=2.7->matplotlib>=3.3.2->gpfit==0.2.0) (1.16.0)
Requirement already satisfied: MarkupSafe>=2.0 in /Users/jenkins/workspace/CE_gpkit_PR_research_models/buildnode/macys/optimizer/cvxopt/venv_jenkins/lib/python3.9/site-packages (from Jinja2->pytest-mpl>=0.13->gpfit==0.2.0) (2.1.0)
Requirement already satisfied: tenacity>=6.2.0 in /Users/jenkins/workspace/CE_gpkit_PR_research_models/buildnode/macys/optimizer/cvxopt/venv_jenkins/lib/python3.9/site-packages (from plotly->gpkit->gpfit==0.2.0) (8.0.1)
Processing /Users/jenkins/workspace/CE_gpkit_PR_research_models/buildnode/macys/optimizer/cvxopt/gplibrary
  Preparing metadata (setup.py): started
  Preparing metadata (setup.py): finished with status 'done'
Requirement already satisfied: numpy>=1.12 in /Users/jenkins/workspace/CE_gpkit_PR_research_models/buildnode/macys/optimizer/cvxopt/venv_jenkins/lib/python3.9/site-packages (from gpkitmodels==0.0.0.0) (1.22.2)
Requirement already satisfied: scipy in /Users/jenkins/workspace/CE_gpkit_PR_research_models/buildnode/macys/optimizer/cvxopt/venv_jenkins/lib/python3.9/site-packages (from gpkitmodels==0.0.0.0) (1.8.0)
Requirement already satisfied: pint in /Users/jenkins/workspace/CE_gpkit_PR_research_models/buildnode/macys/optimizer/cvxopt/venv_jenkins/lib/python3.9/site-packages (from gpkitmodels==0.0.0.0) (0.18)
Requirement already satisfied: future in /Users/jenkins/workspace/CE_gpkit_PR_research_models/buildnode/macys/optimizer/cvxopt/venv_jenkins/lib/python3.9/site-packages (from gpkitmodels==0.0.0.0) (0.18.2)
Requirement already satisfied: packaging in /Users/jenkins/workspace/CE_gpkit_PR_research_models/buildnode/macys/optimizer/cvxopt/venv_jenkins/lib/python3.9/site-packages (from pint->gpkitmodels==0.0.0.0) (21.3)
Requirement already satisfied: pyparsing!=3.0.5,>=2.0.2 in /Users/jenkins/workspace/CE_gpkit_PR_research_models/buildnode/macys/optimizer/cvxopt/venv_jenkins/lib/python3.9/site-packages (from packaging->pint->gpkitmodels==0.0.0.0) (3.0.7)
Building wheels for collected packages: gpkitmodels
  Building wheel for gpkitmodels (setup.py): started
  Building wheel for gpkitmodels (setup.py): finished with status 'done'
  Created wheel for gpkitmodels: filename=gpkitmodels-0.0.0.0-py3-none-any.whl size=66171 sha256=7c150e1391d7d270b382edc1374fa6841820ba19b40fe376f4fcfb76974a80ab
  Stored in directory: /private/var/folders/xs/_fh4l1p54zqcl6mbk4zclcfr0000gp/T/pip-ephem-wheel-cache-hi8h4k8j/wheels/15/4c/25/445c9dd68bfa61e696d1ba10788e7f0a109d7b0150727350f3
Successfully built gpkitmodels
Installing collected packages: gpkitmodels
  Attempting uninstall: gpkitmodels
    Found existing installation: gpkitmodels 0.0.0.0
    Uninstalling gpkitmodels-0.0.0.0:
      Successfully uninstalled gpkitmodels-0.0.0.0
Successfully installed gpkitmodels-0.0.0.0

Running tests...
----------------------------------------------------------------------
adding test for 'gpkitmodels/GP/aircraft/wing/wing_test.py'
adding test for 'gpkitmodels/GP/aircraft/tail/tail_tests.py'
adding test for 'gpkitmodels/GP/aircraft/fuselage/test_fuselage.py'
adding test for 'gpkitmodels/GP/aircraft/prop/prop_test.py'
adding test for 'gpkitmodels/GP/aircraft/motor/motor_test.py'
adding test for 'gpkitmodels/SP/SimPleAC/SimPleAC.py'
adding test for 'gpkitmodels/SP/SimPleAC/SimPleAC_mission.py'
adding test for 'gpkitmodels/SP/SimPleAC/SimPleAC_multimission.py'
EEEEE/Users/jenkins/workspace/CE_gpkit_PR_research_models/buildnode/macys/optimizer/cvxopt/gpkit/constraints/sgp.py:177: UserWarning: SGP not convergent: Cost rose by 6.1% (1588.62 to 1685.18) on GP solve 2. Details can be found in `m.program.results` or by solving at a higher verbosity. Note convergence is not guaranteed for models with SignomialEqualities.
  pywarnings.warn(
...Starting a sequence of GP solves
 for 4 free variables
  in 1 locally-GP constraints
  and for 21 free variables
       in 22 posynomial inequalities.

GP Solve 1
Using solver 'cvxopt'
 for 21 free variables
  in 22 posynomial inequalities.
Solving took 0.0502 seconds.
Solved cost was 5717.

GP Solve 2
Using solver 'cvxopt'
 for 21 free variables
  in 22 posynomial inequalities.
Solving took 0.0491 seconds.
Solved cost was 4538.

GP Solve 3
Using solver 'cvxopt'
 for 21 free variables
  in 22 posynomial inequalities.
Solving took 0.0587 seconds.
Solved cost was 4536.

GP Solve 4
Using solver 'cvxopt'
 for 21 free variables
  in 22 posynomial inequalities.
Solving took 0.145 seconds.
Solved cost was 4536.

Solving took 0.335 seconds and 4 GP solves.

======================================================================
ERROR [0.046s]: test_gpkitmodels_GP_aircraft_fuselage_test_fuselage_py_cvxopt (gpkit.tests.from_paths.TestFiles)
----------------------------------------------------------------------
Traceback (most recent call last):
  File "/Users/jenkins/workspace/CE_gpkit_PR_research_models/buildnode/macys/optimizer/cvxopt/gpkit/tests/helpers.py", line 55, in test
    testfn(name, import_dict, path)(self)
  File "/Users/jenkins/workspace/CE_gpkit_PR_research_models/buildnode/macys/optimizer/cvxopt/gpkit/tests/from_paths.py", line 48, in <lambda>
    lambda self: getattr(self, name)()))  # pylint:disable=undefined-variable
  File "/Users/jenkins/workspace/CE_gpkit_PR_research_models/buildnode/macys/optimizer/cvxopt/gpkit/tests/from_paths.py", line 34, in test_fn
    mod = __import__(os.path.basename(path)[:-3])
  File "/Users/jenkins/workspace/CE_gpkit_PR_research_models/buildnode/macys/optimizer/cvxopt/gplibrary/gpkitmodels/GP/aircraft/fuselage/test_fuselage.py", line 3, in <module>
    from gpkitmodels.GP.aircraft.wing.wing_test import FlightState
  File "/Users/jenkins/workspace/CE_gpkit_PR_research_models/buildnode/macys/optimizer/cvxopt/venv_jenkins/lib/python3.9/site-packages/gpkitmodels/GP/aircraft/wing/wing_test.py", line 2, in <module>
    from gpkitmodels.GP.aircraft.wing.wing import Wing
  File "/Users/jenkins/workspace/CE_gpkit_PR_research_models/buildnode/macys/optimizer/cvxopt/venv_jenkins/lib/python3.9/site-packages/gpkitmodels/GP/aircraft/wing/wing.py", line 10, in <module>
    from .capspar import CapSpar
  File "/Users/jenkins/workspace/CE_gpkit_PR_research_models/buildnode/macys/optimizer/cvxopt/venv_jenkins/lib/python3.9/site-packages/gpkitmodels/GP/aircraft/wing/capspar.py", line 4, in <module>
    from .gustloading import GustL
  File "/Users/jenkins/workspace/CE_gpkit_PR_research_models/buildnode/macys/optimizer/cvxopt/venv_jenkins/lib/python3.9/site-packages/gpkitmodels/GP/aircraft/wing/gustloading.py", line 4, in <module>
    from ad.admath import cos
ModuleNotFoundError: No module named 'ad'

======================================================================
ERROR [1.628s]: test_gpkitmodels_GP_aircraft_motor_motor_test_py_cvxopt (gpkit.tests.from_paths.TestFiles)
----------------------------------------------------------------------
Traceback (most recent call last):
  File "/Users/jenkins/workspace/CE_gpkit_PR_research_models/buildnode/macys/optimizer/cvxopt/gpkit/tests/helpers.py", line 55, in test
    testfn(name, import_dict, path)(self)
  File "/Users/jenkins/workspace/CE_gpkit_PR_research_models/buildnode/macys/optimizer/cvxopt/gpkit/tests/from_paths.py", line 48, in <lambda>
    lambda self: getattr(self, name)()))  # pylint:disable=undefined-variable
  File "/Users/jenkins/workspace/CE_gpkit_PR_research_models/buildnode/macys/optimizer/cvxopt/gpkit/tests/from_paths.py", line 34, in test_fn
    mod = __import__(os.path.basename(path)[:-3])
  File "/Users/jenkins/workspace/CE_gpkit_PR_research_models/buildnode/macys/optimizer/cvxopt/gplibrary/gpkitmodels/GP/aircraft/motor/motor_test.py", line 2, in <module>
    from gpkitmodels.GP.aircraft.motor.motor import Propulsor, Motor, MotorPerf
  File "/Users/jenkins/workspace/CE_gpkit_PR_research_models/buildnode/macys/optimizer/cvxopt/venv_jenkins/lib/python3.9/site-packages/gpkitmodels/GP/aircraft/motor/motor.py", line 4, in <module>
    from gpkitmodels.GP.aircraft.prop.propeller import Propeller, ActuatorProp
  File "/Users/jenkins/workspace/CE_gpkit_PR_research_models/buildnode/macys/optimizer/cvxopt/venv_jenkins/lib/python3.9/site-packages/gpkitmodels/GP/aircraft/prop/propeller.py", line 5, in <module>
    from gpfit.fit_constraintset import XfoilFit
ModuleNotFoundError: No module named 'gpfit.fit_constraintset'

======================================================================
ERROR [0.003s]: test_gpkitmodels_GP_aircraft_prop_prop_test_py_cvxopt (gpkit.tests.from_paths.TestFiles)
----------------------------------------------------------------------
Traceback (most recent call last):
  File "/Users/jenkins/workspace/CE_gpkit_PR_research_models/buildnode/macys/optimizer/cvxopt/gpkit/tests/helpers.py", line 55, in test
    testfn(name, import_dict, path)(self)
  File "/Users/jenkins/workspace/CE_gpkit_PR_research_models/buildnode/macys/optimizer/cvxopt/gpkit/tests/from_paths.py", line 48, in <lambda>
    lambda self: getattr(self, name)()))  # pylint:disable=undefined-variable
  File "/Users/jenkins/workspace/CE_gpkit_PR_research_models/buildnode/macys/optimizer/cvxopt/gpkit/tests/from_paths.py", line 34, in test_fn
    mod = __import__(os.path.basename(path)[:-3])
  File "/Users/jenkins/workspace/CE_gpkit_PR_research_models/buildnode/macys/optimizer/cvxopt/gplibrary/gpkitmodels/GP/aircraft/prop/prop_test.py", line 2, in <module>
    from gpkitmodels.GP.aircraft.prop.propeller import Propeller, ActuatorProp
  File "/Users/jenkins/workspace/CE_gpkit_PR_research_models/buildnode/macys/optimizer/cvxopt/venv_jenkins/lib/python3.9/site-packages/gpkitmodels/GP/aircraft/prop/propeller.py", line 5, in <module>
    from gpfit.fit_constraintset import XfoilFit
ModuleNotFoundError: No module named 'gpfit.fit_constraintset'

======================================================================
ERROR [0.006s]: test_gpkitmodels_GP_aircraft_tail_tail_tests_py_cvxopt (gpkit.tests.from_paths.TestFiles)
----------------------------------------------------------------------
Traceback (most recent call last):
  File "/Users/jenkins/workspace/CE_gpkit_PR_research_models/buildnode/macys/optimizer/cvxopt/gpkit/tests/helpers.py", line 55, in test
    testfn(name, import_dict, path)(self)
  File "/Users/jenkins/workspace/CE_gpkit_PR_research_models/buildnode/macys/optimizer/cvxopt/gpkit/tests/from_paths.py", line 48, in <lambda>
    lambda self: getattr(self, name)()))  # pylint:disable=undefined-variable
  File "/Users/jenkins/workspace/CE_gpkit_PR_research_models/buildnode/macys/optimizer/cvxopt/gpkit/tests/from_paths.py", line 34, in test_fn
    mod = __import__(os.path.basename(path)[:-3])
  File "/Users/jenkins/workspace/CE_gpkit_PR_research_models/buildnode/macys/optimizer/cvxopt/gplibrary/gpkitmodels/GP/aircraft/tail/tail_tests.py", line 2, in <module>
    from gpkitmodels.GP.aircraft.tail.horizontal_tail import HorizontalTail
  File "/Users/jenkins/workspace/CE_gpkit_PR_research_models/buildnode/macys/optimizer/cvxopt/venv_jenkins/lib/python3.9/site-packages/gpkitmodels/GP/aircraft/tail/horizontal_tail.py", line 4, in <module>
    from .tail_aero import TailAero
  File "/Users/jenkins/workspace/CE_gpkit_PR_research_models/buildnode/macys/optimizer/cvxopt/venv_jenkins/lib/python3.9/site-packages/gpkitmodels/GP/aircraft/tail/tail_aero.py", line 5, in <module>
    from gpfit.fit_constraintset import XfoilFit
ModuleNotFoundError: No module named 'gpfit.fit_constraintset'

======================================================================
ERROR [0.004s]: test_gpkitmodels_GP_aircraft_wing_wing_test_py_cvxopt (gpkit.tests.from_paths.TestFiles)
----------------------------------------------------------------------
Traceback (most recent call last):
  File "/Users/jenkins/workspace/CE_gpkit_PR_research_models/buildnode/macys/optimizer/cvxopt/gpkit/tests/helpers.py", line 55, in test
    testfn(name, import_dict, path)(self)
  File "/Users/jenkins/workspace/CE_gpkit_PR_research_models/buildnode/macys/optimizer/cvxopt/gpkit/tests/from_paths.py", line 48, in <lambda>
    lambda self: getattr(self, name)()))  # pylint:disable=undefined-variable
  File "/Users/jenkins/workspace/CE_gpkit_PR_research_models/buildnode/macys/optimizer/cvxopt/gpkit/tests/from_paths.py", line 34, in test_fn
    mod = __import__(os.path.basename(path)[:-3])
  File "/Users/jenkins/workspace/CE_gpkit_PR_research_models/buildnode/macys/optimizer/cvxopt/gplibrary/gpkitmodels/GP/aircraft/wing/wing_test.py", line 2, in <module>
    from gpkitmodels.GP.aircraft.wing.wing import Wing
  File "/Users/jenkins/workspace/CE_gpkit_PR_research_models/buildnode/macys/optimizer/cvxopt/venv_jenkins/lib/python3.9/site-packages/gpkitmodels/GP/aircraft/wing/wing.py", line 10, in <module>
    from .capspar import CapSpar
  File "/Users/jenkins/workspace/CE_gpkit_PR_research_models/buildnode/macys/optimizer/cvxopt/venv_jenkins/lib/python3.9/site-packages/gpkitmodels/GP/aircraft/wing/capspar.py", line 4, in <module>
    from .gustloading import GustL
  File "/Users/jenkins/workspace/CE_gpkit_PR_research_models/buildnode/macys/optimizer/cvxopt/venv_jenkins/lib/python3.9/site-packages/gpkitmodels/GP/aircraft/wing/gustloading.py", line 4, in <module>
    from ad.admath import cos
ModuleNotFoundError: No module named 'ad'

----------------------------------------------------------------------
Ran 8 tests in 4.887s

FAILED (errors=5)

Generating XML reports...
Cloning into 'eVTOL'...

Running tests...
----------------------------------------------------------------------
adding test for 'models/model_tests.py'
.
----------------------------------------------------------------------
Ran 1 test in 0.001s

OK

Generating XML reports...
Found no installed solvers, beginning a build.
# Building GPkit version 1.1
# Moving to the directory from which GPkit was imported.

Attempting to find and build solvers:

# Looking for `mosek_cli`
#   (A "success" is if mskexpopt complains that
#    we haven't specified a file for it to open.)
#     Calling 'mskexpopt'
##
### CALL BEGINS
### CALL ENDS
##
# Looks like `mskexpopt` was not found in the default PATH,
#  so let's try locating that binary ourselves.
#   Adding /Users/jenkins/mosek/8/tools/platform/osx64x86/bin to the PATH
#     Calling 'mskexpopt'
##
### CALL BEGINS
### CALL ENDS
##

Found mosek_cli in /Users/jenkins/mosek/8/tools/platform/osx64x86/bin

# Looking for `mosek_conif`
#   Trying to import mosek...
# Did not find
# mosek_conif

# Looking for `cvxopt`
#   Trying to import cvxopt...

Found cvxopt in the default PYTHONPATH
Replaced found solvers (['mosek_cli', 'cvxopt']) with environment var GPKITSOLVERS (cvxopt)

Found the following solvers: cvxopt
#     Replacing directory env

GPkit is now installed with solver(s) ['cvxopt']
To incorporate new solvers at a later date, run `gpkit.build()`.

If any tests didn't pass, please post the output above
(starting from "Found no installed solvers, beginning a build.")
to gpkit@mit.edu or https://github.com/convexengineering/gpkit/issues/new
so we can prevent others from having these errors.

The same goes for any other bugs you encounter with GPkit:
send 'em our way, along with any interesting models, speculative features,
comments, discussions, or clarifications you feel like sharing.

Finally, we hope you find our documentation (https://gpkit.readthedocs.io/)
and engineering-design models (https://github.com/convexengineering/gplibrary/)
to be useful resources for your own applications.

Enjoy!

calling ['git', 'clone', '--depth', '1', '-b', 'master', 'https://github.com/convexengineering/gplibrary.git']
  attempt 1
calling ['python', '/Users/jenkins/workspace/CE_gpkit_PR_research_models/buildnode/macys/optimizer/cvxopt/venv_jenkins/bin/pip', 'install', '--no-cache-dir', '--no-deps', '-e', 'gplibrary']
  attempt 1
calling ['git', 'clone', '--depth', '1', '-b', 'master', 'https://github.com/convexengineering/SPaircraft.git']
  attempt 1

SETTINGS
defaultdict(<class 'str'>, {'skipsolvers': 'cvxopt', 'pip install': 'git+https://github.com/hoburg/turbofan.git', 'gpkit-models branch': 'master'})

calling ['python', '/Users/jenkins/workspace/CE_gpkit_PR_research_models/buildnode/macys/optimizer/cvxopt/venv_jenkins/bin/pip', 'install', 'git+https://github.com/hoburg/turbofan.git']
  attempt 1
calling ['python', '/Users/jenkins/workspace/CE_gpkit_PR_research_models/buildnode/macys/optimizer/cvxopt/venv_jenkins/bin/pip', 'install', '.']
  attempt 1
calling ['git', 'clone', '--depth', '1', '-b', 'master', 'https://github.com/convexengineering/robust.git']
  attempt 1

SETTINGS
defaultdict(<class 'str'>, {})

calling ['python', '/Users/jenkins/workspace/CE_gpkit_PR_research_models/buildnode/macys/optimizer/cvxopt/venv_jenkins/bin/pip', 'install', '.']
  attempt 1
  attempt 2
  attempt 3
  attempt 4
  attempt 5
calling ['git', 'clone', '--depth', '1', '-b', 'master', 'https://github.com/convexengineering/shopping.git']
  attempt 1

SETTINGS
defaultdict(<class 'str'>, {})

calling ['git', 'clone', '--depth', '1', '-b', 'master', 'https://github.com/convexengineering/gassolar.git']
  attempt 1

SETTINGS
defaultdict(<class 'str'>, {'pip install': 'pandas, git+https://github.com/hoburg/gpfit.git', 'gpkit-models branch': 'master', 'skipsolvers': 'cvxopt'})

calling ['python', '/Users/jenkins/workspace/CE_gpkit_PR_research_models/buildnode/macys/optimizer/cvxopt/venv_jenkins/bin/pip', 'install', 'pandas']
  attempt 1
calling ['python', '/Users/jenkins/workspace/CE_gpkit_PR_research_models/buildnode/macys/optimizer/cvxopt/venv_jenkins/bin/pip', 'install', 'git+https://github.com/hoburg/gpfit.git']
  attempt 1
calling ['python', '/Users/jenkins/workspace/CE_gpkit_PR_research_models/buildnode/macys/optimizer/cvxopt/venv_jenkins/bin/pip', 'install', '.']
  attempt 1
calling ['git', 'clone', '--depth', '1', '-b', 'master', 'https://github.com/convexengineering/jho.git']
  attempt 1

SETTINGS
defaultdict(<class 'str'>, {'pip install': 'pandas, git+https://github.com/hoburg/gpfit.git', 'gpkit-models branch': 'master', 'skipsolvers': 'cvxopt'})

calling ['python', '/Users/jenkins/workspace/CE_gpkit_PR_research_models/buildnode/macys/optimizer/cvxopt/venv_jenkins/bin/pip', 'install', 'pandas']
  attempt 1
calling ['python', '/Users/jenkins/workspace/CE_gpkit_PR_research_models/buildnode/macys/optimizer/cvxopt/venv_jenkins/bin/pip', 'install', 'git+https://github.com/hoburg/gpfit.git']
  attempt 1
calling ['git', 'clone', '--depth', '1', '-b', 'master', 'https://github.com/convexengineering/turbofan.git']
  attempt 1

SETTINGS
defaultdict(<class 'str'>, {'skipsolvers': 'cvxopt, mosek_cli', 'gpkit-models branch': 'master'})

calling ['python', '/Users/jenkins/workspace/CE_gpkit_PR_research_models/buildnode/macys/optimizer/cvxopt/venv_jenkins/bin/pip', 'install', '.']
  attempt 1
calling ['git', 'clone', '--depth', '1', '-b', 'master', 'https://github.com/convexengineering/solar.git']
  attempt 1

SETTINGS
defaultdict(<class 'str'>, {'pip install': 'pandas, git+https://github.com/convexengineering/gpfit.git, git+https://github.com/convexengineering/gassolar.git', 'gpkit-models branch': 'master', 'skipsolvers': 'cvxopt'})

calling ['python', '/Users/jenkins/workspace/CE_gpkit_PR_research_models/buildnode/macys/optimizer/cvxopt/venv_jenkins/bin/pip', 'install', 'pandas']
  attempt 1
calling ['python', '/Users/jenkins/workspace/CE_gpkit_PR_research_models/buildnode/macys/optimizer/cvxopt/venv_jenkins/bin/pip', 'install', 'git+https://github.com/convexengineering/gpfit.git']
  attempt 1
calling ['python', '/Users/jenkins/workspace/CE_gpkit_PR_research_models/buildnode/macys/optimizer/cvxopt/venv_jenkins/bin/pip', 'install', 'git+https://github.com/convexengineering/gassolar.git']
  attempt 1
calling ['python', '/Users/jenkins/workspace/CE_gpkit_PR_research_models/buildnode/macys/optimizer/cvxopt/venv_jenkins/bin/pip', 'install', '.']
  attempt 1
calling ['git', 'clone', '--depth', '1', '-b', 'master', 'https://github.com/convexengineering/gplibrary.git']
  attempt 1
  attempt 2
  attempt 3
  attempt 4
  attempt 5

SETTINGS
defaultdict(<class 'str'>, {'pip install': 'pandas, git+https://github.com/hoburg/gpfit.git'})

calling ['python', '/Users/jenkins/workspace/CE_gpkit_PR_research_models/buildnode/macys/optimizer/cvxopt/venv_jenkins/bin/pip', 'install', 'pandas']
  attempt 1
calling ['python', '/Users/jenkins/workspace/CE_gpkit_PR_research_models/buildnode/macys/optimizer/cvxopt/venv_jenkins/bin/pip', 'install', 'git+https://github.com/hoburg/gpfit.git']
  attempt 1
calling ['python', '/Users/jenkins/workspace/CE_gpkit_PR_research_models/buildnode/macys/optimizer/cvxopt/venv_jenkins/bin/pip', 'install', '.']
  attempt 1
calling ['git', 'clone', '--depth', '1', '-b', 'master', 'https://github.com/convexengineering/eVTOL.git']
  attempt 1

SETTINGS
defaultdict(<class 'str'>, {'skipsolvers': 'cvxopt'})

[Execution node] check if [macys] is in [[windows10x64]]
Run condition [Execution node ] preventing perform for step [Execute Windows batch command]
Build step 'Console output (build log) parsing' changed build result to FAILURE
Recording test results
[Checks API] No suitable checks publisher found.
[WS-CLEANUP] Deleting project workspace...
[WS-CLEANUP] Deferred wipeout is used...
[WS-CLEANUP] done
Finished: FAILURE