Console Output

Started by upstream project "gplibrary_PR_Models" build number 101
originally caused by:
 GitHub pull request #176 of commit 333803220bcb170d227c43a0705df9f61e3a4e3a, no merge conflicts.
Running as SYSTEM
[EnvInject] - Loading node environment variables.
Building remotely on windows10x64 in workspace C:\Users\jenkins\workspace\gplibrary_PR_Models\mosek
No credentials specified
Wiping out workspace first.
Cloning the remote Git repository
Cloning repository https://github.com/convexengineering/gplibrary
 > C:\Program Files\Git\cmd\git init C:\Users\jenkins\workspace\gplibrary_PR_Models\mosek # timeout=10
Fetching upstream changes from https://github.com/convexengineering/gplibrary
 > C:\Program Files\Git\cmd\git --version # timeout=10
 > C:\Program Files\Git\cmd\git fetch --tags --progress https://github.com/convexengineering/gplibrary +refs/heads/*:refs/remotes/origin/* # timeout=10
 > C:\Program Files\Git\cmd\git config remote.origin.url https://github.com/convexengineering/gplibrary # timeout=10
 > C:\Program Files\Git\cmd\git config --add remote.origin.fetch +refs/heads/*:refs/remotes/origin/* # timeout=10
 > C:\Program Files\Git\cmd\git config remote.origin.url https://github.com/convexengineering/gplibrary # timeout=10
Fetching upstream changes from https://github.com/convexengineering/gplibrary
 > C:\Program Files\Git\cmd\git fetch --tags --progress https://github.com/convexengineering/gplibrary +refs/pull/*:refs/remotes/origin/pr/* +refs/heads/master:refs/remotes/origin/master # timeout=10
Merging Revision ae5467efe73dfd63300666f23535fc77b6688568 (refs/remotes/origin/pr/176/merge) to origin/master, UserMergeOptions{mergeRemote='origin', mergeTarget='master', mergeStrategy='DEFAULT', fastForwardMode='FF'}
 > C:\Program Files\Git\cmd\git rev-parse "origin/master^{commit}" # timeout=10
 > C:\Program Files\Git\cmd\git config core.sparsecheckout # timeout=10
 > C:\Program Files\Git\cmd\git checkout -f origin/master # timeout=3
 > C:\Program Files\Git\cmd\git merge --ff ae5467efe73dfd63300666f23535fc77b6688568 # timeout=10
 > C:\Program Files\Git\cmd\git rev-parse "HEAD^{commit}" # timeout=10
Seen branch in repository origin/1682literate
Seen branch in repository origin/1682master
Seen branch in repository origin/Breakdown
Seen branch in repository origin/aerosurf
Seen branch in repository origin/atmosphere
Seen branch in repository origin/bounds5
Seen branch in repository origin/boxspar
Seen branch in repository origin/breguet_range
Seen branch in repository origin/breguetsetup
Seen branch in repository origin/climb
Seen branch in repository origin/commercial_sizing
Seen branch in repository origin/compress-aero
Seen branch in repository origin/d8
Seen branch in repository origin/electric_motor
Seen branch in repository origin/firefly
Seen branch in repository origin/fits
Seen branch in repository origin/flightsegments
Seen branch in repository origin/interactive_simpleflight
Seen branch in repository origin/libRename
Seen branch in repository origin/master
Seen branch in repository origin/materials
Seen branch in repository origin/md_template
Seen branch in repository origin/motor
Seen branch in repository origin/ncrit
Seen branch in repository origin/performance
Seen branch in repository origin/pr/10/head
Seen branch in repository origin/pr/100/head
Seen branch in repository origin/pr/103/head
Seen branch in repository origin/pr/105/head
Seen branch in repository origin/pr/105/merge
Seen branch in repository origin/pr/107/head
Seen branch in repository origin/pr/109/head
Seen branch in repository origin/pr/11/head
Seen branch in repository origin/pr/11/merge
Seen branch in repository origin/pr/110/head
Seen branch in repository origin/pr/112/head
Seen branch in repository origin/pr/113/head
Seen branch in repository origin/pr/113/merge
Seen branch in repository origin/pr/114/head
Seen branch in repository origin/pr/115/head
Seen branch in repository origin/pr/115/merge
Seen branch in repository origin/pr/116/head
Seen branch in repository origin/pr/118/head
Seen branch in repository origin/pr/119/head
Seen branch in repository origin/pr/119/merge
Seen branch in repository origin/pr/12/head
Seen branch in repository origin/pr/120/head
Seen branch in repository origin/pr/121/head
Seen branch in repository origin/pr/121/merge
Seen branch in repository origin/pr/122/head
Seen branch in repository origin/pr/123/head
Seen branch in repository origin/pr/124/head
Seen branch in repository origin/pr/125/head
Seen branch in repository origin/pr/127/head
Seen branch in repository origin/pr/128/head
Seen branch in repository origin/pr/129/head
Seen branch in repository origin/pr/13/head
Seen branch in repository origin/pr/13/merge
Seen branch in repository origin/pr/131/head
Seen branch in repository origin/pr/132/head
Seen branch in repository origin/pr/133/head
Seen branch in repository origin/pr/134/head
Seen branch in repository origin/pr/135/head
Seen branch in repository origin/pr/136/head
Seen branch in repository origin/pr/137/head
Seen branch in repository origin/pr/138/head
Seen branch in repository origin/pr/139/head
Seen branch in repository origin/pr/14/head
Seen branch in repository origin/pr/14/merge
Seen branch in repository origin/pr/141/head
Seen branch in repository origin/pr/143/head
Seen branch in repository origin/pr/144/head
Seen branch in repository origin/pr/144/merge
Seen branch in repository origin/pr/145/head
Seen branch in repository origin/pr/145/merge
Seen branch in repository origin/pr/146/head
Seen branch in repository origin/pr/147/head
Seen branch in repository origin/pr/149/head
Seen branch in repository origin/pr/15/head
Seen branch in repository origin/pr/150/head
Seen branch in repository origin/pr/151/head
Seen branch in repository origin/pr/152/head
Seen branch in repository origin/pr/153/head
Seen branch in repository origin/pr/154/head
Seen branch in repository origin/pr/154/merge
Seen branch in repository origin/pr/155/head
Seen branch in repository origin/pr/156/head
Seen branch in repository origin/pr/157/head
Seen branch in repository origin/pr/158/head
Seen branch in repository origin/pr/159/head
Seen branch in repository origin/pr/16/head
Seen branch in repository origin/pr/160/head
Seen branch in repository origin/pr/160/merge
Seen branch in repository origin/pr/161/head
Seen branch in repository origin/pr/162/head
Seen branch in repository origin/pr/163/head
Seen branch in repository origin/pr/165/head
Seen branch in repository origin/pr/166/head
Seen branch in repository origin/pr/166/merge
Seen branch in repository origin/pr/167/head
Seen branch in repository origin/pr/168/head
Seen branch in repository origin/pr/169/head
Seen branch in repository origin/pr/17/head
Seen branch in repository origin/pr/17/merge
Seen branch in repository origin/pr/171/head
Seen branch in repository origin/pr/172/head
Seen branch in repository origin/pr/173/head
Seen branch in repository origin/pr/173/merge
Seen branch in repository origin/pr/174/head
Seen branch in repository origin/pr/174/merge
Seen branch in repository origin/pr/175/head
Seen branch in repository origin/pr/176/head
Seen branch in repository origin/pr/176/merge
Seen branch in repository origin/pr/19/head
Seen branch in repository origin/pr/19/merge
Seen branch in repository origin/pr/20/head
Seen branch in repository origin/pr/22/head
Seen branch in repository origin/pr/22/merge
Seen branch in repository origin/pr/23/head
Seen branch in repository origin/pr/23/merge
Seen branch in repository origin/pr/24/head
Seen branch in repository origin/pr/25/head
Seen branch in repository origin/pr/26/head
Seen branch in repository origin/pr/26/merge
Seen branch in repository origin/pr/27/head
Seen branch in repository origin/pr/29/head
Seen branch in repository origin/pr/30/head
Seen branch in repository origin/pr/31/head
Seen branch in repository origin/pr/33/head
Seen branch in repository origin/pr/34/head
Seen branch in repository origin/pr/35/head
Seen branch in repository origin/pr/36/head
Seen branch in repository origin/pr/37/head
Seen branch in repository origin/pr/38/head
Seen branch in repository origin/pr/39/head
Seen branch in repository origin/pr/40/head
Seen branch in repository origin/pr/40/merge
Seen branch in repository origin/pr/42/head
Seen branch in repository origin/pr/42/merge
Seen branch in repository origin/pr/43/head
Seen branch in repository origin/pr/44/head
Seen branch in repository origin/pr/44/merge
Seen branch in repository origin/pr/45/head
Seen branch in repository origin/pr/46/head
Seen branch in repository origin/pr/46/merge
Seen branch in repository origin/pr/47/head
Seen branch in repository origin/pr/47/merge
Seen branch in repository origin/pr/5/head
Seen branch in repository origin/pr/54/head
Seen branch in repository origin/pr/54/merge
Seen branch in repository origin/pr/55/head
Seen branch in repository origin/pr/57/head
Seen branch in repository origin/pr/58/head
Seen branch in repository origin/pr/60/head
Seen branch in repository origin/pr/61/head
Seen branch in repository origin/pr/62/head
Seen branch in repository origin/pr/63/head
Seen branch in repository origin/pr/63/merge
Seen branch in repository origin/pr/64/head
Seen branch in repository origin/pr/69/head
Seen branch in repository origin/pr/70/head
Seen branch in repository origin/pr/70/merge
Seen branch in repository origin/pr/71/head
Seen branch in repository origin/pr/72/head
Seen branch in repository origin/pr/72/merge
Seen branch in repository origin/pr/73/head
Seen branch in repository origin/pr/73/merge
Seen branch in repository origin/pr/75/head
Seen branch in repository origin/pr/75/merge
Seen branch in repository origin/pr/77/head
Seen branch in repository origin/pr/77/merge
Seen branch in repository origin/pr/78/head
Seen branch in repository origin/pr/78/merge
Seen branch in repository origin/pr/80/head
Seen branch in repository origin/pr/82/head
Seen branch in repository origin/pr/82/merge
Seen branch in repository origin/pr/83/head
Seen branch in repository origin/pr/83/merge
Seen branch in repository origin/pr/85/head
Seen branch in repository origin/pr/85/merge
Seen branch in repository origin/pr/86/head
Seen branch in repository origin/pr/88/head
Seen branch in repository origin/pr/88/merge
Seen branch in repository origin/pr/89/head
Seen branch in repository origin/pr/89/merge
Seen branch in repository origin/pr/9/head
Seen branch in repository origin/pr/90/head
Seen branch in repository origin/pr/90/merge
Seen branch in repository origin/pr/91/head
Seen branch in repository origin/pr/91/merge
Seen branch in repository origin/pr/92/head
Seen branch in repository origin/pr/92/merge
Seen branch in repository origin/pr/94/head
Seen branch in repository origin/pr/96/head
Seen branch in repository origin/pr/96/merge
Seen branch in repository origin/pr/97/head
Seen branch in repository origin/pr/97/merge
Seen branch in repository origin/pr/98/head
Seen branch in repository origin/pr/99/head
Seen branch in repository origin/prop_beta
Seen branch in repository origin/python3
Seen branch in repository origin/qstr
Seen branch in repository origin/quadrotor
Seen branch in repository origin/robustSPpaper
Seen branch in repository origin/robustSPpaper2
Seen branch in repository origin/rockets
Seen branch in repository origin/sigeq_paper
Seen branch in repository origin/simple_HT_sizing
Seen branch in repository origin/simple_flight_profile
Seen branch in repository origin/standard_atmosphere
Seen branch in repository origin/sutherland
Seen branch in repository origin/troposphere
Seen branch in repository origin/uncertain
Seen branch in repository origin/vectorizeplanform
Seen branch in repository origin/wide_body
Seen branch in repository origin/wvl
Seen 216 remote branches
 > C:\Program Files\Git\cmd\git show-ref --tags -d # timeout=10
Checking out Revision ae5467efe73dfd63300666f23535fc77b6688568 (origin/pr/176/merge, origin/master)
 > C:\Program Files\Git\cmd\git config core.sparsecheckout # timeout=10
 > C:\Program Files\Git\cmd\git checkout -f ae5467efe73dfd63300666f23535fc77b6688568 # timeout=3
Commit message: "Merge 333803220bcb170d227c43a0705df9f61e3a4e3a into f3027d71c558db6f128bf22f9e0490a2520aa3c0"
Using 'Changelog to branch' strategy.
Run condition [Execution node ] enabling prebuild for step [Execute shell]
Run condition [Execution node ] enabling prebuild for step [Execute Windows batch command]
[description-setter] Description set: <a title="python3 compatibility" href="https://github.com/convexengineering/gplibrary/pull/176">PR 176</a>: python3 compatibility
[Execution node] check if [windows10x64] is in [[macys, macys_VM, reynolds, reynolds-ubuntu16]]
Run condition [Execution node ] preventing perform for step [Execute shell]
[Execution node] check if [windows10x64] is in [[windows10x64, windows7x64]]
Run condition [Execution node ] enabling perform for step [Execute Windows batch command]
[mosek] $ cmd /c call C:\Users\jenkins\AppData\Local\Temp\jenkins8693598252062951799.bat

C:\Users\jenkins\workspace\gplibrary_PR_Models\mosek>echo C:\Program Files (x86)\Common Files\Oracle\Java\javapath;C:\ProgramData\Oracle\Java\javapath;C:\WINDOWS\system32;C:\WINDOWS;C:\WINDOWS\System32\Wbem;C:\WINDOWS\System32\WindowsPowerShell\v1.0\;C:\Anaconda2;C:\Anaconda2\Scripts;C:\Anaconda2\Library\bin;C:\Program Files\Mosek\8\tools\platform\win64x86\bin;C:\Program Files\TortoiseSVN\bin;C:\Program Files (x86)\Intel\Compiler\Fortran\9.1\EM64T\Bin;C:\WINDOWS\System32\OpenSSH\;C:\Program Files\Git\bin;C:\Users\jenkins\AppData\Local\Microsoft\WindowsApps 
C:\Program Files (x86)\Common Files\Oracle\Java\javapath;C:\ProgramData\Oracle\Java\javapath;C:\WINDOWS\system32;C:\WINDOWS;C:\WINDOWS\System32\Wbem;C:\WINDOWS\System32\WindowsPowerShell\v1.0\;C:\Anaconda2;C:\Anaconda2\Scripts;C:\Anaconda2\Library\bin;C:\Program Files\Mosek\8\tools\platform\win64x86\bin;C:\Program Files\TortoiseSVN\bin;C:\Program Files (x86)\Intel\Compiler\Fortran\9.1\EM64T\Bin;C:\WINDOWS\System32\OpenSSH\;C:\Program Files\Git\bin;C:\Users\jenkins\AppData\Local\Microsoft\WindowsApps

C:\Users\jenkins\workspace\gplibrary_PR_Models\mosek>REM turn on the anaconda console 

C:\Users\jenkins\workspace\gplibrary_PR_Models\mosek>call activate.bat   || exit /b 666 

(base) C:\Users\jenkins\workspace\gplibrary_PR_Models\mosek>REM Create a virtualenv to install everything into 

(base) C:\Users\jenkins\workspace\gplibrary_PR_Models\mosek>SET VENV=C:\Users\jenkins\workspace\gplibrary_PR_Models\mosek\venv2_gpkit 

(base) C:\Users\jenkins\workspace\gplibrary_PR_Models\mosek>virtualenv --system-site-packages C:\Users\jenkins\workspace\gplibrary_PR_Models\mosek\venv2_gpkit    || exit /b 666 
New python executable in C:\Users\jenkins\workspace\gplibrary_PR_Models\mosek\venv2_gpkit\Scripts\python.exe
Installing setuptools, pip, wheel...done.

(base) C:\Users\jenkins\workspace\gplibrary_PR_Models\mosek>call C:\Users\jenkins\workspace\gplibrary_PR_Models\mosek\venv2_gpkit\Scripts\activate.bat    || exit /b 666 

(venv2_gpkit) (base) C:\Users\jenkins\workspace\gplibrary_PR_Models\mosek>set PATH=C:\mingw-w64\x86_64-6.4.0-posix-seh-rt_v5-rev0\mingw64\bin;C:\Users\jenkins\workspace\gplibrary_PR_Models\mosek\venv2_gpkit\Scripts;C:\Anaconda2;C:\Anaconda2\Library\mingw-w64\bin;C:\Anaconda2\Library\usr\bin;C:\Anaconda2\Library\bin;C:\Anaconda2\Scripts;C:\Anaconda2\bin;C:\Anaconda2\condabin;C:\Program Files (x86)\Common Files\Oracle\Java\javapath;C:\ProgramData\Oracle\Java\javapath;C:\WINDOWS\system32;C:\WINDOWS;C:\WINDOWS\System32\Wbem;C:\WINDOWS\System32\WindowsPowerShell\v1.0;C:\Anaconda2;C:\Anaconda2\Scripts;C:\Anaconda2\Library\bin;C:\Program Files\Mosek\8\tools\platform\win64x86\bin;C:\Program Files\TortoiseSVN\bin;C:\Program Files (x86)\Intel\Compiler\Fortran\9.1\EM64T\Bin;C:\WINDOWS\System32\OpenSSH;C:\Program Files\Git\bin;C:\Users\jenkins\AppData\Local\Microsoft\WindowsApps 

(venv2_gpkit) (base) C:\Users\jenkins\workspace\gplibrary_PR_Models\mosek>REM set PATH=C:\mingw-w64\x86_64-7.3.0-posix-seh-rt_v5-rev0\mingw64\bin;C:\mingw-w64\x86_64-6.4.0-posix-seh-rt_v5-rev0\mingw64\bin;C:\Users\jenkins\workspace\gplibrary_PR_Models\mosek\venv2_gpkit\Scripts;C:\Anaconda2;C:\Anaconda2\Library\mingw-w64\bin;C:\Anaconda2\Library\usr\bin;C:\Anaconda2\Library\bin;C:\Anaconda2\Scripts;C:\Anaconda2\bin;C:\Anaconda2\condabin;C:\Program Files (x86)\Common Files\Oracle\Java\javapath;C:\ProgramData\Oracle\Java\javapath;C:\WINDOWS\system32;C:\WINDOWS;C:\WINDOWS\System32\Wbem;C:\WINDOWS\System32\WindowsPowerShell\v1.0;C:\Anaconda2;C:\Anaconda2\Scripts;C:\Anaconda2\Library\bin;C:\Program Files\Mosek\8\tools\platform\win64x86\bin;C:\Program Files\TortoiseSVN\bin;C:\Program Files (x86)\Intel\Compiler\Fortran\9.1\EM64T\Bin;C:\WINDOWS\System32\OpenSSH;C:\Program Files\Git\bin;C:\Users\jenkins\AppData\Local\Microsoft\WindowsApps 

(venv2_gpkit) (base) C:\Users\jenkins\workspace\gplibrary_PR_Models\mosek>gcc --version   || exit /b 666 
gcc (x86_64-posix-seh-rev0, Built by MinGW-W64 project) 6.4.0
Copyright (C) 2017 Free Software Foundation, Inc.
This is free software; see the source for copying conditions.  There is NO
warranty; not even for MERCHANTABILITY or FITNESS FOR A PARTICULAR PURPOSE.


(venv2_gpkit) (base) C:\Users\jenkins\workspace\gplibrary_PR_Models\mosek>REM upgdade pip 

(venv2_gpkit) (base) C:\Users\jenkins\workspace\gplibrary_PR_Models\mosek>python -m pip install --upgrade pip   || exit /b 666 
DEPRECATION: Python 2.7 will reach the end of its life on January 1st, 2020. Please upgrade your Python as Python 2.7 won't be maintained after that date. A future version of pip will drop support for Python 2.7. More details about Python 2 support in pip, can be found at https://pip.pypa.io/en/latest/development/release-process/#python-2-support
Requirement already up-to-date: pip in c:\users\jenkins\workspace\gplibrary_pr_models\mosek\venv2_gpkit\lib\site-packages (19.2.3)

(venv2_gpkit) (base) C:\Users\jenkins\workspace\gplibrary_PR_Models\mosek>REM Install coverage into the virtualenv to the coverage command blow uses the virtualenv python 

(venv2_gpkit) (base) C:\Users\jenkins\workspace\gplibrary_PR_Models\mosek>pip install --upgrade coverage   || exit /b 666 
DEPRECATION: Python 2.7 will reach the end of its life on January 1st, 2020. Please upgrade your Python as Python 2.7 won't be maintained after that date. A future version of pip will drop support for Python 2.7. More details about Python 2 support in pip, can be found at https://pip.pypa.io/en/latest/development/release-process/#python-2-support
Requirement already up-to-date: coverage in c:\anaconda2\lib\site-packages (4.5.4)

(venv2_gpkit) (base) C:\Users\jenkins\workspace\gplibrary_PR_Models\mosek>SET GPKITBUILD=C:\Users\jenkins\workspace\gplibrary_PR_Models\mosek\build_gpkit 

(venv2_gpkit) (base) C:\Users\jenkins\workspace\gplibrary_PR_Models\mosek>if mosek == cvxopt (
pip install --upgrade cvxopt   || exit /b 666  
 set GPKITSOLVERS=cvxopt 
) 

(venv2_gpkit) (base) C:\Users\jenkins\workspace\gplibrary_PR_Models\mosek>if mosek == mosek (
msktestlic   || exit /b 666  
 python -c "__import__('mosek').Env()"   || exit /b 666  
 set GPKITSOLVERS=mosek, mosek_cli 
) 
Problem
  Name                   :                 
  Objective sense        : min             
  Type                   : LO (linear optimization problem)
  Constraints            : 1               
  Cones                  : 0               
  Scalar variables       : 5000            
  Matrix variables       : 0               
  Integer variables      : 0               

Optimizer started.
Mosek license manager: License path: C:\Users\jenkins\mosek\mosek.lic
Mosek license manager:  Checkout license feature 'PTS' from flexlm.
Mosek license manager:  Checkout time 0.01. r: 0 status: 0
Interior-point optimizer started.
Presolve started.
Eliminator started.
Freed constraints in eliminator : 0
Eliminator terminated.
Eliminator - tries                  : 1                 time                   : 0.00            
Lin. dep.  - tries                  : 0                 time                   : 0.00            
Lin. dep.  - number                 : 0               
Presolve terminated. Time: 0.00    
Interior-point optimizer terminated. Time: 0.00. 

Optimizer terminated. Time: 0.08    
************************************
A license was checked out correctly.
************************************

(venv2_gpkit) (base) C:\Users\jenkins\workspace\gplibrary_PR_Models\mosek>python -c "import scipy; print scipy.__version__"   || exit /b 666 
1.2.1

(venv2_gpkit) (base) C:\Users\jenkins\workspace\gplibrary_PR_Models\mosek>python -c "import numpy; print numpy.__version__"   || exit /b 666 
1.16.5

(venv2_gpkit) (base) C:\Users\jenkins\workspace\gplibrary_PR_Models\mosek>python -c "import pint; print pint.__version__"   || exit /b 666 
0.9

(venv2_gpkit) (base) C:\Users\jenkins\workspace\gplibrary_PR_Models\mosek>REM Install gpkit to run the documentation examples 

(venv2_gpkit) (base) C:\Users\jenkins\workspace\gplibrary_PR_Models\mosek>git clone --depth 1 https://github.com/convexengineering/gpkit.git   || exit /b 666 
Cloning into 'gpkit'...

(venv2_gpkit) (base) C:\Users\jenkins\workspace\gplibrary_PR_Models\mosek>pip install -e C:\Users\jenkins\workspace\gplibrary_PR_Models\mosek\gpkit   || exit /b 666 
DEPRECATION: Python 2.7 will reach the end of its life on January 1st, 2020. Please upgrade your Python as Python 2.7 won't be maintained after that date. A future version of pip will drop support for Python 2.7. More details about Python 2 support in pip, can be found at https://pip.pypa.io/en/latest/development/release-process/#python-2-support
Obtaining file:///C:/Users/jenkins/workspace/gplibrary_PR_Models/mosek/gpkit
Requirement already satisfied: numpy>=1.13.3 in c:\anaconda2\lib\site-packages (from gpkit==0.9.1.0) (1.16.5)
Requirement already satisfied: pint>=0.8.1 in c:\anaconda2\lib\site-packages (from gpkit==0.9.1.0) (0.9)
Requirement already satisfied: scipy in c:\anaconda2\lib\site-packages (from gpkit==0.9.1.0) (1.2.2)
Requirement already satisfied: ad in c:\anaconda2\lib\site-packages (from gpkit==0.9.1.0) (1.3.2)
Requirement already satisfied: cvxopt>=1.1.8 in c:\anaconda2\lib\site-packages (from gpkit==0.9.1.0) (1.2.3)
Requirement already satisfied: six in c:\anaconda2\lib\site-packages (from gpkit==0.9.1.0) (1.12.0)
Requirement already satisfied: funcsigs; python_version == "2.7" in c:\anaconda2\lib\site-packages (from pint>=0.8.1->gpkit==0.9.1.0) (1.0.2)
Requirement already satisfied: mkl in c:\anaconda2\lib\site-packages (from cvxopt>=1.1.8->gpkit==0.9.1.0) (2018.0.0)
Requirement already satisfied: intel-openmp==2018.0.0 in c:\anaconda2\lib\site-packages (from mkl->cvxopt>=1.1.8->gpkit==0.9.1.0) (2018.0.0)
Installing collected packages: gpkit
  Running setup.py develop for gpkit
Successfully installed gpkit

(venv2_gpkit) (base) C:\Users\jenkins\workspace\gplibrary_PR_Models\mosek>pip install -e C:\Users\jenkins\workspace\gplibrary_PR_Models\mosek   || exit /b 666 
DEPRECATION: Python 2.7 will reach the end of its life on January 1st, 2020. Please upgrade your Python as Python 2.7 won't be maintained after that date. A future version of pip will drop support for Python 2.7. More details about Python 2 support in pip, can be found at https://pip.pypa.io/en/latest/development/release-process/#python-2-support
Obtaining file:///C:/Users/jenkins/workspace/gplibrary_PR_Models/mosek
Requirement already satisfied: numpy>=1.12 in c:\anaconda2\lib\site-packages (from gpkitmodels==0.0.0.0) (1.16.5)
Requirement already satisfied: scipy in c:\anaconda2\lib\site-packages (from gpkitmodels==0.0.0.0) (1.2.2)
Requirement already satisfied: pint in c:\anaconda2\lib\site-packages (from gpkitmodels==0.0.0.0) (0.9)
Requirement already satisfied: future in c:\anaconda2\lib\site-packages (from gpkitmodels==0.0.0.0) (0.17.1)
Requirement already satisfied: funcsigs; python_version == "2.7" in c:\anaconda2\lib\site-packages (from pint->gpkitmodels==0.0.0.0) (1.0.2)
Installing collected packages: gpkitmodels
  Running setup.py develop for gpkitmodels
Successfully installed gpkitmodels

(venv2_gpkit) (base) C:\Users\jenkins\workspace\gplibrary_PR_Models\mosek>REM Show the settings file 

(venv2_gpkit) (base) C:\Users\jenkins\workspace\gplibrary_PR_Models\mosek>REM type C:\Users\jenkins\workspace\gplibrary_PR_Models\mosek\gpkit\gpkit\env\settings 

(venv2_gpkit) (base) C:\Users\jenkins\workspace\gplibrary_PR_Models\mosek>REM dir C:\Users\jenkins\workspace\gplibrary_PR_Models\mosek\build_gpkit 

(venv2_gpkit) (base) C:\Users\jenkins\workspace\gplibrary_PR_Models\mosek>REM Limit number of threads that be can used 

(venv2_gpkit) (base) C:\Users\jenkins\workspace\gplibrary_PR_Models\mosek>set MSK_IPAR_NUM_THREADS=2 

(venv2_gpkit) (base) C:\Users\jenkins\workspace\gplibrary_PR_Models\mosek>set MKL_NUM_THREADS=2 

(venv2_gpkit) (base) C:\Users\jenkins\workspace\gplibrary_PR_Models\mosek>set NUMEXPR_NUM_THREADS=2 

(venv2_gpkit) (base) C:\Users\jenkins\workspace\gplibrary_PR_Models\mosek>set OPENBLAS_NUM_THREADS=2 

(venv2_gpkit) (base) C:\Users\jenkins\workspace\gplibrary_PR_Models\mosek>set OMP_NUM_THREADS=2 

(venv2_gpkit) (base) C:\Users\jenkins\workspace\gplibrary_PR_Models\mosek>python -c "from gpkit.tests.test_repo import test_repos; test_repos(xmloutput=True, ingpkitmodels=True)"   || exit /b 666 
No filename given.
Usage:
     mskexpopt FILENAME [-primal] [-dual] [-p parameterfile]
Return code: 1052
Description: MSK_RES_ERR_FILE_OPEN [An error occurred while opening a file.]
...................................................................................................................................................................................................................................................Found no installed solvers, beginning a build.
# Moving to the directory from which GPkit was imported.
Started building gpkit...

Attempting to find and build solvers:

# Looking for mosek
#     Found C:\Program Files\Mosek\8\tools\platform\win64x86\h\mosek.h
#     Found C:\Program Files\Mosek\8\tools\platform\win64x86\bin\mosek64_8_0.dll
#     Found C:\Program Files\Mosek\8\tools\examples\c\scopt-ext.c
#     Found C:\Program Files\Mosek\8\tools\examples\c\expopt.c
#     Found C:\Program Files\Mosek\8\tools\examples\c\dgopt.c
#     Found C:\Program Files\Mosek\8\tools\examples\c\scopt-ext.h
#     Found C:\Program Files\Mosek\8\tools\examples\c\expopt.h
#     Found C:\Program Files\Mosek\8\tools\examples\c\dgopt.h
#     Found C:\Program Files\Mosek\8\tools\platform\win64x86\h\mosek.h
# Found mosek version 8, installed to C:\Program Files\Mosek
#
# Building mosek...
#     Replacing directory _mosek\build
#     Replacing directory C:\Users\jenkins\workspace\gplibrary_PR_Models\mosek\build_gpkit
#
#   Copying expopt library files to _mosek\build
#     Copying C:\Program Files\Mosek\8\tools\examples\c\scopt-ext.c
#     Copying C:\Program Files\Mosek\8\tools\examples\c\expopt.c
#     Copying C:\Program Files\Mosek\8\tools\examples\c\dgopt.c
#     Copying C:\Program Files\Mosek\8\tools\examples\c\scopt-ext.h
#     Copying C:\Program Files\Mosek\8\tools\examples\c\expopt.h
#     Copying C:\Program Files\Mosek\8\tools\examples\c\dgopt.h
#     Copying C:\Program Files\Mosek\8\tools\platform\win64x86\h\mosek.h
#
#   Applying expopt patches...
#
#     Change in _mosek\build\dgopt.con line 653
#     --         printf("Number of Hessian non-zeros: %d\n",nlh[0]->numhesnz);
#     ++ MSK_echotask(task,MSK_STREAM_MSG,"Number of Hessian non-zeros: %d\n",n
#
#     Change in _mosek\build\expopt.con line 566
#     --         printf("Warning: The variable with index '%d' has only positiv
#     ++ MSK_echotask(expopttask,MSK_STREAM_MSG, "Warning: The variable with in
#
#     Change in _mosek\build\expopt.con line 579
#     --         printf("Warning: The variable with index '%d' has only negativ
#     ++ MSK_echotask(expopttask,MSK_STREAM_MSG, "Warning: The variable with in
#
#     Change in _mosek\build\expopt.con line 1115
#     --     printf ("solsta = %d, prosta = %d\n", (int)*solsta,(int)*prosta);
#     ++ MSK_echotask(expopttask,MSK_STREAM_MSG, "solsta = %d, prosta = %d\n", 
#
#   Building expopt library...
#     Calling 'gcc -fpic -shared -Wl,--export-all-symbols,-R "C:\Program Files\Mosek\8\tools\platform\win64x86\bin"    _mosek\build\scopt-ext.c _mosek\build\expopt.c _mosek\build\dgopt.c   "C:\Program Files\Mosek\8\tools\platform\win64x86\bin\mosek64_8_0.dll" -o C:\Users\jenkins\workspace\gplibrary_PR_Models\mosek\build_gpkit\expopt.so'
##
### CALL BEGINS
### CALL ENDS
##
# Done building mosek
# Looking for mosek_cli
#   Trying to run mskexpopt...
#     Calling 'mskexpopt'
##
### CALL BEGINS
### CALL ENDS
##
# Found mosek_cli in system path
# Looking for cvxopt
#   Trying to import cvxopt...
# Found cvxopt in Python path
...finished building gpkit.
Replaced found solvers ([u'mosek', u'mosek_cli', u'cvxopt']) with environment var GPKITSOLVERS (mosek, mosek_cli)

Found the following solvers: mosek, mosek_cli
#     Replacing directory env
x[:] <= w

GPkit is now installed with solver(s) [u'mosek', u'mosek_cli']
To incorporate new solvers at a later date, run `gpkit.build()`.

If any tests didn't pass, please post the output above
(starting from "Found no installed solvers, beginning a build.")
to gpkit@mit.edu or https://github.com/convexengineering/gpkit/issues/new
so we can prevent others from having these errors.

The same goes for any other bugs you encounter with GPkit:
send 'em our way, along with any interesting models, speculative features,
comments, discussions, or clarifications you feel like sharing.

Finally, we hope you find our documentation (https://gpkit.readthedocs.io/)
and engineering-design models (https://github.com/convexengineering/gplibrary/)
to be useful resources for your own applications.

Enjoy!

USING LOCAL DIDEPRECATION: Python 2.7 will reach the end of its life on January 1st, 2020. Please upgrade your Python as Python 2.7 won't be maintained after that date. A future version of pip will drop support for Python 2.7. More details about Python 2 support in pip, can be found at https://pip.pypa.io/en/latest/development/release-process/#python-2-support
Obtaining file:///C:/Users/jenkins/workspace/gplibrary_PR_Models/mosek
Installing collected packages: gpkitmodels
  Found existing installation: gpkitmodels 0.0.0.0
    Uninstalling gpkitmodels-0.0.0.0:
      Successfully uninstalled gpkitmodels-0.0.0.0
  Running setup.py develop for gpkitmodels
Successfully installed gpkitmodels
Cloning into 'robust'...
DEPRECATION: Python 2.7 will reach the end of its life on January 1st, 2020. Please upgrade your Python as Python 2.7 won't be maintained after that date. A future version of pip will drop support for Python 2.7. More details about Python 2 support in pip, can be found at https://pip.pypa.io/en/latest/development/release-process/#python-2-support
Processing c:\users\jenkins\workspace\gplibrary_pr_models\mosek\robust
Requirement already satisfied: gpkit in c:\users\jenkins\workspace\gplibrary_pr_models\mosek\gpkit (from robust==0.0.0) (0.9.1.0)
Requirement already satisfied: numpy in c:\anaconda2\lib\site-packages (from robust==0.0.0) (1.16.5)
Requirement already satisfied: matplotlib in c:\anaconda2\lib\site-packages (from robust==0.0.0) (2.2.4)
Requirement already satisfied: scipy in c:\anaconda2\lib\site-packages (from robust==0.0.0) (1.2.2)
Requirement already satisfied: pint>=0.8.1 in c:\anaconda2\lib\site-packages (from gpkit->robust==0.0.0) (0.9)
Requirement already satisfied: ad in c:\anaconda2\lib\site-packages (from gpkit->robust==0.0.0) (1.3.2)
Requirement already satisfied: cvxopt>=1.1.8 in c:\anaconda2\lib\site-packages (from gpkit->robust==0.0.0) (1.2.3)
Requirement already satisfied: six in c:\anaconda2\lib\site-packages (from gpkit->robust==0.0.0) (1.12.0)
Requirement already satisfied: python-dateutil>=2.1 in c:\anaconda2\lib\site-packages (from matplotlib->robust==0.0.0) (2.8.0)
Requirement already satisfied: pyparsing!=2.0.4,!=2.1.2,!=2.1.6,>=2.0.1 in c:\anaconda2\lib\site-packages (from matplotlib->robust==0.0.0) (2.4.2)
Requirement already satisfied: pytz in c:\anaconda2\lib\site-packages (from matplotlib->robust==0.0.0) (2019.2)
Requirement already satisfied: backports.functools-lru-cache in c:\anaconda2\lib\site-packages (from matplotlib->robust==0.0.0) (1.5)
Requirement already satisfied: cycler>=0.10 in c:\anaconda2\lib\site-packages (from matplotlib->robust==0.0.0) (0.10.0)
Requirement already satisfied: kiwisolver>=1.0.1 in c:\anaconda2\lib\site-packages (from matplotlib->robust==0.0.0) (1.1.0)
Requirement already satisfied: funcsigs; python_version == "2.7" in c:\anaconda2\lib\site-packages (from pint>=0.8.1->gpkit->robust==0.0.0) (1.0.2)
Requirement already satisfied: mkl in c:\anaconda2\lib\site-packages (from cvxopt>=1.1.8->gpkit->robust==0.0.0) (2018.0.0)
Requirement already satisfied: setuptools in c:\users\jenkins\workspace\gplibrary_pr_models\mosek\venv2_gpkit\lib\site-packages (from kiwisolver>=1.0.1->matplotlib->robust==0.0.0) (41.2.0)
Requirement already satisfied: intel-openmp==2018.0.0 in c:\anaconda2\lib\site-packages (from mkl->cvxopt>=1.1.8->gpkit->robust==0.0.0) (2018.0.0)
Building wheels for collected packages: robust
  Building wheel for robust (setup.py): started
  Building wheel for robust (setup.py): finished with status 'done'
  Created wheel for robust: filename=robust-0.0.0-cp27-none-any.whl size=220320 sha256=2d52ac92fc57d597decd1f3a2fa0e866524b6512b0d69ab8b6cad87e77e8ab6e
  Stored in directory: c:\users\jenkins\appdata\local\temp\pip-ephem-wheel-cache-o9uhas\wheels\86\09\59\99a2df82f3c320ca7f2b2c8972300ee9c924668400d35b28ef
Successfully built robust
Installing collected packages: robust
Successfully installed robust-0.0.0

Running tests...
----------------------------------------------------------------------
.................
----------------------------------------------------------------------
Ran 17 tests in 17.152s

OK
..................adding test for 'run_tests.py'

----------------------------------------------------------------------
Ran 17 tests in 25.955s

OK
.
----------------------------------------------------------------------
Ran 2 tests in 44.111s

OK

Generating XML reports...
Cloning into 'shopping'...
adding test for 'test.py'
Using solver 'mosek'
Solving for 25 variables.
Solving took 0.162 seconds.
Using solver 'mosek'
Solving for 25 variables.
Solving took 0.021 seconds.
Using solver 'mosek_cli'
Solving for 25 variables.
Solving took 0.101 seconds.

Running tests...
----------------------------------------------------------------------
...
----------------------------------------------------------------------
Ran 3 tests in 0.470s

OK

Generating XML reports...
Cloning into 'gassolar'...
Checking out files:  20% (441/2110)   
Checking out files:  21% (444/2110)   
Checking out files:  22% (465/2110)   
Checking out files:  23% (486/2110)   
Checking out files:  24% (507/2110)   
Checking out files:  25% (528/2110)   
Checking out files:  26% (549/2110)   
Checking out files:  27% (570/2110)   
Checking out files:  28% (591/2110)   
Checking out files:  29% (612/2110)   
Checking out files:  30% (633/2110)   
Checking out files:  31% (655/2110)   
Checking out files:  32% (676/2110)   
Checking out files:  33% (697/2110)   
Checking out files:  34% (718/2110)   
Checking out files:  35% (739/2110)   
Checking out files:  36% (760/2110)   
Checking out files:  37% (781/2110)   
Checking out files:  38% (802/2110)   
Checking out files:  39% (823/2110)   
Checking out files:  40% (844/2110)   
Checking out files:  41% (866/2110)   
Checking out files:  42% (887/2110)   
Checking out files:  43% (908/2110)   
Checking out files:  44% (929/2110)   
Checking out files:  45% (950/2110)   
Checking out files:  46% (971/2110)   
Checking out files:  47% (992/2110)   
Checking out files:  48% (1013/2110)   
Checking out files:  49% (1034/2110)   
Checking out files:  50% (1055/2110)   
Checking out files:  50% (1063/2110)   
Checking out files:  51% (1077/2110)   
Checking out files:  52% (1098/2110)   
Checking out files:  53% (1119/2110)   
Checking out files:  54% (1140/2110)   
Checking out files:  55% (1161/2110)   
Checking out files:  56% (1182/2110)   
Checking out files:  57% (1203/2110)   
Checking out files:  58% (1224/2110)   
Checking out files:  59% (1245/2110)   
Checking out files:  60% (1266/2110)   
Checking out files:  61% (1288/2110)   
Checking out files:  62% (1309/2110)   
Checking out files:  63% (1330/2110)   
Checking out files:  64% (1351/2110)   
Checking out files:  65% (1372/2110)   
Checking out files:  66% (1393/2110)   
Checking out files:  67% (1414/2110)   
Checking out files:  68% (1435/2110)   
Checking out files:  69% (1456/2110)   
Checking out files:  70% (1477/2110)   
Checking out files:  71% (1499/2110)   
Checking out files:  72% (1520/2110)   
Checking out files:  73% (1541/2110)   
Checking out files:  74% (1562/2110)   
Checking out files:  75% (1583/2110)   
Checking out files:  75% (1590/2110)   
Checking out files:  76% (1604/2110)   
Checking out files:  77% (1625/2110)   
Checking out files:  78% (1646/2110)   
Checking out files:  79% (1667/2110)   
Checking out files:  80% (1688/2110)   
Checking out files:  81% (1710/2110)   
Checking out files:  82% (1731/2110)   
Checking out files:  83% (1752/2110)   
Checking out files:  84% (1773/2110)   
Checking out files:  85% (1794/2110)   
Checking out files:  86% (1815/2110)   
Checking out files:  87% (1836/2110)   
Checking out files:  88% (1857/2110)   
Checking out files:  89% (1878/2110)   
Checking out files:  90% (1899/2110)   
Checking out files:  91% (1921/2110)   
Checking out files:  92% (1942/2110)   
Checking out files:  93% (1963/2110)   
Checking out files:  94% (1984/2110)   
Checking out files:  95% (2005/2110)   
Checking out files:  96% (2026/2110)   
Checking out files:  96% (2039/2110)   
Checking out files:  97% (2047/2110)   
Checking out files:  98% (2068/2110)   
Checking out files:  99% (2089/2110)   
Checking out files: 100% (2110/2110)   
Checking out files: 100% (2110/2110), done.
DEPRECATION: Python 2.7 will reach the end of its life on January 1st, 2020. Please upgrade your Python as Python 2.7 won't be maintained after that date. A future version of pip will drop support for Python 2.7. More details about Python 2 support in pip, can be found at https://pip.pypa.io/en/latest/development/release-process/#python-2-support
Requirement already satisfied: pandas in c:\anaconda2\lib\site-packages (0.24.2)
Requirement already satisfied: numpy>=1.12.0 in c:\anaconda2\lib\site-packages (from pandas) (1.16.5)
Requirement already satisfied: pytz>=2011k in c:\anaconda2\lib\site-packages (from pandas) (2019.2)
Requirement already satisfied: python-dateutil>=2.5.0 in c:\anaconda2\lib\site-packages (from pandas) (2.8.0)
Requirement already satisfied: six>=1.5 in c:\anaconda2\lib\site-packages (from python-dateutil>=2.5.0->pandas) (1.12.0)
DEPRECATION: Python 2.7 will reach the end of its life on January 1st, 2020. Please upgrade your Python as Python 2.7 won't be maintained after that date. A future version of pip will drop support for Python 2.7. More details about Python 2 support in pip, can be found at https://pip.pypa.io/en/latest/development/release-process/#python-2-support
Collecting git+https://github.com/hoburg/gpfit.git
  Cloning https://github.com/hoburg/gpfit.git to c:\users\jenkins\appdata\local\temp\pip-req-build-j5uh0z
  Running command git clone -q https://github.com/hoburg/gpfit.git 'c:\users\jenkins\appdata\local\temp\pip-req-build-j5uh0z'
Requirement already satisfied: numpy in c:\anaconda2\lib\site-packages (from gpfit==0.1) (1.16.5)
Requirement already satisfied: scipy in c:\anaconda2\lib\site-packages (from gpfit==0.1) (1.2.2)
Requirement already satisfied: gpkit in c:\users\jenkins\workspace\gplibrary_pr_models\mosek\gpkit (from gpfit==0.1) (0.9.1.0)
Requirement already satisfied: pint>=0.8.1 in c:\anaconda2\lib\site-packages (from gpkit->gpfit==0.1) (0.9)
Requirement already satisfied: ad in c:\anaconda2\lib\site-packages (from gpkit->gpfit==0.1) (1.3.2)
Requirement already satisfied: cvxopt>=1.1.8 in c:\anaconda2\lib\site-packages (from gpkit->gpfit==0.1) (1.2.3)
Requirement already satisfied: six in c:\anaconda2\lib\site-packages (from gpkit->gpfit==0.1) (1.12.0)
Requirement already satisfied: funcsigs; python_version == "2.7" in c:\anaconda2\lib\site-packages (from pint>=0.8.1->gpkit->gpfit==0.1) (1.0.2)
Requirement already satisfied: mkl in c:\anaconda2\lib\site-packages (from cvxopt>=1.1.8->gpkit->gpfit==0.1) (2018.0.0)
Requirement already satisfied: intel-openmp==2018.0.0 in c:\anaconda2\lib\site-packages (from mkl->cvxopt>=1.1.8->gpkit->gpfit==0.1) (2018.0.0)
Building wheels for collected packages: gpfit
  Building wheel for gpfit (setup.py): started
  Building wheel for gpfit (setup.py): finished with status 'done'
  Created wheel for gpfit: filename=gpfit-0.1-cp27-none-any.whl size=25428 sha256=2ed9be0bdb7ddb40e47c927b587d1e2f15f9b34c0ad86d50916633643249fb1a
  Stored in directory: c:\users\jenkins\appdata\local\temp\pip-ephem-wheel-cache-gzd8oa\wheels\4d\4b\2e\9480645acbe8d32004b09b3732f616bbb2a9ee75e4526f058f
Successfully built gpfit
Installing collected packages: gpfit
Successfully installed gpfit-0.1
DEPRECATION: Python 2.7 will reach the end of its life on January 1st, 2020. Please upgrade your Python as Python 2.7 won't be maintained after that date. A future version of pip will drop support for Python 2.7. More details about Python 2 support in pip, can be found at https://pip.pypa.io/en/latest/development/release-process/#python-2-support
Processing c:\users\jenkins\workspace\gplibrary_pr_models\mosek\gassolar
Requirement already satisfied: numpy in c:\anaconda2\lib\site-packages (from gassolar==0.0.0.0) (1.16.5)
Requirement already satisfied: scipy in c:\anaconda2\lib\site-packages (from gassolar==0.0.0.0) (1.2.2)
Requirement already satisfied: gpkit in c:\users\jenkins\workspace\gplibrary_pr_models\mosek\gpkit (from gassolar==0.0.0.0) (0.9.1.0)
Requirement already satisfied: pandas in c:\anaconda2\lib\site-packages (from gassolar==0.0.0.0) (0.24.2)
Requirement already satisfied: gpfit in c:\users\jenkins\workspace\gplibrary_pr_models\mosek\venv2_gpkit\lib\site-packages (from gassolar==0.0.0.0) (0.1)
Requirement already satisfied: pint>=0.8.1 in c:\anaconda2\lib\site-packages (from gpkit->gassolar==0.0.0.0) (0.9)
Requirement already satisfied: ad in c:\anaconda2\lib\site-packages (from gpkit->gassolar==0.0.0.0) (1.3.2)
Requirement already satisfied: cvxopt>=1.1.8 in c:\anaconda2\lib\site-packages (from gpkit->gassolar==0.0.0.0) (1.2.3)
Requirement already satisfied: six in c:\anaconda2\lib\site-packages (from gpkit->gassolar==0.0.0.0) (1.12.0)
Requirement already satisfied: pytz>=2011k in c:\anaconda2\lib\site-packages (from pandas->gassolar==0.0.0.0) (2019.2)
Requirement already satisfied: python-dateutil>=2.5.0 in c:\anaconda2\lib\site-packages (from pandas->gassolar==0.0.0.0) (2.8.0)
Requirement already satisfied: funcsigs; python_version == "2.7" in c:\anaconda2\lib\site-packages (from pint>=0.8.1->gpkit->gassolar==0.0.0.0) (1.0.2)
Requirement already satisfied: mkl in c:\anaconda2\lib\site-packages (from cvxopt>=1.1.8->gpkit->gassolar==0.0.0.0) (2018.0.0)
Requirement already satisfied: intel-openmp==2018.0.0 in c:\anaconda2\lib\site-packages (from mkl->cvxopt>=1.1.8->gpkit->gassolar==0.0.0.0) (2018.0.0)
Building wheels for collected packages: gassolar
  Building wheel for gassolar (setup.py): started
  Building wheel for gassolar (setup.py): finished with status 'done'
  Created wheel for gassolar: filename=gassolar-0.0.0.0-cp27-none-any.whl size=4895585 sha256=a07651ad7a3f637e91b87626f7a731f9402caeb756e029444f1d66e1165b56cc
  Stored in directory: c:\users\jenkins\appdata\local\temp\pip-ephem-wheel-cache-uzjsri\wheels\5c\45\ee\a8ea86f24e24acb4b8a5b5ef8c1a921fb70526d25cb0d4c0da
Successfully built gassolar
Installing collected packages: gassolar
Successfully installed gassolar-0.0.0.0
adding test for 'gassolar/gas/gas.py'
adding test for 'gassolar/solar/solar.py'
Using solver 'mosek'
Solving for 592 variables.
Solving took 0.209 seconds.
Warning: Variable Mission.Climb.FlightSegment.AircraftPerf.EnginePerf.P_{total}[:]/Mission.Climb.FlightSegment.Aircraf could cause inaccurate result because it is above upper bound. Solution is 1.0000 but bound is 0.9685
Beginning signomial solve.
Solving took 4 GP solves and 0.94 seconds.
Warning: Variable Mission1.Climb.FlightSegment.AircraftPerf.EnginePerf.P_{total}[:]/Mission1.Climb.FlightSegment.Aircr could cause inaccurate result because it is above upper bound. Solution is 1.0000 but bound is 0.9685
Using solver 'mosek'
Solving for 592 variables.
Solving took 0.504 seconds.
Warning: Variable Mission.Climb.FlightSegment.AircraftPerf.EnginePerf.P_{total}[:]/Mission.Climb.FlightSegment.Aircraf could cause inaccurate result because it is above upper bound. Solution is 1.0000 but bound is 0.9685
Beginning signomial solve.
Solving took 4 GP solves and 1.58 seconds.
Warning: Variable Mission1.Climb.FlightSegment.AircraftPerf.EnginePerf.P_{total}[:]/Mission1.Climb.FlightSegment.Aircr could cause inaccurate result because it is above upper bound. Solution is 1.0000 but bound is 0.9685
Using solver 'mosek'
Solving for 1250 variables.
Solving took 0.63 seconds.
Warning: Variable Mission.FlightSegment.AircraftPerf.WingAero.Re could cause inaccurate result because it is below lower bound. Solution is 102558.3538 but bound is 150000.0000
Warning: Variable Mission.FlightSegment10.AircraftPerf.WingAero.Re could cause inaccurate result because it is below lower bound. Solution is 102558.3827 but bound is 150000.0000
Beginning signomial solve.
Solving took 4 GP solves and 2.45 seconds.
Warning: Variable Mission1.FlightSegment.AircraftPerf.WingAero.Re could cause inaccurate result because it is below lower bound. Solution is 103379.4302 but bound is 150000.0000
Warning: Variable Mission1.FlightSegment10.AircraftPerf.WingAero.Re could cause inaccurate result because it is below lower bound. Solution is 103406.0833 but bound is 150000.0000
Using solver 'mosek_cli'
Solving for 1250 variables.
Solving took 0.503 seconds.
Warning: Variable Mission.FlightSegment.AircraftPerf.WingAero.Re could cause inaccurate result because it is below lower bound. Solution is 102558.6388 but bound is 150000.0000
Warning: Variable Mission.FlightSegment10.AircraftPerf.WingAero.Re could cause inaccurate result because it is below lower bound. Solution is 102558.6388 but bound is 150000.0000
Beginning signomial solve.
Solving took 4 GP solves and 2.79 seconds.
Warning: Variable Mission1.FlightSegment.AircraftPerf.WingAero.Re could cause inaccurate result because it is below lower bound. Solution is 103379.2971 but bound is 150000.0000
Warning: Variable Mission1.FlightSegment10.AircraftPerf.WingAero.Re could cause inaccurate result because it is below lower bound. Solution is 103406.1793 but bound is 150000.0000

Running tests...
----------------------------------------------------------------------
c:\anaconda2\lib\site-packages\pint\quantity.py:1377: UnitStrippedWarning: The unit of the quantity is stripped.
  warnings.warn("The unit of the quantity is stripped.", UnitStrippedWarning)
..C:\Users\jenkins\workspace\gplibrary_PR_Models\mosek\venv2_gpkit\lib\site-packages\gassolar\environment\solar_irradiance.py:40: RuntimeWarning: overflow encountered in exp
  tau = np.exp(-0.175/costhsun)
..
----------------------------------------------------------------------
Ran 4 tests in 29.770s

OK

Generating XML reports...
Cloning into 'jho'...
DEPRECATION: Python 2.7 will reach the end of its life on January 1st, 2020. Please upgrade your Python as Python 2.7 won't be maintained after that date. A future version of pip will drop support for Python 2.7. More details about Python 2 support in pip, can be found at https://pip.pypa.io/en/latest/development/release-process/#python-2-support
Requirement already satisfied: pandas in c:\anaconda2\lib\site-packages (0.24.2)
Requirement already satisfied: numpy>=1.12.0 in c:\anaconda2\lib\site-packages (from pandas) (1.16.5)
Requirement already satisfied: pytz>=2011k in c:\anaconda2\lib\site-packages (from pandas) (2019.2)
Requirement already satisfied: python-dateutil>=2.5.0 in c:\anaconda2\lib\site-packages (from pandas) (2.8.0)
Requirement already satisfied: six>=1.5 in c:\anaconda2\lib\site-packages (from python-dateutil>=2.5.0->pandas) (1.12.0)
DEPRECATION: Python 2.7 will reach the end of its life on January 1st, 2020. Please upgrade your Python as Python 2.7 won't be maintained after that date. A future version of pip will drop support for Python 2.7. More details about Python 2 support in pip, can be found at https://pip.pypa.io/en/latest/development/release-process/#python-2-support
Collecting git+https://github.com/hoburg/gpfit.git
  Cloning https://github.com/hoburg/gpfit.git to c:\users\jenkins\appdata\local\temp\pip-req-build-i5jvsf
  Running command git clone -q https://github.com/hoburg/gpfit.git 'c:\users\jenkins\appdata\local\temp\pip-req-build-i5jvsf'
Requirement already satisfied (use --upgrade to upgrade): gpfit==0.1 from git+https://github.com/hoburg/gpfit.git in c:\users\jenkins\workspace\gplibrary_pr_models\mosek\venv2_gpkit\lib\site-packages
Requirement already satisfied: numpy in c:\anaconda2\lib\site-packages (from gpfit==0.1) (1.16.5)
Requirement already satisfied: scipy in c:\anaconda2\lib\site-packages (from gpfit==0.1) (1.2.2)
Requirement already satisfied: gpkit in c:\users\jenkins\workspace\gplibrary_pr_models\mosek\gpkit (from gpfit==0.1) (0.9.1.0)
Requirement already satisfied: pint>=0.8.1 in c:\anaconda2\lib\site-packages (from gpkit->gpfit==0.1) (0.9)
Requirement already satisfied: ad in c:\anaconda2\lib\site-packages (from gpkit->gpfit==0.1) (1.3.2)
Requirement already satisfied: cvxopt>=1.1.8 in c:\anaconda2\lib\site-packages (from gpkit->gpfit==0.1) (1.2.3)
Requirement already satisfied: six in c:\anaconda2\lib\site-packages (from gpkit->gpfit==0.1) (1.12.0)
Requirement already satisfied: funcsigs; python_version == "2.7" in c:\anaconda2\lib\site-packages (from pint>=0.8.1->gpkit->gpfit==0.1) (1.0.2)
Requirement already satisfied: mkl in c:\anaconda2\lib\site-packages (from cvxopt>=1.1.8->gpkit->gpfit==0.1) (2018.0.0)
Requirement already satisfied: intel-openmp==2018.0.0 in c:\anaconda2\lib\site-packages (from mkl->cvxopt>=1.1.8->gpkit->gpfit==0.1) (2018.0.0)
Building wheels for collected packages: gpfit
  Building wheel for gpfit (setup.py): started
  Building wheel for gpfit (setup.py): finished with status 'done'
  Created wheel for gpfit: filename=gpfit-0.1-cp27-none-any.whl size=25428 sha256=43126d29c12d8ee117039cd28f5cbe58cc9c04a9abc3c576f0bbef6ef1c4c192
  Stored in directory: c:\users\jenkins\appdata\local\temp\pip-ephem-wheel-cache-emqsfl\wheels\4d\4b\2e\9480645acbe8d32004b09b3732f616bbb2a9ee75e4526f058f
Successfully built gpfit

Running tests...
----------------------------------------------------------------------
EEEE
======================================================================
ERROR [0.126s]: test_model_jho_py_mosek (gpkit.tests.from_paths.TestFiles)
----------------------------------------------------------------------
Traceback (most recent call last):
  File "c:\users\jenkins\workspace\gplibrary_pr_models\mosek\gpkit\gpkit\tests\helpers.py", line 64, in test
    testfn(name, import_dict, path)(self)
  File "c:\users\jenkins\workspace\gplibrary_pr_models\mosek\gpkit\gpkit\tests\from_paths.py", line 51, in <lambda>
    lambda self: getattr(self, name)()))  # pylint:disable=undefined-variable
  File "c:\users\jenkins\workspace\gplibrary_pr_models\mosek\gpkit\gpkit\tests\from_paths.py", line 37, in test_fn
    mod = __import__(os.path.basename(path)[:-3])
  File "jho.py", line 7, in <module>
  File "c:\users\jenkins\workspace\gplibrary_pr_models\mosek\gpkitmodels\GP\aircraft\fuselage\cylindrical_fuselage.py", line 5, in <module>
    from fuel_tank import FuelTank
ImportError: No module named fuel_tank

======================================================================
ERROR [0.011s]: test_model_jho_py_mosek_cli (gpkit.tests.from_paths.TestFiles)
----------------------------------------------------------------------
Traceback (most recent call last):
  File "c:\users\jenkins\workspace\gplibrary_pr_models\mosek\gpkit\gpkit\tests\helpers.py", line 64, in test
    testfn(name, import_dict, path)(self)
  File "c:\users\jenkins\workspace\gplibrary_pr_models\mosek\gpkit\gpkit\tests\from_paths.py", line 51, in <lambda>
    lambda self: getattr(self, name)()))  # pylint:disable=undefined-variable
  File "c:\users\jenkins\workspace\gplibrary_pr_models\mosek\gpkit\gpkit\tests\from_paths.py", line 37, in test_fn
    mod = __import__(os.path.basename(path)[:-3])
  File "jho.py", line 7, in <module>
  File "c:\users\jenkins\workspace\gplibrary_pr_models\mosek\gpkitmodels\GP\aircraft\fuselage\cylindrical_fuselage.py", line 5, in <module>
    from fuel_tank import FuelTank
ImportError: No module named fuel_tank

======================================================================
ERROR [0.473s]: test_model_print_perf_py_mosek (gpkit.tests.from_paths.TestFiles)
----------------------------------------------------------------------
Traceback (most recent call last):
  File "c:\users\jenkins\workspace\gplibrary_pr_models\mosek\gpkit\gpkit\tests\helpers.py", line 64, in test
    testfn(name, import_dict, path)(self)
  File "c:\users\jenkins\workspace\gplibrary_pr_models\mosek\gpkit\gpkit\tests\from_paths.py", line 51, in <lambda>
    lambda self: getattr(self, name)()))  # pylint:disable=undefined-variable
  File "c:\users\jenkins\workspace\gplibrary_pr_models\mosek\gpkit\gpkit\tests\from_paths.py", line 37, in test_fn
    mod = __import__(os.path.basename(path)[:-3])
  File "print_perf.py", line 4, in <module>
  File "jho.py", line 7, in <module>
  File "c:\users\jenkins\workspace\gplibrary_pr_models\mosek\gpkitmodels\GP\aircraft\fuselage\cylindrical_fuselage.py", line 5, in <module>
    from fuel_tank import FuelTank
ImportError: No module named fuel_tank

======================================================================
ERROR [0.015s]: test_model_print_perf_py_mosek_cli (gpkit.tests.from_paths.TestFiles)
----------------------------------------------------------------------
Traceback (most recent call last):
  File "c:\users\jenkins\workspace\gplibrary_pr_models\mosek\gpkit\gpkit\tests\helpers.py", line 64, in test
    testfn(name, import_dict, path)(self)
  File "c:\users\jenkins\workspace\gplibrary_pr_models\mosek\gpkit\gpkit\tests\from_paths.py", line 51, in <lambda>
    lambda self: getattr(self, name)()))  # pylint:disable=undefined-variable
  File "c:\users\jenkins\workspace\gplibrary_pr_models\mosek\gpkit\gpkit\tests\from_paths.py", line 37, in test_fn
    mod = __import__(os.path.basename(path)[:-3])
  File "print_perf.py", line 4, in <module>
  File "jho.py", line 7, in <module>
  File "c:\users\jenkins\workspace\gplibrary_pr_modadding test for 'model/jho.py'
adding test for 'model/print_perf.py'
els\mosek\gpkitmodels\GP\aircraft\fuselage\cylindrical_fuselage.py", line 5, in <module>
    from fuel_tank import FuelTank
ImportError: No module named fuel_tank

----------------------------------------------------------------------
Ran 4 tests in 0.625s

FAILED (errors=4)

Generating XML reports...
Cloning into 'turbofan'...
DEPRECATION: Python 2.7 will reach the end of its life on January 1st, 2020. Please upgrade your Python as Python 2.7 won't be maintained after that date. A future version of pip will drop support for Python 2.7. More details about Python 2 support in pip, can be found at https://pip.pypa.io/en/latest/development/release-process/#python-2-support
Processing c:\users\jenkins\workspace\gplibrary_pr_models\mosek\turbofan
Requirement already satisfied: numpy in c:\anaconda2\lib\site-packages (from turbofan==0.0.0.0) (1.16.5)
Requirement already satisfied: scipy in c:\anaconda2\lib\site-packages (from turbofan==0.0.0.0) (1.2.2)
Requirement already satisfied: pint in c:\anaconda2\lib\site-packages (from turbofan==0.0.0.0) (0.9)
Requirement already satisfied: future in c:\anaconda2\lib\site-packages (from turbofan==0.0.0.0) (0.17.1)
Requirement already satisfied: funcsigs; python_version == "2.7" in c:\anaconda2\lib\site-packages (from pint->turbofan==0.0.0.0) (1.0.2)
Building wheels for collected packages: turbofan
  Building wheel for turbofan (setup.py): started
  Building wheel for turbofan (setup.py): finished with status 'done'
  Created wheel for turbofan: filename=turbofan-0.0.0.0-cp27-none-any.whl size=44202 sha256=9c00034fb225b44de57c500ba277e35af70c10b5e94d32adaae5f18ae9d1cc8c
  Stored in directory: c:\users\jenkins\appdata\local\temp\pip-ephem-wheel-cache-dwong1\wheels\3a\4a\df\1e137b486523078491de3a0319a07f314f5e9aa745dfaf6fd5
Successfully built turbofan
Installing collected packages: turbofan
Successfully installed turbofan-0.0.0.0
adding test for 'turbofan/engine_test.py'
Beginning signomial solve.
Using solver 'mosek'
Solving for 243 variables.
Solving took 0.333 seconds.
Using solver 'mosek'
Solving for 244 variables.
Solving took 0.04 seconds.
Using solver 'mosek'
Solving for 243 variables.
Solving took 0.049 seconds.
Using solver 'mosek'
Solving for 243 variables.
Solving took 0.038 seconds.
Using solver 'mosek'
Solving for 243 variables.
Solving took 0.036 seconds.
Using solver 'mosek'
Solving for 243 variables.
Solving took 0.037 seconds.
Using solver 'mosek'
Solving for 243 variables.
Solving took 0.038 seconds.
Using solver 'mosek'
Solving for 243 variables.
Solving took 0.037 seconds.
Using solver 'mosek'
Solving for 243 variables.
Solving took 0.038 seconds.
Using solver 'mosek'
Solving for 243 variables.
Solving took 0.037 seconds.
Using solver 'mosek'
Solving for 243 variables.
Solving took 0.036 seconds.
Solving took 11 GP solves and 1.05 seconds.

Running tests...
----------------------------------------------------------------------
.
----------------------------------------------------------------------
Ran 1 test in 1.444s

OK

Generating XML reports...
Cloning into 'solar'...
DEPRECATION: Python 2.7 will reach the end of its life on January 1st, 2020. Please upgrade your Python as Python 2.7 won't be maintained after that date. A future version of pip will drop support for Python 2.7. More details about Python 2 support in pip, can be found at https://pip.pypa.io/en/latest/development/release-process/#python-2-support
Requirement already satisfied: pandas in c:\anaconda2\lib\site-packages (0.24.2)
Requirement already satisfied: numpy>=1.12.0 in c:\anaconda2\lib\site-packages (from pandas) (1.16.5)
Requirement already satisfied: pytz>=2011k in c:\anaconda2\lib\site-packages (from pandas) (2019.2)
Requirement already satisfied: python-dateutil>=2.5.0 in c:\anaconda2\lib\site-packages (from pandas) (2.8.0)
Requirement already satisfied: six>=1.5 in c:\anaconda2\lib\site-packages (from python-dateutil>=2.5.0->pandas) (1.12.0)
DEPRECATION: Python 2.7 will reach the end of its life on January 1st, 2020. Please upgrade your Python as Python 2.7 won't be maintained after that date. A future version of pip will drop support for Python 2.7. More details about Python 2 support in pip, can be found at https://pip.pypa.io/en/latest/development/release-process/#python-2-support
Collecting git+https://github.com/convexengineering/gpfit.git
  Cloning https://github.com/convexengineering/gpfit.git to c:\users\jenkins\appdata\local\temp\pip-req-build-fxsh4f
  Running command git clone -q https://github.com/convexengineering/gpfit.git 'c:\users\jenkins\appdata\local\temp\pip-req-build-fxsh4f'
Requirement already satisfied (use --upgrade to upgrade): gpfit==0.1 from git+https://github.com/convexengineering/gpfit.git in c:\users\jenkins\workspace\gplibrary_pr_models\mosek\venv2_gpkit\lib\site-packages
Requirement already satisfied: numpy in c:\anaconda2\lib\site-packages (from gpfit==0.1) (1.16.5)
Requirement already satisfied: scipy in c:\anaconda2\lib\site-packages (from gpfit==0.1) (1.2.2)
Requirement already satisfied: gpkit in c:\users\jenkins\workspace\gplibrary_pr_models\mosek\gpkit (from gpfit==0.1) (0.9.1.0)
Requirement already satisfied: pint>=0.8.1 in c:\anaconda2\lib\site-packages (from gpkit->gpfit==0.1) (0.9)
Requirement already satisfied: ad in c:\anaconda2\lib\site-packages (from gpkit->gpfit==0.1) (1.3.2)
Requirement already satisfied: cvxopt>=1.1.8 in c:\anaconda2\lib\site-packages (from gpkit->gpfit==0.1) (1.2.3)
Requirement already satisfied: six in c:\anaconda2\lib\site-packages (from gpkit->gpfit==0.1) (1.12.0)
Requirement already satisfied: funcsigs; python_version == "2.7" in c:\anaconda2\lib\site-packages (from pint>=0.8.1->gpkit->gpfit==0.1) (1.0.2)
Requirement already satisfied: mkl in c:\anaconda2\lib\site-packages (from cvxopt>=1.1.8->gpkit->gpfit==0.1) (2018.0.0)
Requirement already satisfied: intel-openmp==2018.0.0 in c:\anaconda2\lib\site-packages (from mkl->cvxopt>=1.1.8->gpkit->gpfit==0.1) (2018.0.0)
Building wheels for collected packages: gpfit
  Building wheel for gpfit (setup.py): started
  Building wheel for gpfit (setup.py): finished with status 'done'
  Created wheel for gpfit: filename=gpfit-0.1-cp27-none-any.whl size=25428 sha256=9216c7688c5d03597105e5709d04424b0475ca1468df388601685acf6e9af717
  Stored in directory: c:\users\jenkins\appdata\local\temp\pip-ephem-wheel-cache-_4mmrm\wheels\d5\94\ac\b1f68b07599181f26f4b9149a1a6d49dfc5cdbc65de1a14d12
Successfully built gpfit
DEPRECATION: Python 2.7 will reach the end of its life on January 1st, 2020. Please upgrade your Python as Python 2.7 won't be maintained after that date. A future version of pip will drop support for Python 2.7. More details about Python 2 support in pip, can be found at https://pip.pypa.io/en/latest/development/release-process/#python-2-support
Collecting git+https://github.com/convexengineering/gassolar.git
  Cloning https://github.com/convexengineering/gassolar.git to c:\users\jenkins\appdata\local\temp\pip-req-build-lcmf5x
  Running command git clone -q https://github.com/convexengineering/gassolar.git 'c:\users\jenkins\appdata\local\temp\pip-req-build-lcmf5x'
Requirement already satisfied (use --upgrade to upgrade): gassolar==0.0.0.0 from git+https://github.com/convexengineering/gassolar.git in c:\users\jenkins\workspace\gplibrary_pr_models\mosek\venv2_gpkit\lib\site-packages
Requirement already satisfied: numpy in c:\anaconda2\lib\site-packages (from gassolar==0.0.0.0) (1.16.5)
Requirement already satisfied: scipy in c:\anaconda2\lib\site-packages (from gassolar==0.0.0.0) (1.2.2)
Requirement already satisfied: gpkit in c:\users\jenkins\workspace\gplibrary_pr_models\mosek\gpkit (from gassolar==0.0.0.0) (0.9.1.0)
Requirement already satisfied: pandas in c:\anaconda2\lib\site-packages (from gassolar==0.0.0.0) (0.24.2)
Requirement already satisfied: gpfit in c:\users\jenkins\workspace\gplibrary_pr_models\mosek\venv2_gpkit\lib\site-packages (from gassolar==0.0.0.0) (0.1)
Requirement already satisfied: pint>=0.8.1 in c:\anaconda2\lib\site-packages (from gpkit->gassolar==0.0.0.0) (0.9)
Requirement already satisfied: ad in c:\anaconda2\lib\site-packages (from gpkit->gassolar==0.0.0.0) (1.3.2)
Requirement already satisfied: cvxopt>=1.1.8 in c:\anaconda2\lib\site-packages (from gpkit->gassolar==0.0.0.0) (1.2.3)
Requirement already satisfied: six in c:\anaconda2\lib\site-packages (from gpkit->gassolar==0.0.0.0) (1.12.0)
Requirement already satisfied: pytz>=2011k in c:\anaconda2\lib\site-packages (from pandas->gassolar==0.0.0.0) (2019.2)
Requirement already satisfied: python-dateutil>=2.5.0 in c:\anaconda2\lib\site-packages (from pandas->gassolar==0.0.0.0) (2.8.0)
Requirement already satisfied: funcsigs; python_version == "2.7" in c:\anaconda2\lib\site-packages (from pint>=0.8.1->gpkit->gassolar==0.0.0.0) (1.0.2)
Requirement already satisfied: mkl in c:\anaconda2\lib\site-packages (from cvxopt>=1.1.8->gpkit->gassolar==0.0.0.0) (2018.0.0)
Requirement already satisfied: intel-openmp==2018.0.0 in c:\anaconda2\lib\site-packages (from mkl->cvxopt>=1.1.8->gpkit->gassolar==0.0.0.0) (2018.0.0)
Building wheels for collected packages: gassolar
  Building wheel for gassolar (setup.py): started
  Building wheel for gassolar (setup.py): finished with status 'done'
  Created wheel for gassolar: filename=gassolar-0.0.0.0-cp27-none-any.whl size=4895585 sha256=70418368f05d7743f2b5c8b70f432c1e8c2e2abb00e16140a27b0fd51be38386
  Stored in directory: c:\users\jenkins\appdata\local\temp\pip-ephem-wheel-cache-ycjotx\wheels\fe\11\0a\2dde16df75c51194d20248ec9e30e88fc7200e9fc4664b032e
Successfully built gassolar
DEPRECATION: Python 2.7 will reach the end of its life on January 1st, 2020. Please upgrade your Python as Python 2.7 won't be maintained after that date. A future version of pip will drop support for Python 2.7. More details about Python 2 support in pip, can be found at https://pip.pypa.io/en/latest/development/release-process/#python-2-support
Processing c:\users\jenkins\workspace\gplibrary_pr_models\mosek\solar
Requirement already satisfied: numpy in c:\anaconda2\lib\site-packages (from solar==0.0.0.0) (1.16.5)
Requirement already satisfied: scipy in c:\anaconda2\lib\site-packages (from solar==0.0.0.0) (1.2.2)
Requirement already satisfied: gpkit in c:\users\jenkins\workspace\gplibrary_pr_models\mosek\gpkit (from solar==0.0.0.0) (0.9.1.0)
Requirement already satisfied: pandas in c:\anaconda2\lib\site-packages (from solar==0.0.0.0) (0.24.2)
Requirement already satisfied: gpfit in c:\users\jenkins\workspace\gplibrary_pr_models\mosek\venv2_gpkit\lib\site-packages (from solar==0.0.0.0) (0.1)
Requirement already satisfied: gpkitmodels in c:\users\jenkins\workspace\gplibrary_pr_models\mosek (from solar==0.0.0.0) (0.0.0.0)
Requirement already satisfied: pint>=0.8.1 in c:\anaconda2\lib\site-packages (from gpkit->solar==0.0.0.0) (0.9)
Requirement already satisfied: ad in c:\anaconda2\lib\site-packages (from gpkit->solar==0.0.0.0) (1.3.2)
Requirement already satisfied: cvxopt>=1.1.8 in c:\anaconda2\lib\site-packages (from gpkit->solar==0.0.0.0) (1.2.3)
Requirement already satisfied: six in c:\anaconda2\lib\site-packages (from gpkit->solar==0.0.0.0) (1.12.0)
Requirement already satisfied: pytz>=2011k in c:\anaconda2\lib\site-packages (from pandas->solar==0.0.0.0) (2019.2)
Requirement already satisfied: python-dateutil>=2.5.0 in c:\anaconda2\lib\site-packages (from pandas->solar==0.0.0.0) (2.8.0)
Requirement already satisfied: future in c:\anaconda2\lib\site-packages (from gpkitmodels->solar==0.0.0.0) (0.17.1)
Requirement already satisfied: funcsigs; python_version == "2.7" in c:\anaconda2\lib\site-packages (from pint>=0.8.1->gpkit->solar==0.0.0.0) (1.0.2)
Requirement already satisfied: mkl in c:\anaconda2\lib\site-packages (from cvxopt>=1.1.8->gpkit->solar==0.0.0.0) (2018.0.0)
Requirement already satisfied: intel-openmp==2018.0.0 in c:\anaconda2\lib\site-packages (from mkl->cvxopt>=1.1.8->gpkit->solar==0.0.0.0) (2018.0.0)
Building wheels for collected packages: solar
  Building wheel for solar (setup.py): started
  Building wheel for solar (setup.py): finished with status 'done'
  Created wheel for solar: filename=solar-0.0.0.0-cp27-none-any.whl size=14954 sha256=fc4547bf3d15e823c78e36d4cb029107d107bf40d203ce51f09d09f6f532c4b5
  Stored in directory: c:\users\jenkins\appdata\local\temp\pip-ephem-wheel-cache-qsl8bq\wheels\f4\d5\5c\e37fedf74a44fbd5641b13d5622b97d759218ff594b631174a
Successfully built solar
Installing collected packages: solar
Successfully installed solar-0.0.0.0
adding test for 'solar/sens_chart.py'
adding test for 'solar/season.py'
adding test for 'solar/npod_trade.py'

N=1
Beginning signomial solve.
Solving took 5 GP solves and 2.79 seconds.
Warning: Variable Mission.Climb.AircraftDrag.WingAero.CL[:] could cause inaccurate result because it is below lower bound. Solution is 0.8904 but bound is 0.9465
Warning: Variable Mission.Climb.AircraftDrag.WingAero.Re[:] could cause inaccurate result because it is above upper bound. Solution is 1632916.9435 but bound is 600000.0000
Warning: Variable Mission.Climb.AircraftDrag.TailAero1.Re[:] could cause inaccurate result because it is above upper bound. Solution is 1259333.2961 but bound is 1000000.0000

N=3
Beginning signomial solve.
Solving took 5 GP solves and 1.83 seconds.
Warning: Variable Mission1.Climb.AircraftDrag.WingAero.CL[:] could cause inaccurate result because it is below lower bound. Solution is 1.1135 but bound is 0.9465
Warning: Variable Mission1.Climb.AircraftDrag.WingAero.Re[:] could cause inaccurate result because it is above upper bound. Solution is 1036204.4449 but bound is 600000.0000
Warning: Variable Mission1.Climb.AircraftDrag.TailAero1.Re[:] could cause inaccurate result because it is above upper bound. Solution is 1006645.3573 but bound is 1000000.0000

N=5
Beginning signomial solve.
Solving took 5 GP solves and 1.99 seconds.
Warning: Variable Mission2.Climb.AircraftDrag.WingAero.CL[:] could cause inaccurate result because it is below lower bound. Solution is 1.1487 but bound is 0.9465
Warning: Variable Mission2.Climb.AircraftDrag.WingAero.Re[:] could cause inaccurate result because it is above upper bound. Solution is 989673.4665 but bound is 600000.0000
Warning: Variable Mission2.Climb.AircraftDrag.TailAero1.Re[:] could cause inaccurate result because it is above upper bound. Solution is 1019678.5408 but bound is 1000000.0000

N=7
Beginning signomial solve.
Solving took 5 GP solves and 1.56 seconds.
Warning: Variable Mission3.Climb.AircraftDrag.WingAero.CL[:] could cause inaccurate result because it is below lower bound. Solution is 1.1643 but bound is 0.9465
Warning: Variable Mission3.Climb.AircraftDrag.WingAero.Re[:] could cause inaccurate result because it is above upper bound. Solution is 976142.1474 but bound is 600000.0000
Warning: Variable Mission3.Climb.AircraftDrag.TailAero1.Re[:] could cause inaccurate result because it is above upper bound. Solution is 1042059.4123 but bound is 1000000.0000

N=9
Beginning signomial solve.
Solving took 5 GP solves and 1.74 seconds.
Warning: Variable Mission4.Climb.AircraftDrag.WingAero.CL[:] could cause inaccurate result because it is below lower bound. Solution is 1.1567 but bound is 0.9465
Warning: Variable Mission4.Climb.AircraftDrag.WingAero.Re[:] could cause inaccurate result because it is above upper bound. Solution is 1007400.4780 but bound is 600000.0000
Warning: Variable Mission4.Climb.AircraftDrag.TailAero1.Re[:] could cause inaccurate result because it is above upper bound. Solution is 1092545.5146 but bound is 1000000.0000

N=0
Beginning signomial solve.
Solving took 4 GP solves and 1.41 seconds.
Warning: Variable Mission5.Climb.AircraftDrag.WingAero.CL[:] could cause inaccurate result because it is below lower bound. Solution is 1.0536 but bound is 0.9465
Warning: Variable Mission5.Climb.AircraftDrag.WingAero.Re[:] could cause inaccurate result because it is above upper bound. Solution is 1119121.2076 but bound is 600000.0000

N=1
Beginning signomial solve.
Solving took 5 GP solves and 2.47 seconds.
Warning: Variable Mission.Climb.AircraftDrag.WingAero.CL[:] could cause inaccurate result because it is below lower bound. Solution is 0.8904 but bound is 0.9465
Warning: Variable Mission.Climb.AircraftDrag.WingAero.Re[:] could cause inaccurate result because it is above upper bound. Solution is 1632919.3776 but bound is 600000.0000
Warning: Variable Mission.Climb.AircraftDrag.TailAero1.Re[:] could cause inaccurate result because it is above upper bound. Solution is 1259329.5070 but bound is 1000000.0000

N=3
Beginning signomial solve.
Solving took 5 GP solves and 2.38 seconds.
Warning: Variable Mission1.Climb.AircraftDrag.WingAero.CL[:] could cause inaccurate result because it is below lower bound. Solution is 1.1135 but bound is 0.9465
Warning: Variable Mission1.Climb.AircraftDrag.WingAero.Re[:] could cause inaccurate result because it is above upper bound. Solution is 1036209.6021 but bound is 600000.0000
Warning: Variable Mission1.Climb.AircraftDrag.TailAero1.Re[:] could cause inaccurate result because it is above upper bound. Solution is 1006641.3990 but bound is 1000000.0000

N=5
Beginning signomial solve.
Solving took 5 GP solves and 2.43 seconds.
Warning: Variable Mission2.Climb.AircraftDrag.WingAero.CL[:] could cause inaccurate result because it is below lower bound. Solution is 1.1487 but bound is 0.9465
Warning: Variable Mission2.Climb.AircraftDrag.WingAero.Re[:] could cause inaccurate result because it is above upper bound. Solution is 989673.1341 but bound is 600000.0000
Warning: Variable Mission2.Climb.AircraftDrag.TailAero1.Re[:] could cause inaccurate result because it is above upper bound. Solution is 1019680.6011 but bound is 1000000.0000

N=7
Beginning signomial solve.
Solving took 5 GP solves and 2.4 seconds.
Warning: Variable Mission3.Climb.AircraftDrag.WingAero.CL[:] could cause inaccurate result because it is below lower bound. Solution is 1.1643 but bound is 0.9465
Warning: Variable Mission3.Climb.AircraftDrag.WingAero.Re[:] could cause inaccurate result because it is above upper bound. Solution is 976138.7332 but bound is 600000.0000
Warning: Variable Mission3.Climb.AircraftDrag.TailAero1.Re[:] could cause inaccurate result because it is above upper bound. Solution is 1042059.9154 but bound is 1000000.0000

N=9
Beginning signomial solve.
Solving took 5 GP solves and 2.61 seconds.
Warning: Variable Mission4.Climb.AircraftDrag.WingAero.CL[:] could cause inaccurate result because it is below lower bound. Solution is 1.1567 but bound is 0.9465
Warning: Variable Mission4.Climb.AircraftDrag.WingAero.Re[:] could cause inaccurate result because it is above upper bound. Solution is 1007396.6632 but bound is 600000.0000
Warning: Variable Mission4.Climb.AircraftDrag.TailAero1.Re[:] could cause inaccurate result because it is above upper bound. Solution is 1092544.5684 but bound is 1000000.0000

N=0
Beginning signomial solve.
Solving took 4 GP solves and 1.76 seconds.
Warning: Variable Mission5.Climb.AircraftDrag.WingAero.CL[:] could cause inaccurate result because it is below lower bound. Solution is 1.0536 but bound is 0.9465
Warning: Variable Mission5.Climb.AircraftDrag.WingAero.Re[:] could cause inaccurate result because it is above upper bound. Solution is 1119116.3963 but bound is 600000.0000
Using solver 'mosek'
Solving for 14852 variables.
Solving took 5.2 seconds.
Allowing negative dual variable(s) as small as -1.7906135797613865e-10.
Warning: Variable Mission.Climb.AircraftDrag.WingAero.CL[:] could cause inaccurate result because it is below lower bound. Solution is 1.3227 but bound is 0.9465
Warning: Variable Mission.Climb.AircraftDrag.WingAero.Re[:] could cause inaccurate result because it is above upper bound. Solution is 671709.7504 but bound is 600000.0000
Using solver 'mosek'
Solving for 14852 variables.
Solving took 7.49 seconds.
Allowing negative dual variable(s) as small as -2.4124311275158277e-09.
Warning: Variable Mission1.Climb.AircraftDrag.WingAero.CL[:] could cause inaccurate result because it is below lower bound. Solution is 1.2812 but bound is 0.9465
Warning: Variable Mission1.Climb.AircraftDrag.WingAero.Re[:] could cause inaccurate result because it is above upper bound. Solution is 729183.6361 but bound is 600000.0000
Using solver 'mosek'
Solving for 14852 variables.
Solving took 7.13 seconds.
Allowing negative dual variable(s) as small as -2.6368942493908215e-10.
Warning: Variable Mission2.Climb.AircraftDrag.WingAero.CL[:] could cause inaccurate result because it is below lower bound. Solution is 1.2258 but bound is 0.9465
Warning: Variable Mission2.Climb.AircraftDrag.WingAero.Re[:] could cause inaccurate result because it is above upper bound. Solution is 802959.5987 but bound is 600000.0000
Using solver 'mosek'
Solving for 7672 variables.
Solving took 4.21 seconds.
Allowing negative dual variable(s) as small as -1.5915271670641007e-11.
Warning: Variable Mission3.Climb.AircraftDrag.WingAero.CL[:] could cause inaccurate result because it is below lower bound. Solution is 1.2008 but bound is 0.9465
Warning: Variable Mission3.Climb.AircraftDrag.WingAero.Re[:] could cause inaccurate result because it is above upper bound. Solution is 839122.5091 but bound is 600000.0000
Using solver 'mosek'
Solving for 14852 variables.
Solving took 5.09 seconds.
Allowing negative dual variable(s) as small as -1.665522924007047e-09.
Warning: Variable Mission.Climb.AircraftDrag.WingAero.CL[:] could cause inaccurate result because it is below lower bound. Solution is 1.3227 but bound is 0.9465
Warning: Variable Mission.Climb.AircraftDrag.WingAero.Re[:] could cause inaccurate result because it is above upper bound. Solution is 671709.7440 but bound is 600000.0000
Using solver 'mosek'
Solving for 14852 variables.
Solving took 4.82 seconds.
Allowing negative dual variable(s) as small as -9.165782062986388e-11.
Warning: Variable Mission1.Climb.AircraftDrag.WingAero.CL[:] could cause inaccurate result because it is below lower bound. Solution is 1.2812 but bound is 0.9465
Warning: Variable Mission1.Climb.AircraftDrag.WingAero.Re[:] could cause inaccurate result because it is above upper bound. Solution is 729183.6146 but bound is 600000.0000
Using solver 'mosek'
Solving for 14852 variables.
Solving took 6.54 seconds.
Allowing negative dual variable(s) as small as -5.643180331348245e-10.
Warning: Variable Mission2.Climb.AircraftDrag.WingAero.CL[:] could cause inaccurate result because it is below lower bound. Solution is 1.2258 but bound is 0.9465
Warning: Variable Mission2.Climb.AircraftDrag.WingAero.Re[:] could cause inaccurate result because it is above upper bound. Solution is 802959.6007 but bound is 600000.0000
Using solver 'mosek'
Solving for 7672 variables.
Solving took 2.74 seconds.
Allowing negative dual variable(s) as small as -1.2038184578735222e-11.
Warning: Variable Mission3.Climb.AircraftDrag.WingAero.CL[:] could cause inaccurate result because it is below lower bound. Solution is 1.2008 but bound is 0.9465
Warning: Variable Mission3.Climb.AircraftDrag.WingAero.Re[:] could cause inaccurate result because it is above upper bound. Solution is 839122.5082 but bound is 600000.0000
Beginning signomial solve.
Solving took 4 GP solves and 1.54 seconds.
Warning: Variable Mission.Climb.AircraftDrag.WingAero.CL[:] could cause inaccurate result because it is below lower bound. Solution is 1.0536 but bound is 0.9465
Warning: Variable Mission.Climb.AircraftDrag.WingAero.Re[:] could cause inaccurate result because it is above upper bound. Solution is 1119121.2077 but bound is 600000.0000
Beginning signomial solve.
Solving took 4 GP solves and 1.2 seconds.
Warning: Variable Mission.Climb.AircraftDrag.WingAero.CL[:] could cause inaccurate result because it is below lower bound. Solution is 1.0536 but bound is 0.9465
Warning: Variable Mission.Climb.AircraftDrag.WingAero.Re[:] could cause inaccurate result because it is above upper bound. Solution is 1119121.2076 but bound is 600000.0000

Running tests...
----------------------------------------------------------------------
c:\anaconda2\lib\site-packages\pint\quantity.py:1377: UnitStrippedWarning: The unit of the quantity is stripped.
  warnings.warn("The unit of the quantity is stripped.", UnitStrippedWarning)
..C:\Users\jenkins\workspace\gplibrary_PR_Models\mosek\venv2_gpkit\lib\site-packages\gassolar\environment\solar_irradiance.py:40: RuntimeWarning: overflow encountered in exp
  tau = np.exp(-0.175/costhsun)
C:\Users\jenkins\workspace\gplibrary_PR_Models\mosek\venv2_gpkit\lib\site-packages\gassolar\environment\solar_irradiance.py:40: RuntimeWarning: divide by zero encountered in divide
  tau = np.exp(-0.175/costhsun)
....
----------------------------------------------------------------------
Ran 6 tests in 300.648s

OK

Generating XML reports...
Cloning into 'gplibrary'...
DEPRECATION: Python 2.7 will reach the end of its life on January 1st, 2020. Please upgrade your Python as Python 2.7 won't be maintained after that date. A future version of pip will drop support for Python 2.7. More details about Python 2 support in pip, can be found at https://pip.pypa.io/en/latest/development/release-process/#python-2-support
Requirement already satisfied: pandas in c:\anaconda2\lib\site-packages (0.24.2)
Requirement already satisfied: numpy>=1.12.0 in c:\anaconda2\lib\site-packages (from pandas) (1.16.5)
Requirement already satisfied: pytz>=2011k in c:\anaconda2\lib\site-packages (from pandas) (2019.2)
Requirement already satisfied: python-dateutil>=2.5.0 in c:\anaconda2\lib\site-packages (from pandas) (2.8.0)
Requirement already satisfied: six>=1.5 in c:\anaconda2\lib\site-packages (from python-dateutil>=2.5.0->pandas) (1.12.0)
DEPRECATION: Python 2.7 will reach the end of its life on January 1st, 2020. Please upgrade your Python as Python 2.7 won't be maintained after that date. A future version of pip will drop support for Python 2.7. More details about Python 2 support in pip, can be found at https://pip.pypa.io/en/latest/development/release-process/#python-2-support
Collecting git+https://github.com/hoburg/gpfit.git
  Cloning https://github.com/hoburg/gpfit.git to c:\users\jenkins\appdata\local\temp\pip-req-build-tr7016
  Running command git clone -q https://github.com/hoburg/gpfit.git 'c:\users\jenkins\appdata\local\temp\pip-req-build-tr7016'
Requirement already satisfied (use --upgrade to upgrade): gpfit==0.1 from git+https://github.com/hoburg/gpfit.git in c:\users\jenkins\workspace\gplibrary_pr_models\mosek\venv2_gpkit\lib\site-packages
Requirement already satisfied: numpy in c:\anaconda2\lib\site-packages (from gpfit==0.1) (1.16.5)
Requirement already satisfied: scipy in c:\anaconda2\lib\site-packages (from gpfit==0.1) (1.2.2)
Requirement already satisfied: gpkit in c:\users\jenkins\workspace\gplibrary_pr_models\mosek\gpkit (from gpfit==0.1) (0.9.1.0)
Requirement already satisfied: pint>=0.8.1 in c:\anaconda2\lib\site-packages (from gpkit->gpfit==0.1) (0.9)
Requirement already satisfied: ad in c:\anaconda2\lib\site-packages (from gpkit->gpfit==0.1) (1.3.2)
Requirement already satisfied: cvxopt>=1.1.8 in c:\anaconda2\lib\site-packages (from gpkit->gpfit==0.1) (1.2.3)
Requirement already satisfied: six in c:\anaconda2\lib\site-packages (from gpkit->gpfit==0.1) (1.12.0)
Requirement already satisfied: funcsigs; python_version == "2.7" in c:\anaconda2\lib\site-packages (from pint>=0.8.1->gpkit->gpfit==0.1) (1.0.2)
Requirement already satisfied: mkl in c:\anaconda2\lib\site-packages (from cvxopt>=1.1.8->gpkit->gpfit==0.1) (2018.0.0)
Requirement already satisfied: intel-openmp==2018.0.0 in c:\anaconda2\lib\site-packages (from mkl->cvxopt>=1.1.8->gpkit->gpfit==0.1) (2018.0.0)
Building wheels for collected packages: gpfit
  Building wheel for gpfit (setup.py): started
  Building wheel for gpfit (setup.py): finished with status 'done'
  Created wheel for gpfit: filename=gpfit-0.1-cp27-none-any.whl size=25428 sha256=65f2516d1cecc508db02597b5f0145dd60fdb71f5d8b84f822d6d2696a0d6f41
  Stored in directory: c:\users\jenkins\appdata\local\temp\pip-ephem-wheel-cache-qp3tdd\wheels\4d\4b\2e\9480645acbe8d32004b09b3732f616bbb2a9ee75e4526f058f
Successfully built gpfit
DEPRECATION: Python 2.7 will reach the end of its life on January 1st, 2020. Please upgrade your Python as Python 2.7 won't be maintained after that date. A future version of pip will drop support for Python 2.7. More details about Python 2 support in pip, can be found at https://pip.pypa.io/en/latest/development/release-process/#python-2-support
Processing c:\users\jenkins\workspace\gplibrary_pr_models\mosek\gplibrary
Requirement already satisfied: numpy>=1.12 in c:\anaconda2\lib\site-packages (from gpkitmodels==0.0.0.0) (1.16.5)
Requirement already satisfied: scipy in c:\anaconda2\lib\site-packages (from gpkitmodels==0.0.0.0) (1.2.2)
Requirement already satisfied: pint in c:\anaconda2\lib\site-packages (from gpkitmodels==0.0.0.0) (0.9)
Requirement already satisfied: funcsigs; python_version == "2.7" in c:\anaconda2\lib\site-packages (from pint->gpkitmodels==0.0.0.0) (1.0.2)
Building wheels for collected packages: gpkitmodels
  Building wheel for gpkitmodels (setup.py): started
  Building wheel for gpkitmodels (setup.py): finished with status 'done'
  Created wheel for gpkitmodels: filename=gpkitmodels-0.0.0.0-cp27-none-any.whl size=66262 sha256=9a60766316c4f6c312eb40648f4fed5c8b29fefcf7bc645d1700647c548e5075
  Stored in directory: c:\users\jenkins\appdata\local\temp\pip-ephem-wheel-cache-1hgq20\wheels\a3\80\70\6d80d6b876aaa160fc8dda3c238a4f64c571e65f335a009034
Successfully built gpkitmodels
Installing collected packages: gpkitmodels
  Found existing installation: gpkitmodels 0.0.0.0
    Uninstalling gpkitmodels-0.0.0.0:
      Successfully uninstalled gpkitmodels-0.0.0.0
Successfully installed gpkitmodels-0.0.0.0
adding test for 'gpkitmodels/GP/aircraft/wing/wing_test.py'
adding test for 'gpkitmodels/GP/aircraft/tail/tail_tests.py'
adding test for 'gpkitmodels/GP/aircraft/fuselage/test_fuselage.py'
adding test for 'gpkitmodels/GP/aircraft/prop/prop_test.py'
adding test for 'gpkitmodels/GP/aircraft/motor/motor_test.py'
adding test for 'gpkitmodels/SP/SimPleAC/SimPleAC.py'
adding test for 'gpkitmodels/SP/SimPleAC/SimPleAC_mission.py'
adding test for 'gpkitmodels/SP/SimPleAC/SimPleAC_multimission.py'
Using solver 'mosek'
Solving for 11 variables.
Solving took 0.034 seconds.
Using solver 'mosek_cli'
Solving for 11 variables.
Solving took 0.081 seconds.
Using solver 'mosek'
Solving for 9 variables.
Solving took 0.021 seconds.
Using solver 'mosek'
Solving for 25 variables.
Solving took 0.029 seconds.
Using solver 'mosek'
Solving for 25 variables.
Solving took 0.023 seconds.
Beginning signomial solve.
Solving took 16 GP solves and 0.849 seconds.
Using solver 'mosek_cli'
Solving for 9 variables.
Solving took 0.081 seconds.
Using solver 'mosek_cli'
Solving for 25 variables.
Solving took 0.087 seconds.
Using solver 'mosek_cli'
Solving for 25 variables.
Solving took 0.079 seconds.
Beginning signomial solve.
Solving took 16 GP solves and 2.66 seconds.
Using solver 'mosek'
Solving for 13 variables.
Solving took 0.033 seconds.
Beginning signomial solve.
Solving took 11 GP solves and 0.7 seconds.
Warning: Variable BladeElementProp.BladeElementPerf.cl[:] could cause inaccurate result because it is below lower bound. Solution is 0.6000 but bound is 0.4742
Warning: Variable BladeElementProp.BladeElementPerf.Re[:] could cause inaccurate result because it is above upper bound. Solution is 1619898.2228 but bound is 700000.0000
Using solver 'mosek_cli'
Solving for 13 variables.
Solving took 0.069 seconds.
Beginning signomial solve.
Solving took 11 GP solves and 1.84 seconds.
Warning: Variable BladeElementProp.BladeElementPerf.cl[:] could cause inaccurate result because it is below lower bound. Solution is 0.6000 but bound is 0.4742
Warning: Variable BladeElementProp.BladeElementPerf.Re[:] could cause inaccurate result because it is above upper bound. Solution is 1619891.9379 but bound is 700000.0000
Warning: Variable TailAero.Re could cause inaccurate result because it is above upper bound. Solution is 2220953.3838 but bound is 1000000.0000
Warning: Variable TailAero1.Re could cause inaccurate result because it is above upper bound. Solution is 2499787.9776 but bound is 1000000.0000
Warning: Variable TailAero2.Re could cause inaccurate result because it is above upper bound. Solution is 2223878.3883 but bound is 1000000.0000
Warning: Variable TailAero3.Re could cause inaccurate result because it is above upper bound. Solution is 2223877.9590 but bound is 1000000.0000
Warning: Variable TailAero4.Re could cause inaccurate result because it is above upper bound. Solution is 1853897.1004 but bound is 1000000.0000
Warning: Variable TailAero5.Re could cause inaccurate result because it is above upper bound. Solution is 1853897.1004 but bound is 1000000.0000
Warning: Variable TailAero.Re could cause inaccurate result because it is above upper bound. Solution is 2220959.7939 but bound is 1000000.0000
Warning: Variable TailAero1.Re could cause inaccurate result because it is above upper bound. Solution is 2499796.7837 but bound is 1000000.0000
Warning: Variable TailAero2.Re could cause inaccurate result because it is above upper bound. Solution is 1860712.4314 but bound is 1000000.0000
Warning: Variable TailAero3.Re could cause inaccurate result because it is above upper bound. Solution is 1860712.4314 but bound is 1000000.0000
Warning: Variable TailAero4.Re could cause inaccurate result because it is above upper bound. Solution is 1853896.1324 but bound is 1000000.0000
Warning: Variable TailAero5.Re could cause inaccurate result because it is above upper bound. Solution is 1853896.1324 but bound is 1000000.0000
Warning: Variable WingAero.Re could cause inaccurate result because it is above upper bound. Solution is 1884891.6332 but bound is 700000.0000
Warning: Variable WingAero1.Re could cause inaccurate result because it is above upper bound. Solution is 1910419.6195 but bound is 700000.0000
Warning: Variable WingAero.Re could cause inaccurate result because it is above upper bound. Solution is 1910412.9866 but bound is 700000.0000
Warning: Variable WingAero1.Re could cause inaccurate result because it is above upper bound. Solution is 1910412.9866 but bound is 700000.0000
SP is not converging! Last GP iteration had a higher cost (3e+03) than the previous one (2.7e+03). Results for each iteration are in (Model).program.results. If your model contains SignomialEqualities, note that convergence is not guaranteed: try replacing any SigEqs you can and solving again.
SP is not converging! Last GP iteration had a higher cost (3e+03) than the previous one (2.7e+03). Results for each iteration are in (Model).program.results. If your model contains SignomialEqualities, note that convergence is not guaranteed: try replacing any SigEqs you can and solving again.
SP is not converging! Last GP iteration had a higher cost (4.3e+03) than the previous one (3.4e+03). Results for each iteration are in (Model).program.results. If your model contains SignomialEqualities, note that convergence is not guaranteed: try replacing any SigEqs you can and solving again.
SP is not converging! Last GP iteration had a higher cost (4.3e+03) than the previous one (4.3e+03). Results for each iteration are in (Model).program.results. If your model contains SignomialEqualities, note that convergence is not guaranteed: try replacing any SigEqs you can and solving again.
SP is not converging! Last GP iteration had a higher cost (4.3e+03) than the previous one (4.3e+03). Results for each iteration are in (Model).program.results. If your model contains SignomialEqualities, note that convergence is not guaranteed: try replacing any SigEqs you can and solving again.
SP is not converging! Last GP iteration had a higher cost (4.3e+03) than the previous one (3.4e+03). Results for each iteration are in (Model).program.results. If your model contains SignomialEqualities, note that convergence is not guaranteed: try replacing any SigEqs you can and solving again.
SP is not converging! Last GP iteration had a higher cost (4.3e+03) than the previous one (4.3e+03). Results for each iteration are in (Model).program.results. If your model contains SignomialEqualities, note that convergence is not guaranteed: try replacing any SigEqs you can and solving again.
SP is not converging! Last GP iteration had a higher cost (4.3e+03) than the previous one (4.3e+03). Results for each iteration are in (Model).program.results. If your model contains SignomialEqualities, note that convergence is not guaranteed: try replacing any SigEqs you can and solving again.
Beginning signomial solve.
Using solver 'mosek'
Solving for 20 variables.
Solving took 0.024 seconds.
Using solver 'mosek'
Solving for 20 variables.
Solving took 0.019 seconds.
Using solver 'mosek'
Solving for 20 variables.
Solving took 0.019 seconds.
Using solver 'mosek'
Solving for 20 variables.
Solving took 0.02 seconds.
Solving took 4 GP solves and 0.092 seconds.
Beginning signomial solve.
Using solver 'mosek_cli'
Solving for 20 variables.
Solving took 0.081 seconds.
Using solver 'mosek_cli'
Solving for 20 variables.
Solving took 0.072 seconds.
Using solver 'mosek_cli'
Solving for 20 variables.
Solving took 0.086 seconds.
Using solver 'mosek_cli'
Solving for 20 variables.
Solving took 0.099 seconds.
Solving took 4 GP solves and 0.351 seconds.

Running tests...
----------------------------------------------------------------------
..c:\anaconda2\lib\site-packages\pint\quantity.py:1377: UnitStrippedWarning: The unit of the quantity is stripped.
  warnings.warn("The unit of the quantity is stripped.", UnitStrippedWarning)
..............
----------------------------------------------------------------------
Ran 16 tests in 16.612s

OK

Generating XML reports...
Cloning into 'eVTOL'...
Checking out files:  94% (114/121)   
Checking out files:  95% (115/121)   
Checking out files:  96% (117/121)   
Checking out files:  97% (118/121)   
Checking out files:  98% (119/121)   
Checking out files:  99% (120/121)   
Checking out files: 100% (121/121)   
Checking out files: 100% (121/121), done.
adding test for 'models/model_tests.py'

Running tests...
----------------------------------------------------------------------
..
----------------------------------------------------------------------
Ran 2 tests in 6.608s

OK

Generating XML reports...

----------------------------------------------------------------------
Ran 243 tests in 48.990s

OK
RECTORY AS GPKITMODELS DIRECTORY
calling ['pip', 'install', '--no-cache-dir', '--no-deps', '-e', '.']
  attempt 1
calling ['git', 'clone', '--depth', '1', '-b', 'master', 'https://github.com/convexengineering/robust.git']
  attempt 1

SETTINGS
defaultdict(<type 'str'>, {})

calling ['pip', 'install', '.']
  attempt 1
calling ['git', 'clone', '--depth', '1', '-b', 'master', 'https://github.com/convexengineering/shopping.git']
  attempt 1

SETTINGS
defaultdict(<type 'str'>, {})

calling ['git', 'clone', '--depth', '1', '-b', 'master', 'https://github.com/convexengineering/gassolar.git']
  attempt 1

SETTINGS
defaultdict(<type 'str'>, {'skipsolvers': 'cvxopt', 'pip install': 'pandas, git+https://github.com/hoburg/gpfit.git', 'gpkit-models branch': 'master'})

calling ['pip', 'install', 'pandas']
  attempt 1
calling ['pip', 'install', 'git+https://github.com/hoburg/gpfit.git']
  attempt 1
calling ['pip', 'install', '.']
  attempt 1
calling ['git', 'clone', '--depth', '1', '-b', 'master', 'https://github.com/convexengineering/jho.git']
  attempt 1

SETTINGS
defaultdict(<type 'str'>, {'skipsolvers': 'cvxopt', 'pip install': 'pandas, git+https://github.com/hoburg/gpfit.git', 'gpkit-models branch': 'master'})

calling ['pip', 'install', 'pandas']
  attempt 1
calling ['pip', 'install', 'git+https://github.com/hoburg/gpfit.git']
  attempt 1
calling ['git', 'clone', '--depth', '1', '-b', 'master', 'https://github.com/convexengineering/turbofan.git']
  attempt 1

SETTINGS
defaultdict(<type 'str'>, {'skipsolvers': 'cvxopt, mosek_cli', 'gpkit-models branch': 'master'})

calling ['pip', 'install', '.']
  attempt 1
calling ['git', 'clone', '--depth', '1', '-b', 'master', 'https://github.com/convexengineering/solar.git']
  attempt 1

SETTINGS
defaultdict(<type 'str'>, {'skipsolvers': 'cvxopt', 'pip install': 'pandas, git+https://github.com/convexengineering/gpfit.git, git+https://github.com/convexengineering/gassolar.git', 'gpkit-models branch': 'master'})

calling ['pip', 'install', 'pandas']
  attempt 1
calling ['pip', 'install', 'git+https://github.com/convexengineering/gpfit.git']
  attempt 1
calling ['pip', 'install', 'git+https://github.com/convexengineering/gassolar.git']
  attempt 1
calling ['pip', 'install', '.']
  attempt 1
calling ['git', 'clone', '--depth', '1', '-b', 'master', 'https://github.com/convexengineering/gplibrary.git']
  attempt 1

SETTINGS
defaultdict(<type 'str'>, {'pip install': 'pandas, git+https://github.com/hoburg/gpfit.git'})

calling ['pip', 'install', 'pandas']
  attempt 1
calling ['pip', 'install', 'git+https://github.com/hoburg/gpfit.git']
  attempt 1
calling ['pip', 'install', '.']
  attempt 1
calling ['git', 'clone', '--depth', '1', '-b', 'master', 'https://github.com/convexengineering/eVTOL.git']
  attempt 1

SETTINGS
defaultdict(<type 'str'>, {})


(venv2_gpkit) (base) C:\Users\jenkins\workspace\gplibrary_PR_Models\mosek>exit 0 
Build step 'Console output (build log) parsing' changed build result to FAILURE
INFO: Starting to record.
INFO: Processing JUnit
INFO: [JUnit] - 8 test report file(s) were found with the pattern '**/test_reports/*.xml, **/test_reports_nounits/*.xml' relative to 'C:\Users\jenkins\workspace\gplibrary_PR_Models\mosek' for the testing framework 'JUnit'.
INFO: Check 'Failed Tests' threshold.
INFO: Check 'Skipped Tests' threshold.
INFO: Setting the build status to FAILURE
INFO: Stopping recording.
[WS-CLEANUP] Deleting project workspace...
[WS-CLEANUP] Deferred wipeout is used...
[WS-CLEANUP] done
Finished: FAILURE