Skip to content

Console Output

Skipping 702 KB.. Full Log
   p                 :         1.9000000006        [-]         Dummy Variable (1+2*lam_w)                                              
   q                 :         1.4500000015        [-]         Dummy Variable (1+lam_w)                                                
   t_cap_bar         :         0.0042543622        [-]         Spar cap thickness per unit chord                                       
   t_web_bar         :         0.0005951408        [-]         Spar web thickness per unit chord                                       
   tau               :         0.1499994382        [-]         airfoil thickness to chord ratio                                        
   z_bre_0           :         0.0943483065        [-]         Breguet Range Factor, segment 0                                         
   z_bre_1           :         0.0944379790        [-]         Breguet Range Factor, segment 1                                         

Sensitivities
-------------
   Sensitivities not available for optimizations of type Sequential Log Convex Program 

Solve Report
------------
   Solve Method           :  Sequential Log Convex Program 
   Classification         :  Iterative 
   Solver                 :  cvxopt 
   Number of Iterations   :  48 
   Termination Status     :  Converged, relative change in the objective function (8.57e-06) is witin specified tolerance (1.00e-05) 

Messages
--------
    1. Attempted step of size 1.00e+00 at iteration 2 is too large and is causing a constraint to return as imaginary.  Decreasing according to the tau schedule.
    2. Attempted step of size 9.00e-01 at iteration 2 is too large and is causing a constraint to return as imaginary.  Decreasing according to the tau schedule.
    3. Wolfe Condition 1 failed at iteration 4 (Step 4).  Watchdog counter is 1
    4. Wolfe Condition 1 failed at iteration 7 (Step 7).  Watchdog counter is 1
    5. Wolfe Condition 1 failed at iteration 8 (Step 8).  Watchdog counter is 2
    6. Wolfe Condition 1 failed at iteration 11 (Step 11).  Watchdog counter is 1
    7. Attempted step of size 1.00e+00 at iteration 12 is too large and is causing a constraint to return as imaginary.  Decreasing according to the tau schedule.
    8. Wolfe Condition 1 failed at iteration 12 (Step 12).  Watchdog counter is 2
    9. Wolfe Condition 1 failed at iteration 14 (Step 14).  Watchdog counter is 1
   10. Wolfe Condition 1 failed at iteration 15 (Step 15).  Watchdog counter is 2
   11. Wolfe Condition 1 failed at iteration 16 (Step 16).  Watchdog counter is 3
   12. Wolfe Condition 1 failed at iteration 17 (Step 17).  Watchdog counter is 4
   13. Wolfe Condition 1 failed at iteration 18 (Step 18).  Watchdog counter is 5
   14. Wolfe Condition 1 failed at iteration 19 (Step 19).  Resetting to Step 14.
   15. Attempted step of size 9.00e-01 at iteration 14 is too large and is causing a constraint to return as imaginary.  Decreasing according to the tau schedule.
   16. Attempted step of size 6.56e-01 at iteration 14 is too large and is causing a constraint to return as imaginary.  Decreasing according to the tau schedule.
   17. Attempted step of size 2.82e-01 at iteration 14 is too large and is causing a constraint to return as imaginary.  Decreasing according to the tau schedule.
   18. Attempted step of size 2.54e-01 at iteration 14 is too large and is causing a constraint to return as imaginary.  Decreasing according to the tau schedule.
   19. Attempted step of size 2.29e-01 at iteration 14 is too large and is causing a constraint to return as imaginary.  Decreasing according to the tau schedule.
   20. Wolfe Condition 1 failed at iteration 21 (Step 16).  Watchdog counter is 1
   21. Wolfe Condition 1 failed at iteration 22 (Step 17).  Watchdog counter is 2
   22. Wolfe Condition 1 failed at iteration 23 (Step 18).  Watchdog counter is 3
   23. Attempted step of size 3.41e-01 at iteration 20 is too large and is causing a constraint to return as imaginary.  Decreasing according to the tau schedule.
   24. Attempted step of size 3.07e-01 at iteration 20 is too large and is causing a constraint to return as imaginary.  Decreasing according to the tau schedule.
   25. Attempted step of size 2.76e-01 at iteration 20 is too large and is causing a constraint to return as imaginary.  Decreasing according to the tau schedule.
   26. Attempted step of size 2.49e-01 at iteration 20 is too large and is causing a constraint to return as imaginary.  Decreasing according to the tau schedule.
   27. Attempted step of size 2.24e-01 at iteration 20 is too large and is causing a constraint to return as imaginary.  Decreasing according to the tau schedule.
   28. Attempted step of size 2.02e-01 at iteration 20 is too large and is causing a constraint to return as imaginary.  Decreasing according to the tau schedule.
   29. Attempted step of size 1.81e-01 at iteration 20 is too large and is causing a constraint to return as imaginary.  Decreasing according to the tau schedule.
   30. Wolfe Condition 1 failed at iteration 26 (Step 21).  Watchdog counter is 1
   31. Attempted step of size 2.25e-01 at iteration 26 is too large and is causing a constraint to return as imaginary.  Decreasing according to the tau schedule.


real	46m1.318s
user	0m2.968s
sys	0m11.857s
+ status=0
+ set +x

=================================================
CAPS verification (using pyCAPS) case pyCAPS/MSES.py passed (as expected)
=================================================


=================================================
+ echo 'pyCAPS/Camber.py test;'
+ tee -a /c/Users/jenkins/workspace/ESP_RegCaps/7.6/CAPS/CORSAIRLITE/WIN64.2017/ESP/WIN64/examples/regressionTest/pyCAPSlog.txt
pyCAPS/Camber.py test;
+ python -u pyCAPS/Camber.py -outLevel=0
+ tee -a /c/Users/jenkins/workspace/ESP_RegCaps/7.6/CAPS/CORSAIRLITE/WIN64.2017/ESP/WIN64/examples/regressionTest/pyCAPSlog.txt
128 File(s) copied
9 File(s) copied

Getting CFD design variables.......
	Number of design variables - 3
	Design Variable name - camber
	Design Variable name - maxloc
	Design Variable name - thickness
	Done getting CFD design variables
 CAPS Info: Sensitivity FD step 1.000000e-05
 CAPS Info: Sensitivity FD step 1.000000e-05
 CAPS Info: Sensitivity FD step 1.000000e-05
 CAPS Info: Sensitivity FD step 1.000000e-05
 CAPS Info: Sensitivity FD step 1.000000e-05

Getting CFD design variables.......
	Number of design variables - 3
	Design Variable name - camber
	Design Variable name - maxloc
	Design Variable name - thickness
	Done getting CFD design variables
 CAPS Info: Sensitivity FD step 1.000000e-05
 CAPS Info: Sensitivity FD step 1.000000e-05
 CAPS Info: Sensitivity FD step 1.000000e-05
 CAPS Info: Sensitivity FD step 1.000000e-05
 CAPS Info: Sensitivity FD step 1.000000e-05

Getting CFD design variables.......
	Number of design variables - 3
	Design Variable name - camber
	Design Variable name - maxloc
	Design Variable name - thickness
	Done getting CFD design variables
 CAPS Info: Sensitivity FD step 1.000000e-05
 CAPS Info: Sensitivity FD step 1.000000e-05
 CAPS Info: Sensitivity FD step 1.000000e-05
 CAPS Info: Sensitivity FD step 1.000000e-05
 CAPS Info: Sensitivity FD step 1.000000e-05

Getting CFD design variables.......
	Number of design variables - 3
	Design Variable name - camber
	Design Variable name - maxloc
	Design Variable name - thickness
	Done getting CFD design variables
 CAPS Info: Sensitivity FD step 1.000000e-05
 CAPS Info: Sensitivity FD step 1.000000e-05
 CAPS Info: Sensitivity FD step 1.000000e-05
 CAPS Info: Sensitivity FD step 1.000000e-05
 CAPS Info: Sensitivity FD step 1.000000e-05

Getting CFD design variables.......
	Number of design variables - 3
	Design Variable name - camber
	Design Variable name - maxloc
	Design Variable name - thickness
	Done getting CFD design variables
 CAPS Info: Sensitivity FD step 1.000000e-05
 CAPS Info: Sensitivity FD step 1.000000e-05
 CAPS Info: Sensitivity FD step 1.000000e-05
 CAPS Info: Sensitivity FD step 1.000000e-05
 CAPS Info: Sensitivity FD step 1.000000e-05

Getting CFD design variables.......
	Number of design variables - 3
	Design Variable name - camber
	Design Variable name - maxloc
	Design Variable name - thickness
	Done getting CFD design variables
 CAPS Info: Sensitivity FD step 1.000000e-05
 CAPS Info: Sensitivity FD step 1.000000e-05
 CAPS Info: Sensitivity FD step 1.000000e-05
 CAPS Info: Sensitivity FD step 1.000000e-05
 CAPS Info: Sensitivity FD step 1.000000e-05

Getting CFD design variables.......
	Number of design variables - 3
	Design Variable name - camber
	Design Variable name - maxloc
	Design Variable name - thickness
	Done getting CFD design variables
 CAPS Info: Sensitivity FD step 1.000000e-05
 CAPS Info: Sensitivity FD step 1.000000e-05
 CAPS Info: Sensitivity FD step 1.000000e-05
 CAPS Info: Sensitivity FD step 1.000000e-05
 CAPS Info: Sensitivity FD step 1.000000e-05

Getting CFD design variables.......
	Number of design variables - 3
	Design Variable name - camber
	Design Variable name - maxloc
	Design Variable name - thickness
	Done getting CFD design variables
 CAPS Info: Sensitivity FD step 1.000000e-05
 CAPS Info: Sensitivity FD step 1.000000e-05
 CAPS Info: Sensitivity FD step 1.000000e-05
 CAPS Info: Sensitivity FD step 1.000000e-05
 CAPS Info: Sensitivity FD step 1.000000e-05

Getting CFD design variables.......
	Number of design variables - 3
	Design Variable name - camber
	Design Variable name - maxloc
	Design Variable name - thickness
	Done getting CFD design variables
 CAPS Info: Sensitivity FD step 1.000000e-05
 CAPS Info: Sensitivity FD step 1.000000e-05
 CAPS Info: Sensitivity FD step 1.000000e-05
 CAPS Info: Sensitivity FD step 1.000000e-05
 CAPS Info: Sensitivity FD step 1.000000e-05

Getting CFD design variables.......
	Number of design variables - 3
	Design Variable name - camber
	Design Variable name - maxloc
	Design Variable name - thickness
	Done getting CFD design variables
 CAPS Info: Sensitivity FD step 1.000000e-05
 CAPS Info: Sensitivity FD step 1.000000e-05
 CAPS Info: Sensitivity FD step 1.000000e-05
 CAPS Info: Sensitivity FD step 1.000000e-05
 CAPS Info: Sensitivity FD step 1.000000e-05

Getting CFD design variables.......
	Number of design variables - 3
	Design Variable name - camber
	Design Variable name - maxloc
	Design Variable name - thickness
	Done getting CFD design variables
 CAPS Info: Sensitivity FD step 1.000000e-05
 CAPS Info: Sensitivity FD step 1.000000e-05
 CAPS Info: Sensitivity FD step 1.000000e-05
 CAPS Info: Sensitivity FD step 1.000000e-05
 CAPS Info: Sensitivity FD step 1.000000e-05

Getting CFD design variables.......
	Number of design variables - 3
	Design Variable name - camber
	Design Variable name - maxloc
	Design Variable name - thickness
	Done getting CFD design variables
 CAPS Info: Sensitivity FD step 1.000000e-05
 CAPS Info: Sensitivity FD step 1.000000e-05
 CAPS Info: Sensitivity FD step 1.000000e-05
 CAPS Info: Sensitivity FD step 1.000000e-05
 CAPS Info: Sensitivity FD step 1.000000e-05

Getting CFD design variables.......
	Number of design variables - 3
	Design Variable name - camber
	Design Variable name - maxloc
	Design Variable name - thickness
	Done getting CFD design variables
 CAPS Info: Sensitivity FD step 1.000000e-05
 CAPS Info: Sensitivity FD step 1.000000e-05
 CAPS Info: Sensitivity FD step 1.000000e-05
 CAPS Info: Sensitivity FD step 1.000000e-05
 CAPS Info: Sensitivity FD step 1.000000e-05

Getting CFD design variables.......
	Number of design variables - 3
	Design Variable name - camber
	Design Variable name - maxloc
	Design Variable name - thickness
	Done getting CFD design variables
 CAPS Info: Sensitivity FD step 1.000000e-05
 CAPS Info: Sensitivity FD step 1.000000e-05
 CAPS Info: Sensitivity FD step 1.000000e-05
 CAPS Info: Sensitivity FD step 1.000000e-05
 CAPS Info: Sensitivity FD step 1.000000e-05

Getting CFD design variables.......
	Number of design variables - 3
	Design Variable name - camber
	Design Variable name - maxloc
	Design Variable name - thickness
	Done getting CFD design variables
 CAPS Info: Sensitivity FD step 1.000000e-05
 CAPS Info: Sensitivity FD step 1.000000e-05
 CAPS Info: Sensitivity FD step 1.000000e-05
 CAPS Info: Sensitivity FD step 1.000000e-05
 CAPS Info: Sensitivity FD step 1.000000e-05

Getting CFD design variables.......
	Number of design variables - 3
	Design Variable name - camber
	Design Variable name - maxloc
	Design Variable name - thickness
	Done getting CFD design variables
 CAPS Info: Sensitivity FD step 1.000000e-05
 CAPS Info: Sensitivity FD step 1.000000e-05
 CAPS Info: Sensitivity FD step 1.000000e-05
 CAPS Info: Sensitivity FD step 1.000000e-05
 CAPS Info: Sensitivity FD step 1.000000e-05

Getting CFD design variables.......
	Number of design variables - 3
	Design Variable name - camber
	Design Variable name - maxloc
	Design Variable name - thickness
	Done getting CFD design variables
 CAPS Info: Sensitivity FD step 1.000000e-05
 CAPS Info: Sensitivity FD step 1.000000e-05
 CAPS Info: Sensitivity FD step 1.000000e-05
 CAPS Info: Sensitivity FD step 1.000000e-05
 CAPS Info: Sensitivity FD step 1.000000e-05

Getting CFD design variables.......
	Number of design variables - 3
	Design Variable name - camber
	Design Variable name - maxloc
	Design Variable name - thickness
	Done getting CFD design variables
 CAPS Info: Sensitivity FD step 1.000000e-05
 CAPS Info: Sensitivity FD step 1.000000e-05
 CAPS Info: Sensitivity FD step 1.000000e-05
 CAPS Info: Sensitivity FD step 1.000000e-05
 CAPS Info: Sensitivity FD step 1.000000e-05

Getting CFD design variables.......
	Number of design variables - 3
	Design Variable name - camber
	Design Variable name - maxloc
	Design Variable name - thickness
	Done getting CFD design variables
 CAPS Info: Sensitivity FD step 1.000000e-05
 CAPS Info: Sensitivity FD step 1.000000e-05
 CAPS Info: Sensitivity FD step 1.000000e-05
 CAPS Info: Sensitivity FD step 1.000000e-05
 CAPS Info: Sensitivity FD step 1.000000e-05

Getting CFD design variables.......
	Number of design variables - 3
	Design Variable name - camber
	Design Variable name - maxloc
	Design Variable name - thickness
	Done getting CFD design variables
 CAPS Info: Sensitivity FD step 1.000000e-05
 CAPS Info: Sensitivity FD step 1.000000e-05
 CAPS Info: Sensitivity FD step 1.000000e-05
 CAPS Info: Sensitivity FD step 1.000000e-05
 CAPS Info: Sensitivity FD step 1.000000e-05

Getting CFD design variables.......
	Number of design variables - 3
	Design Variable name - camber
	Design Variable name - maxloc
	Design Variable name - thickness
	Done getting CFD design variables
 CAPS Info: Sensitivity FD step 1.000000e-05
 CAPS Info: Sensitivity FD step 1.000000e-05
 CAPS Info: Sensitivity FD step 1.000000e-05
 CAPS Info: Sensitivity FD step 1.000000e-05
 CAPS Info: Sensitivity FD step 1.000000e-05

Getting CFD design variables.......
	Number of design variables - 3
	Design Variable name - camber
	Design Variable name - maxloc
	Design Variable name - thickness
	Done getting CFD design variables
 CAPS Info: Sensitivity FD step 1.000000e-05
 CAPS Info: Sensitivity FD step 1.000000e-05
 CAPS Info: Sensitivity FD step 1.000000e-05
 CAPS Info: Sensitivity FD step 1.000000e-05
 CAPS Info: Sensitivity FD step 1.000000e-05

Getting CFD design variables.......
	Number of design variables - 3
	Design Variable name - camber
	Design Variable name - maxloc
	Design Variable name - thickness
	Done getting CFD design variables
 CAPS Info: Sensitivity FD step 1.000000e-05
 CAPS Info: Sensitivity FD step 1.000000e-05
 CAPS Info: Sensitivity FD step 1.000000e-05
 CAPS Info: Sensitivity FD step 1.000000e-05
 CAPS Info: Sensitivity FD step 1.000000e-05

Getting CFD design variables.......
	Number of design variables - 3
	Design Variable name - camber
	Design Variable name - maxloc
	Design Variable name - thickness
	Done getting CFD design variables
 CAPS Info: Sensitivity FD step 1.000000e-05
 CAPS Info: Sensitivity FD step 1.000000e-05
 CAPS Info: Sensitivity FD step 1.000000e-05
 CAPS Info: Sensitivity FD step 1.000000e-05
 CAPS Info: Sensitivity FD step 1.000000e-05

Getting CFD design variables.......
	Number of design variables - 3
	Design Variable name - camber
	Design Variable name - maxloc
	Design Variable name - thickness
	Done getting CFD design variables
 CAPS Info: Sensitivity FD step 1.000000e-05
 CAPS Info: Sensitivity FD step 1.000000e-05
 CAPS Info: Sensitivity FD step 1.000000e-05
 CAPS Info: Sensitivity FD step 1.000000e-05
 CAPS Info: Sensitivity FD step 1.000000e-05

Getting CFD design variables.......
	Number of design variables - 3
	Design Variable name - camber
	Design Variable name - maxloc
	Design Variable name - thickness
	Done getting CFD design variables
 CAPS Info: Sensitivity FD step 1.000000e-05
 CAPS Info: Sensitivity FD step 1.000000e-05
 CAPS Info: Sensitivity FD step 1.000000e-05
 CAPS Info: Sensitivity FD step 1.000000e-05
 CAPS Info: Sensitivity FD step 1.000000e-05
Note: The following floating-point exceptions are signalling: IEEE_INVALID_FLAG IEEE_DIVIDE_BY_ZERO

Getting CFD design variables.......
	Number of design variables - 3
	Design Variable name - camber
	Design Variable name - maxloc
	Design Variable name - thickness
	Done getting CFD design variables
 CAPS Info: Sensitivity FD step 1.000000e-05
 CAPS Info: Sensitivity FD step 1.000000e-05
 CAPS Info: Sensitivity FD step 1.000000e-05
 CAPS Info: Sensitivity FD step 1.000000e-05
 CAPS Info: Sensitivity FD step 1.000000e-05

Getting CFD design variables.......
	Number of design variables - 3
	Design Variable name - camber
	Design Variable name - maxloc
	Design Variable name - thickness
	Done getting CFD design variables
 CAPS Info: Sensitivity FD step 1.000000e-05
 CAPS Info: Sensitivity FD step 1.000000e-05
 CAPS Info: Sensitivity FD step 1.000000e-05
 CAPS Info: Sensitivity FD step 1.000000e-05
 CAPS Info: Sensitivity FD step 1.000000e-05

Getting CFD design variables.......
	Number of design variables - 3
	Design Variable name - camber
	Design Variable name - maxloc
	Design Variable name - thickness
	Done getting CFD design variables
 CAPS Info: Sensitivity FD step 1.000000e-05
 CAPS Info: Sensitivity FD step 1.000000e-05
 CAPS Info: Sensitivity FD step 1.000000e-05
 CAPS Info: Sensitivity FD step 1.000000e-05
 CAPS Info: Sensitivity FD step 1.000000e-05

Getting CFD design variables.......
	Number of design variables - 3
	Design Variable name - camber
	Design Variable name - maxloc
	Design Variable name - thickness
	Done getting CFD design variables
 CAPS Info: Sensitivity FD step 1.000000e-05
 CAPS Info: Sensitivity FD step 1.000000e-05
 CAPS Info: Sensitivity FD step 1.000000e-05
 CAPS Info: Sensitivity FD step 1.000000e-05
 CAPS Info: Sensitivity FD step 1.000000e-05

Getting CFD design variables.......
	Number of design variables - 3
	Design Variable name - camber
	Design Variable name - maxloc
	Design Variable name - thickness
	Done getting CFD design variables
 CAPS Info: Sensitivity FD step 1.000000e-05
 CAPS Info: Sensitivity FD step 1.000000e-05
 CAPS Info: Sensitivity FD step 1.000000e-05
 CAPS Info: Sensitivity FD step 1.000000e-05
 CAPS Info: Sensitivity FD step 1.000000e-05

Getting CFD design variables.......
	Number of design variables - 3
	Design Variable name - camber
	Design Variable name - maxloc
	Design Variable name - thickness
	Done getting CFD design variables
 CAPS Info: Sensitivity FD step 1.000000e-05
 CAPS Info: Sensitivity FD step 1.000000e-05
 CAPS Info: Sensitivity FD step 1.000000e-05
 CAPS Info: Sensitivity FD step 1.000000e-05
 CAPS Info: Sensitivity FD step 1.000000e-05

Getting CFD design variables.......
	Number of design variables - 3
	Design Variable name - camber
	Design Variable name - maxloc
	Design Variable name - thickness
	Done getting CFD design variables
 CAPS Info: Sensitivity FD step 1.000000e-05
 CAPS Info: Sensitivity FD step 1.000000e-05
 CAPS Info: Sensitivity FD step 1.000000e-05
 CAPS Info: Sensitivity FD step 1.000000e-05
 CAPS Info: Sensitivity FD step 1.000000e-05

Getting CFD design variables.......
	Number of design variables - 3
	Design Variable name - camber
	Design Variable name - maxloc
	Design Variable name - thickness
	Done getting CFD design variables
 CAPS Info: Sensitivity FD step 1.000000e-05
 CAPS Info: Sensitivity FD step 1.000000e-05
 CAPS Info: Sensitivity FD step 1.000000e-05
 CAPS Info: Sensitivity FD step 1.000000e-05
 CAPS Info: Sensitivity FD step 1.000000e-05

Getting CFD design variables.......
	Number of design variables - 3
	Design Variable name - camber
	Design Variable name - maxloc
	Design Variable name - thickness
	Done getting CFD design variables
 CAPS Info: Sensitivity FD step 1.000000e-05
 CAPS Info: Sensitivity FD step 1.000000e-05
 CAPS Info: Sensitivity FD step 1.000000e-05
 CAPS Info: Sensitivity FD step 1.000000e-05
 CAPS Info: Sensitivity FD step 1.000000e-05

Getting CFD design variables.......
	Number of design variables - 3
	Design Variable name - camber
	Design Variable name - maxloc
	Design Variable name - thickness
	Done getting CFD design variables
 CAPS Info: Sensitivity FD step 1.000000e-05
 CAPS Info: Sensitivity FD step 1.000000e-05
 CAPS Info: Sensitivity FD step 1.000000e-05
 CAPS Info: Sensitivity FD step 1.000000e-05
 CAPS Info: Sensitivity FD step 1.000000e-05

Getting CFD design variables.......
	Number of design variables - 3
	Design Variable name - camber
	Design Variable name - maxloc
	Design Variable name - thickness
	Done getting CFD design variables
 CAPS Info: Sensitivity FD step 1.000000e-05
 CAPS Info: Sensitivity FD step 1.000000e-05
 CAPS Info: Sensitivity FD step 1.000000e-05
 CAPS Info: Sensitivity FD step 1.000000e-05
 CAPS Info: Sensitivity FD step 1.000000e-05

Getting CFD design variables.......
	Number of design variables - 3
	Design Variable name - camber
	Design Variable name - maxloc
	Design Variable name - thickness
	Done getting CFD design variables
 CAPS Info: Sensitivity FD step 1.000000e-05
 CAPS Info: Sensitivity FD step 1.000000e-05
 CAPS Info: Sensitivity FD step 1.000000e-05
 CAPS Info: Sensitivity FD step 1.000000e-05
 CAPS Info: Sensitivity FD step 1.000000e-05

Getting CFD design variables.......
	Number of design variables - 3
	Design Variable name - camber
	Design Variable name - maxloc
	Design Variable name - thickness
	Done getting CFD design variables
 CAPS Info: Sensitivity FD step 1.000000e-05
 CAPS Info: Sensitivity FD step 1.000000e-05
 CAPS Info: Sensitivity FD step 1.000000e-05
 CAPS Info: Sensitivity FD step 1.000000e-05
 CAPS Info: Sensitivity FD step 1.000000e-05

Getting CFD design variables.......
	Number of design variables - 3
	Design Variable name - camber
	Design Variable name - maxloc
	Design Variable name - thickness
	Done getting CFD design variables
 CAPS Info: Sensitivity FD step 1.000000e-05
 CAPS Info: Sensitivity FD step 1.000000e-05
 CAPS Info: Sensitivity FD step 1.000000e-05
 CAPS Info: Sensitivity FD step 1.000000e-05
 CAPS Info: Sensitivity FD step 1.000000e-05

Getting CFD design variables.......
	Number of design variables - 3
	Design Variable name - camber
	Design Variable name - maxloc
	Design Variable name - thickness
	Done getting CFD design variables
 CAPS Info: Sensitivity FD step 1.000000e-05
 CAPS Info: Sensitivity FD step 1.000000e-05
 CAPS Info: Sensitivity FD step 1.000000e-05
 CAPS Info: Sensitivity FD step 1.000000e-05
 CAPS Info: Sensitivity FD step 1.000000e-05

Getting CFD design variables.......
	Number of design variables - 3
	Design Variable name - camber
	Design Variable name - maxloc
	Design Variable name - thickness
	Done getting CFD design variables
 CAPS Info: Sensitivity FD step 1.000000e-05
 CAPS Info: Sensitivity FD step 1.000000e-05
 CAPS Info: Sensitivity FD step 1.000000e-05
 CAPS Info: Sensitivity FD step 1.000000e-05
 CAPS Info: Sensitivity FD step 1.000000e-05

Getting CFD design variables.......
	Number of design variables - 3
	Design Variable name - camber
	Design Variable name - maxloc
	Design Variable name - thickness
	Done getting CFD design variables
 CAPS Info: Sensitivity FD step 1.000000e-05
 CAPS Info: Sensitivity FD step 1.000000e-05
 CAPS Info: Sensitivity FD step 1.000000e-05
 CAPS Info: Sensitivity FD step 1.000000e-05
 CAPS Info: Sensitivity FD step 1.000000e-05

Getting CFD design variables.......
	Number of design variables - 3
	Design Variable name - camber
	Design Variable name - maxloc
	Design Variable name - thickness
	Done getting CFD design variables
 CAPS Info: Sensitivity FD step 1.000000e-05
 CAPS Info: Sensitivity FD step 1.000000e-05
 CAPS Info: Sensitivity FD step 1.000000e-05
 CAPS Info: Sensitivity FD step 1.000000e-05
 CAPS Info: Sensitivity FD step 1.000000e-05

Getting CFD design variables.......
	Number of design variables - 3
	Design Variable name - camber
	Design Variable name - maxloc
	Design Variable name - thickness
	Done getting CFD design variables
 CAPS Info: Sensitivity FD step 1.000000e-05
 CAPS Info: Sensitivity FD step 1.000000e-05
 CAPS Info: Sensitivity FD step 1.000000e-05
 CAPS Info: Sensitivity FD step 1.000000e-05
 CAPS Info: Sensitivity FD step 1.000000e-05
Note: The following floating-point exceptions are signalling: IEEE_INVALID_FLAG IEEE_DIVIDE_BY_ZERO

Getting CFD design variables.......
	Number of design variables - 3
	Design Variable name - camber
	Design Variable name - maxloc
	Design Variable name - thickness
	Done getting CFD design variables
 CAPS Info: Sensitivity FD step 1.000000e-05
 CAPS Info: Sensitivity FD step 1.000000e-05
 CAPS Info: Sensitivity FD step 1.000000e-05
 CAPS Info: Sensitivity FD step 1.000000e-05
 CAPS Info: Sensitivity FD step 1.000000e-05

Getting CFD design variables.......
	Number of design variables - 3
	Design Variable name - camber
	Design Variable name - maxloc
	Design Variable name - thickness
	Done getting CFD design variables
 CAPS Info: Sensitivity FD step 1.000000e-05
 CAPS Info: Sensitivity FD step 1.000000e-05
 CAPS Info: Sensitivity FD step 1.000000e-05
 CAPS Info: Sensitivity FD step 1.000000e-05
 CAPS Info: Sensitivity FD step 1.000000e-05

Getting CFD design variables.......
	Number of design variables - 3
	Design Variable name - camber
	Design Variable name - maxloc
	Design Variable name - thickness
	Done getting CFD design variables
 CAPS Info: Sensitivity FD step 1.000000e-05
 CAPS Info: Sensitivity FD step 1.000000e-05
 CAPS Info: Sensitivity FD step 1.000000e-05
 CAPS Info: Sensitivity FD step 1.000000e-05
 CAPS Info: Sensitivity FD step 1.000000e-05

Getting CFD design variables.......
	Number of design variables - 3
	Design Variable name - camber
	Design Variable name - maxloc
	Design Variable name - thickness
	Done getting CFD design variables
 CAPS Info: Sensitivity FD step 1.000000e-05
 CAPS Info: Sensitivity FD step 1.000000e-05
 CAPS Info: Sensitivity FD step 1.000000e-05
 CAPS Info: Sensitivity FD step 1.000000e-05
 CAPS Info: Sensitivity FD step 1.000000e-05

Getting CFD design variables.......
	Number of design variables - 3
	Design Variable name - camber
	Design Variable name - maxloc
	Design Variable name - thickness
	Done getting CFD design variables
 CAPS Info: Sensitivity FD step 1.000000e-05
 CAPS Info: Sensitivity FD step 1.000000e-05
 CAPS Info: Sensitivity FD step 1.000000e-05
 CAPS Info: Sensitivity FD step 1.000000e-05
 CAPS Info: Sensitivity FD step 1.000000e-05

Getting CFD design variables.......
	Number of design variables - 3
	Design Variable name - camber
	Design Variable name - maxloc
	Design Variable name - thickness
	Done getting CFD design variables
 CAPS Info: Sensitivity FD step 1.000000e-05
 CAPS Info: Sensitivity FD step 1.000000e-05
 CAPS Info: Sensitivity FD step 1.000000e-05
 CAPS Info: Sensitivity FD step 1.000000e-05
 CAPS Info: Sensitivity FD step 1.000000e-05

Getting CFD design variables.......
	Number of design variables - 3
	Design Variable name - camber
	Design Variable name - maxloc
	Design Variable name - thickness
	Done getting CFD design variables
 CAPS Info: Sensitivity FD step 1.000000e-05
 CAPS Info: Sensitivity FD step 1.000000e-05
 CAPS Info: Sensitivity FD step 1.000000e-05
 CAPS Info: Sensitivity FD step 1.000000e-05
 CAPS Info: Sensitivity FD step 1.000000e-05

Getting CFD design variables.......
	Number of design variables - 3
	Design Variable name - camber
	Design Variable name - maxloc
	Design Variable name - thickness
	Done getting CFD design variables
 CAPS Info: Sensitivity FD step 1.000000e-05
 CAPS Info: Sensitivity FD step 1.000000e-05
 CAPS Info: Sensitivity FD step 1.000000e-05
 CAPS Info: Sensitivity FD step 1.000000e-05
 CAPS Info: Sensitivity FD step 1.000000e-05

Getting CFD design variables.......
	Number of design variables - 3
	Design Variable name - camber
	Design Variable name - maxloc
	Design Variable name - thickness
	Done getting CFD design variables
 CAPS Info: Sensitivity FD step 1.000000e-05
 CAPS Info: Sensitivity FD step 1.000000e-05
 CAPS Info: Sensitivity FD step 1.000000e-05
 CAPS Info: Sensitivity FD step 1.000000e-05
 CAPS Info: Sensitivity FD step 1.000000e-05

Getting CFD design variables.......
	Number of design variables - 3
	Design Variable name - camber
	Design Variable name - maxloc
	Design Variable name - thickness
	Done getting CFD design variables
 CAPS Info: Sensitivity FD step 1.000000e-05
 CAPS Info: Sensitivity FD step 1.000000e-05
 CAPS Info: Sensitivity FD step 1.000000e-05
 CAPS Info: Sensitivity FD step 1.000000e-05
 CAPS Info: Sensitivity FD step 1.000000e-05

Getting CFD design variables.......
	Number of design variables - 3
	Design Variable name - camber
	Design Variable name - maxloc
	Design Variable name - thickness
	Done getting CFD design variables
 CAPS Info: Sensitivity FD step 1.000000e-05
 CAPS Info: Sensitivity FD step 1.000000e-05
 CAPS Info: Sensitivity FD step 1.000000e-05
 CAPS Info: Sensitivity FD step 1.000000e-05
 CAPS Info: Sensitivity FD step 1.000000e-05

Getting CFD design variables.......
	Number of design variables - 3
	Design Variable name - camber
	Design Variable name - maxloc
	Design Variable name - thickness
	Done getting CFD design variables
 CAPS Info: Sensitivity FD step 1.000000e-05
 CAPS Info: Sensitivity FD step 1.000000e-05
 CAPS Info: Sensitivity FD step 1.000000e-05
 CAPS Info: Sensitivity FD step 1.000000e-05
 CAPS Info: Sensitivity FD step 1.000000e-05

Getting CFD design variables.......
	Number of design variables - 3
	Design Variable name - camber
	Design Variable name - maxloc
	Design Variable name - thickness
	Done getting CFD design variables
 CAPS Info: Sensitivity FD step 1.000000e-05
 CAPS Info: Sensitivity FD step 1.000000e-05
 CAPS Info: Sensitivity FD step 1.000000e-05
 CAPS Info: Sensitivity FD step 1.000000e-05
 CAPS Info: Sensitivity FD step 1.000000e-05

Getting CFD design variables.......
	Number of design variables - 3
	Design Variable name - camber
	Design Variable name - maxloc
	Design Variable name - thickness
	Done getting CFD design variables
 CAPS Info: Sensitivity FD step 1.000000e-05
 CAPS Info: Sensitivity FD step 1.000000e-05
 CAPS Info: Sensitivity FD step 1.000000e-05
 CAPS Info: Sensitivity FD step 1.000000e-05
 CAPS Info: Sensitivity FD step 1.000000e-05

Getting CFD design variables.......
	Number of design variables - 3
	Design Variable name - camber
	Design Variable name - maxloc
	Design Variable name - thickness
	Done getting CFD design variables
 CAPS Info: Sensitivity FD step 1.000000e-05
 CAPS Info: Sensitivity FD step 1.000000e-05
 CAPS Info: Sensitivity FD step 1.000000e-05
 CAPS Info: Sensitivity FD step 1.000000e-05
 CAPS Info: Sensitivity FD step 1.000000e-05

Getting CFD design variables.......
	Number of design variables - 3
	Design Variable name - camber
	Design Variable name - maxloc
	Design Variable name - thickness
	Done getting CFD design variables
 CAPS Info: Sensitivity FD step 1.000000e-05
 CAPS Info: Sensitivity FD step 1.000000e-05
 CAPS Info: Sensitivity FD step 1.000000e-05
 CAPS Info: Sensitivity FD step 1.000000e-05
 CAPS Info: Sensitivity FD step 1.000000e-05

Getting CFD design variables.......
	Number of design variables - 3
	Design Variable name - camber
	Design Variable name - maxloc
	Design Variable name - thickness
	Done getting CFD design variables
 CAPS Info: Sensitivity FD step 1.000000e-05
 CAPS Info: Sensitivity FD step 1.000000e-05
 CAPS Info: Sensitivity FD step 1.000000e-05
 CAPS Info: Sensitivity FD step 1.000000e-05
 CAPS Info: Sensitivity FD step 1.000000e-05

Getting CFD design variables.......
	Number of design variables - 3
	Design Variable name - camber
	Design Variable name - maxloc
	Design Variable name - thickness
	Done getting CFD design variables
 CAPS Info: Sensitivity FD step 1.000000e-05
 CAPS Info: Sensitivity FD step 1.000000e-05
 CAPS Info: Sensitivity FD step 1.000000e-05
 CAPS Info: Sensitivity FD step 1.000000e-05
 CAPS Info: Sensitivity FD step 1.000000e-05

Getting CFD design variables.......
	Number of design variables - 3
	Design Variable name - camber
	Design Variable name - maxloc
	Design Variable name - thickness
	Done getting CFD design variables
 CAPS Info: Sensitivity FD step 1.000000e-05
 CAPS Info: Sensitivity FD step 1.000000e-05
 CAPS Info: Sensitivity FD step 1.000000e-05
 CAPS Info: Sensitivity FD step 1.000000e-05
 CAPS Info: Sensitivity FD step 1.000000e-05

Getting CFD design variables.......
	Number of design variables - 3
	Design Variable name - camber
	Design Variable name - maxloc
	Design Variable name - thickness
	Done getting CFD design variables
 CAPS Info: Sensitivity FD step 1.000000e-05
 CAPS Info: Sensitivity FD step 1.000000e-05
 CAPS Info: Sensitivity FD step 1.000000e-05
 CAPS Info: Sensitivity FD step 1.000000e-05
 CAPS Info: Sensitivity FD step 1.000000e-05

Getting CFD design variables.......
	Number of design variables - 3
	Design Variable name - camber
	Design Variable name - maxloc
	Design Variable name - thickness
	Done getting CFD design variables
 CAPS Info: Sensitivity FD step 1.000000e-05
 CAPS Info: Sensitivity FD step 1.000000e-05
 CAPS Info: Sensitivity FD step 1.000000e-05
 CAPS Info: Sensitivity FD step 1.000000e-05
 CAPS Info: Sensitivity FD step 1.000000e-05

Getting CFD design variables.......
	Number of design variables - 3
	Design Variable name - camber
	Design Variable name - maxloc
	Design Variable name - thickness
	Done getting CFD design variables
 CAPS Info: Sensitivity FD step 1.000000e-05
 CAPS Info: Sensitivity FD step 1.000000e-05
 CAPS Info: Sensitivity FD step 1.000000e-05
 CAPS Info: Sensitivity FD step 1.000000e-05
 CAPS Info: Sensitivity FD step 1.000000e-05

Getting CFD design variables.......
	Number of design variables - 3
	Design Variable name - camber
	Design Variable name - maxloc
	Design Variable name - thickness
	Done getting CFD design variables
 CAPS Info: Sensitivity FD step 1.000000e-05
 CAPS Info: Sensitivity FD step 1.000000e-05
 CAPS Info: Sensitivity FD step 1.000000e-05
 CAPS Info: Sensitivity FD step 1.000000e-05
 CAPS Info: Sensitivity FD step 1.000000e-05

Getting CFD design variables.......
	Number of design variables - 3
	Design Variable name - camber
	Design Variable name - maxloc
	Design Variable name - thickness
	Done getting CFD design variables
 CAPS Info: Sensitivity FD step 1.000000e-05
 CAPS Info: Sensitivity FD step 1.000000e-05
 CAPS Info: Sensitivity FD step 1.000000e-05
 CAPS Info: Sensitivity FD step 1.000000e-05
 CAPS Info: Sensitivity FD step 1.000000e-05

Getting CFD design variables.......
	Number of design variables - 3
	Design Variable name - camber
	Design Variable name - maxloc
	Design Variable name - thickness
	Done getting CFD design variables
 CAPS Info: Sensitivity FD step 1.000000e-05
 CAPS Info: Sensitivity FD step 1.000000e-05
 CAPS Info: Sensitivity FD step 1.000000e-05
 CAPS Info: Sensitivity FD step 1.000000e-05
 CAPS Info: Sensitivity FD step 1.000000e-05

Getting CFD design variables.......
	Number of design variables - 3
	Design Variable name - camber
	Design Variable name - maxloc
	Design Variable name - thickness
	Done getting CFD design variables
 CAPS Info: Sensitivity FD step 1.000000e-05
 CAPS Info: Sensitivity FD step 1.000000e-05
 CAPS Info: Sensitivity FD step 1.000000e-05
 CAPS Info: Sensitivity FD step 1.000000e-05
 CAPS Info: Sensitivity FD step 1.000000e-05

Getting CFD design variables.......
	Number of design variables - 3
	Design Variable name - camber
	Design Variable name - maxloc
	Design Variable name - thickness
	Done getting CFD design variables
 CAPS Info: Sensitivity FD step 1.000000e-05
 CAPS Info: Sensitivity FD step 1.000000e-05
 CAPS Info: Sensitivity FD step 1.000000e-05
 CAPS Info: Sensitivity FD step 1.000000e-05
 CAPS Info: Sensitivity FD step 1.000000e-05

Getting CFD design variables.......
	Number of design variables - 3
	Design Variable name - camber
	Design Variable name - maxloc
	Design Variable name - thickness
	Done getting CFD design variables
 CAPS Info: Sensitivity FD step 1.000000e-05
 CAPS Info: Sensitivity FD step 1.000000e-05
 CAPS Info: Sensitivity FD step 1.000000e-05
 CAPS Info: Sensitivity FD step 1.000000e-05
 CAPS Info: Sensitivity FD step 1.000000e-05

Getting CFD design variables.......
	Number of design variables - 3
	Design Variable name - camber
	Design Variable name - maxloc
	Design Variable name - thickness
	Done getting CFD design variables
 CAPS Info: Sensitivity FD step 1.000000e-05
 CAPS Info: Sensitivity FD step 1.000000e-05
 CAPS Info: Sensitivity FD step 1.000000e-05
 CAPS Info: Sensitivity FD step 1.000000e-05
 CAPS Info: Sensitivity FD step 1.000000e-05

Getting CFD design variables.......
	Number of design variables - 3
	Design Variable name - camber
	Design Variable name - maxloc
	Design Variable name - thickness
	Done getting CFD design variables
 CAPS Info: Sensitivity FD step 1.000000e-05
 CAPS Info: Sensitivity FD step 1.000000e-05
 CAPS Info: Sensitivity FD step 1.000000e-05
 CAPS Info: Sensitivity FD step 1.000000e-05
 CAPS Info: Sensitivity FD step 1.000000e-05

Getting CFD design variables.......
	Number of design variables - 3
	Design Variable name - camber
	Design Variable name - maxloc
	Design Variable name - thickness
	Done getting CFD design variables
 CAPS Info: Sensitivity FD step 1.000000e-05
 CAPS Info: Sensitivity FD step 1.000000e-05
 CAPS Info: Sensitivity FD step 1.000000e-05
 CAPS Info: Sensitivity FD step 1.000000e-05
 CAPS Info: Sensitivity FD step 1.000000e-05

Getting CFD design variables.......
	Number of design variables - 3
	Design Variable name - camber
	Design Variable name - maxloc
	Design Variable name - thickness
	Done getting CFD design variables
 CAPS Info: Sensitivity FD step 1.000000e-05
 CAPS Info: Sensitivity FD step 1.000000e-05
 CAPS Info: Sensitivity FD step 1.000000e-05
 CAPS Info: Sensitivity FD step 1.000000e-05
 CAPS Info: Sensitivity FD step 1.000000e-05

Getting CFD design variables.......
	Number of design variables - 3
	Design Variable name - camber
	Design Variable name - maxloc
	Design Variable name - thickness
	Done getting CFD design variables
 CAPS Info: Sensitivity FD step 1.000000e-05
 CAPS Info: Sensitivity FD step 1.000000e-05
 CAPS Info: Sensitivity FD step 1.000000e-05
 CAPS Info: Sensitivity FD step 1.000000e-05
 CAPS Info: Sensitivity FD step 1.000000e-05

Getting CFD design variables.......
	Number of design variables - 3
	Design Variable name - camber
	Design Variable name - maxloc
	Design Variable name - thickness
	Done getting CFD design variables
 CAPS Info: Sensitivity FD step 1.000000e-05
 CAPS Info: Sensitivity FD step 1.000000e-05
 CAPS Info: Sensitivity FD step 1.000000e-05
 CAPS Info: Sensitivity FD step 1.000000e-05
 CAPS Info: Sensitivity FD step 1.000000e-05

Getting CFD design variables.......
	Number of design variables - 3
	Design Variable name - camber
	Design Variable name - maxloc
	Design Variable name - thickness
	Done getting CFD design variables
 CAPS Info: Sensitivity FD step 1.000000e-05
 CAPS Info: Sensitivity FD step 1.000000e-05
 CAPS Info: Sensitivity FD step 1.000000e-05
 CAPS Info: Sensitivity FD step 1.000000e-05
 CAPS Info: Sensitivity FD step 1.000000e-05

Getting CFD design variables.......
	Number of design variables - 3
	Design Variable name - camber
	Design Variable name - maxloc
	Design Variable name - thickness
	Done getting CFD design variables
 CAPS Info: Sensitivity FD step 1.000000e-05
 CAPS Info: Sensitivity FD step 1.000000e-05
 CAPS Info: Sensitivity FD step 1.000000e-05
 CAPS Info: Sensitivity FD step 1.000000e-05
 CAPS Info: Sensitivity FD step 1.000000e-05

Getting CFD design variables.......
	Number of design variables - 3
	Design Variable name - camber
	Design Variable name - maxloc
	Design Variable name - thickness
	Done getting CFD design variables
 CAPS Info: Sensitivity FD step 1.000000e-05
 CAPS Info: Sensitivity FD step 1.000000e-05
 CAPS Info: Sensitivity FD step 1.000000e-05
 CAPS Info: Sensitivity FD step 1.000000e-05
 CAPS Info: Sensitivity FD step 1.000000e-05

Getting CFD design variables.......
	Number of design variables - 3
	Design Variable name - camber
	Design Variable name - maxloc
	Design Variable name - thickness
	Done getting CFD design variables
 CAPS Info: Sensitivity FD step 1.000000e-05
 CAPS Info: Sensitivity FD step 1.000000e-05
 CAPS Info: Sensitivity FD step 1.000000e-05
 CAPS Info: Sensitivity FD step 1.000000e-05
 CAPS Info: Sensitivity FD step 1.000000e-05

Getting CFD design variables.......
	Number of design variables - 3
	Design Variable name - camber
	Design Variable name - maxloc
	Design Variable name - thickness
	Done getting CFD design variables
 CAPS Info: Sensitivity FD step 1.000000e-05
 CAPS Info: Sensitivity FD step 1.000000e-05
 CAPS Info: Sensitivity FD step 1.000000e-05
 CAPS Info: Sensitivity FD step 1.000000e-05
 CAPS Info: Sensitivity FD step 1.000000e-05

Getting CFD design variables.......
	Number of design variables - 3
	Design Variable name - camber
	Design Variable name - maxloc
	Design Variable name - thickness
	Done getting CFD design variables
 CAPS Info: Sensitivity FD step 1.000000e-05
 CAPS Info: Sensitivity FD step 1.000000e-05
 CAPS Info: Sensitivity FD step 1.000000e-05
 CAPS Info: Sensitivity FD step 1.000000e-05
 CAPS Info: Sensitivity FD step 1.000000e-05

Getting CFD design variables.......
	Number of design variables - 3
	Design Variable name - camber
	Design Variable name - maxloc
	Design Variable name - thickness
	Done getting CFD design variables
 CAPS Info: Sensitivity FD step 1.000000e-05
 CAPS Info: Sensitivity FD step 1.000000e-05
 CAPS Info: Sensitivity FD step 1.000000e-05
 CAPS Info: Sensitivity FD step 1.000000e-05
 CAPS Info: Sensitivity FD step 1.000000e-05

Getting CFD design variables.......
	Number of design variables - 3
	Design Variable name - camber
	Design Variable name - maxloc
	Design Variable name - thickness
	Done getting CFD design variables
 CAPS Info: Sensitivity FD step 1.000000e-05
 CAPS Info: Sensitivity FD step 1.000000e-05
 CAPS Info: Sensitivity FD step 1.000000e-05
 CAPS Info: Sensitivity FD step 1.000000e-05
 CAPS Info: Sensitivity FD step 1.000000e-05
The system cannot execute the specified program.

Getting CFD design variables.......
	Number of design variables - 3
	Design Variable name - camber
	Design Variable name - maxloc
	Design Variable name - thickness
	Done getting CFD design variables
 CAPS Info: Sensitivity FD step 1.000000e-05
 CAPS Info: Sensitivity FD step 1.000000e-05
 CAPS Info: Sensitivity FD step 1.000000e-05
 CAPS Info: Sensitivity FD step 1.000000e-05
 CAPS Info: Sensitivity FD step 1.000000e-05
The system cannot execute the specified program.

Getting CFD design variables.......
	Number of design variables - 3
	Design Variable name - camber
	Design Variable name - maxloc
	Design Variable name - thickness
	Done getting CFD design variables
 CAPS Info: Sensitivity FD step 1.000000e-05
 CAPS Info: Sensitivity FD step 1.000000e-05
 CAPS Info: Sensitivity FD step 1.000000e-05
 CAPS Info: Sensitivity FD step 1.000000e-05
 CAPS Info: Sensitivity FD step 1.000000e-05
The system cannot execute the specified program.

Getting CFD design variables.......
	Number of design variables - 3
	Design Variable name - camber
	Design Variable name - maxloc
	Design Variable name - thickness
	Done getting CFD design variables
 CAPS Info: Sensitivity FD step 1.000000e-05
 CAPS Info: Sensitivity FD step 1.000000e-05
 CAPS Info: Sensitivity FD step 1.000000e-05
 CAPS Info: Sensitivity FD step 1.000000e-05
 CAPS Info: Sensitivity FD step 1.000000e-05
The system cannot execute the specified program.

Getting CFD design variables.......
	Number of design variables - 3
	Design Variable name - camber
	Design Variable name - maxloc
	Design Variable name - thickness
	Done getting CFD design variables
 CAPS Info: Sensitivity FD step 1.000000e-05
 CAPS Info: Sensitivity FD step 1.000000e-05
 CAPS Info: Sensitivity FD step 1.000000e-05
 CAPS Info: Sensitivity FD step 1.000000e-05
 CAPS Info: Sensitivity FD step 1.000000e-05
The system cannot execute the specified program.

Getting CFD design variables.......
	Number of design variables - 3
	Design Variable name - camber
	Design Variable name - maxloc
	Design Variable name - thickness
	Done getting CFD design variables
 CAPS Info: Sensitivity FD step 1.000000e-05
 CAPS Info: Sensitivity FD step 1.000000e-05
 CAPS Info: Sensitivity FD step 1.000000e-05
 CAPS Info: Sensitivity FD step 1.000000e-05
 CAPS Info: Sensitivity FD step 1.000000e-05

Getting CFD design variables.......
	Number of design variables - 3
	Design Variable name - camber
	Design Variable name - maxloc
	Design Variable name - thickness
	Done getting CFD design variables
 CAPS Info: Sensitivity FD step 1.000000e-05
 CAPS Info: Sensitivity FD step 1.000000e-05
 CAPS Info: Sensitivity FD step 1.000000e-05
 CAPS Info: Sensitivity FD step 1.000000e-05
 CAPS Info: Sensitivity FD step 1.000000e-05

Getting CFD design variables.......
	Number of design variables - 3
	Design Variable name - camber
	Design Variable name - maxloc
	Design Variable name - thickness
	Done getting CFD design variables
 CAPS Info: Sensitivity FD step 1.000000e-05
 CAPS Info: Sensitivity FD step 1.000000e-05
 CAPS Info: Sensitivity FD step 1.000000e-05
 CAPS Info: Sensitivity FD step 1.000000e-05
 CAPS Info: Sensitivity FD step 1.000000e-05

Getting CFD design variables.......
	Number of design variables - 3
	Design Variable name - camber
	Design Variable name - maxloc
	Design Variable name - thickness
	Done getting CFD design variables
 CAPS Info: Sensitivity FD step 1.000000e-05
 CAPS Info: Sensitivity FD step 1.000000e-05
 CAPS Info: Sensitivity FD step 1.000000e-05
 CAPS Info: Sensitivity FD step 1.000000e-05
 CAPS Info: Sensitivity FD step 1.000000e-05

Getting CFD design variables.......
	Number of design variables - 3
	Design Variable name - camber
	Design Variable name - maxloc
	Design Variable name - thickness
	Done getting CFD design variables
 CAPS Info: Sensitivity FD step 1.000000e-05
 CAPS Info: Sensitivity FD step 1.000000e-05
 CAPS Info: Sensitivity FD step 1.000000e-05
 CAPS Info: Sensitivity FD step 1.000000e-05
 CAPS Info: Sensitivity FD step 1.000000e-05
The system cannot execute the specified program.

Getting CFD design variables.......
	Number of design variables - 3
	Design Variable name - camber
	Design Variable name - maxloc
	Design Variable name - thickness
	Done getting CFD design variables
 CAPS Info: Sensitivity FD step 1.000000e-05
 CAPS Info: Sensitivity FD step 1.000000e-05
 CAPS Info: Sensitivity FD step 1.000000e-05
 CAPS Info: Sensitivity FD step 1.000000e-05
 CAPS Info: Sensitivity FD step 1.000000e-05

Getting CFD design variables.......
	Number of design variables - 3
	Design Variable name - camber
	Design Variable name - maxloc
	Design Variable name - thickness
	Done getting CFD design variables
 CAPS Info: Sensitivity FD step 1.000000e-05
 CAPS Info: Sensitivity FD step 1.000000e-05
 CAPS Info: Sensitivity FD step 1.000000e-05
 CAPS Info: Sensitivity FD step 1.000000e-05
 CAPS Info: Sensitivity FD step 1.000000e-05
The system cannot execute the specified program.

Getting CFD design variables.......
	Number of design variables - 3
	Design Variable name - camber
	Design Variable name - maxloc
	Design Variable name - thickness
	Done getting CFD design variables
 CAPS Info: Sensitivity FD step 1.000000e-05
 CAPS Info: Sensitivity FD step 1.000000e-05
 CAPS Info: Sensitivity FD step 1.000000e-05
 CAPS Info: Sensitivity FD step 1.000000e-05
 CAPS Info: Sensitivity FD step 1.000000e-05
The system cannot execute the specified program.

Getting CFD design variables.......
	Number of design variables - 3
	Design Variable name - camber
	Design Variable name - maxloc
	Design Variable name - thickness
	Done getting CFD design variables
 CAPS Info: Sensitivity FD step 1.000000e-05
 CAPS Info: Sensitivity FD step 1.000000e-05
 CAPS Info: Sensitivity FD step 1.000000e-05
 CAPS Info: Sensitivity FD step 1.000000e-05
 CAPS Info: Sensitivity FD step 1.000000e-05

Getting CFD design variables.......
	Number of design variables - 3
	Design Variable name - camber
	Design Variable name - maxloc
	Design Variable name - thickness
	Done getting CFD design variables
 CAPS Info: Sensitivity FD step 1.000000e-05
 CAPS Info: Sensitivity FD step 1.000000e-05
 CAPS Info: Sensitivity FD step 1.000000e-05
 CAPS Info: Sensitivity FD step 1.000000e-05
 CAPS Info: Sensitivity FD step 1.000000e-05
The system cannot execute the specified program.

Getting CFD design variables.......
	Number of design variables - 3
	Design Variable name - camber
	Design Variable name - maxloc
	Design Variable name - thickness
	Done getting CFD design variables
 CAPS Info: Sensitivity FD step 1.000000e-05
 CAPS Info: Sensitivity FD step 1.000000e-05
 CAPS Info: Sensitivity FD step 1.000000e-05
 CAPS Info: Sensitivity FD step 1.000000e-05
 CAPS Info: Sensitivity FD step 1.000000e-05
The system cannot execute the specified program.

Getting CFD design variables.......
	Number of design variables - 3
	Design Variable name - camber
	Design Variable name - maxloc
	Design Variable name - thickness
	Done getting CFD design variables
 CAPS Info: Sensitivity FD step 1.000000e-05
 CAPS Info: Sensitivity FD step 1.000000e-05
 CAPS Info: Sensitivity FD step 1.000000e-05
 CAPS Info: Sensitivity FD step 1.000000e-05
 CAPS Info: Sensitivity FD step 1.000000e-05
The system cannot execute the specified program.

Getting CFD design variables.......
	Number of design variables - 3
	Design Variable name - camber
	Design Variable name - maxloc
	Design Variable name - thickness
	Done getting CFD design variables
 CAPS Info: Sensitivity FD step 1.000000e-05
 CAPS Info: Sensitivity FD step 1.000000e-05
 CAPS Info: Sensitivity FD step 1.000000e-05
 CAPS Info: Sensitivity FD step 1.000000e-05
 CAPS Info: Sensitivity FD step 1.000000e-05
The system cannot execute the specified program.

Getting CFD design variables.......
	Number of design variables - 3
	Design Variable name - camber
	Design Variable name - maxloc
	Design Variable name - thickness
	Done getting CFD design variables
 CAPS Info: Sensitivity FD step 1.000000e-05
 CAPS Info: Sensitivity FD step 1.000000e-05
 CAPS Info: Sensitivity FD step 1.000000e-05
 CAPS Info: Sensitivity FD step 1.000000e-05
 CAPS Info: Sensitivity FD step 1.000000e-05

Getting CFD design variables.......
	Number of design variables - 3
	Design Variable name - camber
	Design Variable name - maxloc
	Design Variable name - thickness
	Done getting CFD design variables
 CAPS Info: Sensitivity FD step 1.000000e-05
 CAPS Info: Sensitivity FD step 1.000000e-05
 CAPS Info: Sensitivity FD step 1.000000e-05
 CAPS Info: Sensitivity FD step 1.000000e-05
 CAPS Info: Sensitivity FD step 1.000000e-05

Getting CFD design variables.......
	Number of design variables - 3
	Design Variable name - camber
	Design Variable name - maxloc
	Design Variable name - thickness
	Done getting CFD design variables
 CAPS Info: Sensitivity FD step 1.000000e-05
 CAPS Info: Sensitivity FD step 1.000000e-05
 CAPS Info: Sensitivity FD step 1.000000e-05
 CAPS Info: Sensitivity FD step 1.000000e-05
 CAPS Info: Sensitivity FD step 1.000000e-05
The system cannot execute the specified program.

Getting CFD design variables.......
	Number of design variables - 3
	Design Variable name - camber
	Design Variable name - maxloc
	Design Variable name - thickness
	Done getting CFD design variables
 CAPS Info: Sensitivity FD step 1.000000e-05
 CAPS Info: Sensitivity FD step 1.000000e-05
 CAPS Info: Sensitivity FD step 1.000000e-05
 CAPS Info: Sensitivity FD step 1.000000e-05
 CAPS Info: Sensitivity FD step 1.000000e-05
The system cannot execute the specified program.

Getting CFD design variables.......
	Number of design variables - 3
	Design Variable name - camber
	Design Variable name - maxloc
	Design Variable name - thickness
	Done getting CFD design variables
 CAPS Info: Sensitivity FD step 1.000000e-05
 CAPS Info: Sensitivity FD step 1.000000e-05
 CAPS Info: Sensitivity FD step 1.000000e-05
 CAPS Info: Sensitivity FD step 1.000000e-05
 CAPS Info: Sensitivity FD step 1.000000e-05

Getting CFD design variables.......
	Number of design variables - 3
	Design Variable name - camber
	Design Variable name - maxloc
	Design Variable name - thickness
	Done getting CFD design variables
ERROR:: MALLOC PROBLEM for rpn (called from str2vals:62053)
ERROR:: problem evaluating argument 1 ($params) for Branch 1 (dimension)
ERROR:: MALLOC PROBLEM for rpn (called from str2vals:62053)
ERROR:: problem evaluating argument 2 (0.10) for Branch 2 (set)
ERROR:: MALLOC PROBLEM for rpn (called from str2vals:62053)
ERROR:: problem evaluating argument 2 (sqrt(area*aspect)) for Branch 3 (set)
ERROR:: MALLOC PROBLEM for rpn (called from str2vals:62053)
ERROR:: problem evaluating argument 2 (area/span*2/(taper+1)) for Branch 4 (set)
ERROR:: MALLOC PROBLEM for rpn (called from str2vals:62053)
ERROR:: problem evaluating argument 2 (croot*taper) for Branch 5 (set)
ERROR:: MALLOC PROBLEM for rpn (called from str2vals:62053)
ERROR:: problem evaluating argument 2 ((croot-ctip)/2) for Branch 6 (set)
ERROR:: MALLOC PROBLEM for rpn (called from str2vals:62053)
ERROR:: problem evaluating argument 1 (view:MSES) for Branch 7 (ifthen)
ERROR:: MALLOC PROBLEM for rpn (called from str2vals:62053)
ERROR:: problem evaluating argument 1 ($naca) for Branch 9 (udparg)
ERROR:: MALLOC PROBLEM for rpn (called from str2vals:62053)
ERROR:: problem evaluating argument 1 ($naca) for Branch 10 (udparg)
ERROR:: MALLOC PROBLEM for rpn (called from str2vals:62053)
ERROR:: problem evaluating argument 1 ($naca) for Branch 11 (udparg)
ERROR:: MALLOC PROBLEM for rpn (called from str2vals:62053)
ERROR:: problem evaluating argument 1 ($naca) for Branch 12 (udparg)
ERROR:: MALLOC PROBLEM for rpn (called from str2vals:62053)
ERROR:: problem evaluating argument 1 ($naca) for Branch 13 (udprim)
ERROR:: MALLOC PROBLEM for rpn (called from str2vals:62053)
ERROR:: problem evaluating argument 1 (90) for Branch 14 (rotatex)
ERROR:: MALLOC PROBLEM for rpn (called from str2vals:62053)
ERROR:: problem evaluating argument 1 (ctip) for Branch 15 (scale)
ERROR:: MALLOC PROBLEM for rpn (called from str2vals:62053)
ERROR:: problem evaluating argument 1 (xtip) for Branch 16 (translate)
ERROR:: MALLOC PROBLEM for rpn (called from str2vals:62053)
ERROR:: problem evaluating argument 1 ($wing) for Branch 17 (store)
ERROR:: MALLOC PROBLEM for rpn (called from str2vals:62053)
ERROR:: problem evaluating argument 1 ($naca) for Branch 18 (udparg)
ERROR:: MALLOC PROBLEM for rpn (called from str2vals:62053)
ERROR:: problem evaluating argument 1 ($naca) for Branch 19 (udparg)
ERROR:: MALLOC PROBLEM for rpn (called from str2vals:62053)
ERROR:: problem evaluating argument 1 ($naca) for Branch 20 (udparg)
ERROR:: MALLOC PROBLEM for rpn (called from str2vals:62053)
ERROR:: problem evaluating argument 1 ($naca) for Branch 21 (udparg)
ERROR:: MALLOC PROBLEM for rpn (called from str2vals:62053)
ERROR:: problem evaluating argument 1 ($naca) for Branch 22 (udprim)
ERROR:: MALLOC PROBLEM for rpn (called from str2vals:62053)
ERROR:: problem evaluating argument 1 (90) for Branch 23 (rotatex)
ERROR:: MALLOC PROBLEM for rpn (called from str2vals:62053)
ERROR:: problem evaluating argument 1 (croot) for Branch 24 (scale)
ERROR:: MALLOC PROBLEM for rpn (called from str2vals:62053)
ERROR:: problem evaluating argument 1 ($wing) for Branch 25 (store)
ERROR:: MALLOC PROBLEM for rpn (called from str2vals:62053)
ERROR:: problem evaluating argument 1 ($naca) for Branch 26 (udparg)
ERROR:: MALLOC PROBLEM for rpn (called from str2vals:62053)
ERROR:: problem evaluating argument 1 ($naca) for Branch 27 (udparg)
ERROR:: MALLOC PROBLEM for rpn (called from str2vals:62053)
ERROR:: problem evaluating argument 1 ($naca) for Branch 28 (udparg)
ERROR:: MALLOC PROBLEM for rpn (called from str2vals:62053)
ERROR:: problem evaluating argument 1 ($naca) for Branch 29 (udparg)
ERROR:: MALLOC PROBLEM for rpn (called from str2vals:62053)
ERROR:: problem evaluating argument 1 ($naca) for Branch 30 (udprim)
ERROR:: MALLOC PROBLEM for rpn (called from str2vals:62053)
ERROR:: problem evaluating argument 1 (90) for Branch 31 (rotatex)
ERROR:: MALLOC PROBLEM for rpn (called from str2vals:62053)
ERROR:: problem evaluating argument 1 (ctip) for Branch 32 (scale)
ERROR:: MALLOC PROBLEM for rpn (called from str2vals:62053)
ERROR:: problem evaluating argument 1 (xtip) for Branch 33 (translate)
ERROR:: MALLOC PROBLEM for rpn (called from str2vals:62053)
ERROR:: problem evaluating argument 1 ($wing) for Branch 34 (store)
ERROR:: MALLOC PROBLEM for rpn (called from str2vals:62053)
ERROR:: problem evaluating argument 1 (0) for Branch 35 (rule)
ERROR:: MALLOC PROBLEM for rpn (called from str2vals:62053)
ERROR:: problem evaluating argument 1 ($tessBody) for Branch 36 (store)
ERROR:: MALLOC PROBLEM for rpn (called from str2vals:62053)
ERROR:: problem evaluating argument 1 ($tessBody) for Branch 37 (restore)
ERROR:: MALLOC PROBLEM for rpn (called from str2vals:62053)
ERROR:: problem evaluating argument 1 ($naca) for Branch 39 (udparg)
ERROR:: MALLOC PROBLEM for rpn (called from str2vals:62053)
ERROR:: problem evaluating argument 1 ($naca) for Branch 40 (udparg)
ERROR:: MALLOC PROBLEM for rpn (called from str2vals:62053)
ERROR:: problem evaluating argument 1 ($naca) for Branch 41 (udparg)
ERROR:: MALLOC PROBLEM for rpn (called from str2vals:62053)
ERROR:: problem evaluating argument 1 ($naca) for Branch 42 (udparg)
ERROR:: MALLOC PROBLEM for rpn (called from str2vals:62053)
ERROR:: problem evaluating argument 1 ($naca) for Branch 43 (udprim)
 CAPS Info: camber[1,1] build sensitivity status = -900

Getting CFD design variables.......
	Number of design variables - 3
	Design Variable name - camber
	Design Variable name - maxloc
	Design Variable name - thickness
	Done getting CFD design variables
 CAPS Info: Sensitivity FD step 1.000000e-05
 CAPS Info: Sensitivity FD step 1.000000e-05
 CAPS Info: Sensitivity FD step 1.000000e-05
 CAPS Info: Sensitivity FD step 1.000000e-05
 CAPS Info: Sensitivity FD step 1.000000e-05
The system cannot execute the specified program.

Getting CFD design variables.......
	Number of design variables - 3
	Design Variable name - camber
	Design Variable name - maxloc
	Design Variable name - thickness
	Done getting CFD design variables
ERROR:: MALLOC PROBLEM for rpn (called from str2vals:62053)
ERROR:: problem evaluating argument 3 (thickness) for Branch 39 (udparg)
ERROR:: MALLOC PROBLEM for rpn (called from str2vals:62053)
ERROR:: problem evaluating argument 1 ($params) for Branch 1 (dimension)
ERROR:: MALLOC PROBLEM for rpn (called from str2vals:62053)
ERROR:: problem evaluating argument 2 (0.10) for Branch 2 (set)
ERROR:: MALLOC PROBLEM for rpn (called from str2vals:62053)
ERROR:: problem evaluating argument 2 (sqrt(area*aspect)) for Branch 3 (set)
ERROR:: MALLOC PROBLEM for rpn (called from str2vals:62053)
ERROR:: problem evaluating argument 2 (area/span*2/(taper+1)) for Branch 4 (set)
ERROR:: MALLOC PROBLEM for rpn (called from str2vals:62053)
ERROR:: problem evaluating argument 2 (croot*taper) for Branch 5 (set)
ERROR:: MALLOC PROBLEM for rpn (called from str2vals:62053)
ERROR:: problem evaluating argument 2 ((croot-ctip)/2) for Branch 6 (set)
ERROR:: MALLOC PROBLEM for rpn (called from str2vals:62053)
ERROR:: problem evaluating argument 1 (view:MSES) for Branch 7 (ifthen)
ERROR:: MALLOC PROBLEM for rpn (called from str2vals:62053)
ERROR:: problem evaluating argument 1 ($naca) for Branch 9 (udparg)
ERROR:: MALLOC PROBLEM for rpn (called from str2vals:62053)
ERROR:: problem evaluating argument 1 ($naca) for Branch 10 (udparg)
ERROR:: MALLOC PROBLEM for rpn (called from str2vals:62053)
ERROR:: problem evaluating argument 1 ($naca) for Branch 11 (udparg)
ERROR:: MALLOC PROBLEM for rpn (called from str2vals:62053)
ERROR:: problem evaluating argument 1 ($naca) for Branch 12 (udparg)
ERROR:: MALLOC PROBLEM for rpn (called from str2vals:62053)
ERROR:: problem evaluating argument 1 ($naca) for Branch 13 (udprim)
ERROR:: MALLOC PROBLEM for rpn (called from str2vals:62053)
ERROR:: problem evaluating argument 1 (90) for Branch 14 (rotatex)
ERROR:: MALLOC PROBLEM for rpn (called from str2vals:62053)
ERROR:: problem evaluating argument 1 (ctip) for Branch 15 (scale)
ERROR:: MALLOC PROBLEM for rpn (called from str2vals:62053)
ERROR:: problem evaluating argument 1 (xtip) for Branch 16 (translate)
ERROR:: MALLOC PROBLEM for rpn (called from str2vals:62053)
ERROR:: problem evaluating argument 1 ($wing) for Branch 17 (store)
ERROR:: MALLOC PROBLEM for rpn (called from str2vals:62053)
ERROR:: problem evaluating argument 1 ($naca) for Branch 18 (udparg)
ERROR:: MALLOC PROBLEM for rpn (called from str2vals:62053)
ERROR:: problem evaluating argument 1 ($naca) for Branch 19 (udparg)
ERROR:: MALLOC PROBLEM for rpn (called from str2vals:62053)
ERROR:: problem evaluating argument 1 ($naca) for Branch 20 (udparg)
ERROR:: MALLOC PROBLEM for rpn (called from str2vals:62053)
ERROR:: problem evaluating argument 1 ($naca) for Branch 21 (udparg)
ERROR:: MALLOC PROBLEM for rpn (called from str2vals:62053)
ERROR:: problem evaluating argument 1 ($naca) for Branch 22 (udprim)
ERROR:: MALLOC PROBLEM for rpn (called from str2vals:62053)
ERROR:: problem evaluating argument 1 (90) for Branch 23 (rotatex)
ERROR:: MALLOC PROBLEM for rpn (called from str2vals:62053)
ERROR:: problem evaluating argument 1 (croot) for Branch 24 (scale)
ERROR:: MALLOC PROBLEM for rpn (called from str2vals:62053)
ERROR:: problem evaluating argument 1 ($wing) for Branch 25 (store)
ERROR:: MALLOC PROBLEM for rpn (called from str2vals:62053)
ERROR:: problem evaluating argument 1 ($naca) for Branch 26 (udparg)
ERROR:: MALLOC PROBLEM for rpn (called from str2vals:62053)
ERROR:: problem evaluating argument 1 ($naca) for Branch 27 (udparg)
ERROR:: MALLOC PROBLEM for rpn (called from str2vals:62053)
ERROR:: problem evaluating argument 1 ($naca) for Branch 28 (udparg)
ERROR:: MALLOC PROBLEM for rpn (called from str2vals:62053)
ERROR:: problem evaluating argument 1 ($naca) for Branch 29 (udparg)
ERROR:: MALLOC PROBLEM for rpn (called from str2vals:62053)
ERROR:: problem evaluating argument 1 ($naca) for Branch 30 (udprim)
ERROR:: MALLOC PROBLEM for rpn (called from str2vals:62053)
ERROR:: problem evaluating argument 1 (90) for Branch 31 (rotatex)
ERROR:: MALLOC PROBLEM for rpn (called from str2vals:62053)
ERROR:: problem evaluating argument 1 (ctip) for Branch 32 (scale)
ERROR:: MALLOC PROBLEM for rpn (called from str2vals:62053)
ERROR:: problem evaluating argument 1 (xtip) for Branch 33 (translate)
ERROR:: MALLOC PROBLEM for rpn (called from str2vals:62053)
ERROR:: problem evaluating argument 1 ($wing) for Branch 34 (store)
ERROR:: MALLOC PROBLEM for rpn (called from str2vals:62053)
ERROR:: problem evaluating argument 1 (0) for Branch 35 (rule)
ERROR:: MALLOC PROBLEM for rpn (called from str2vals:62053)
ERROR:: problem evaluating argument 1 ($tessBody) for Branch 36 (store)
ERROR:: MALLOC PROBLEM for rpn (called from str2vals:62053)
ERROR:: problem evaluating argument 1 ($tessBody) for Branch 37 (restore)
ERROR:: MALLOC PROBLEM for rpn (called from str2vals:62053)
ERROR:: problem evaluating argument 1 ($naca) for Branch 39 (udparg)
ERROR:: MALLOC PROBLEM for rpn (called from str2vals:62053)
ERROR:: problem evaluating argument 1 ($naca) for Branch 40 (udparg)
ERROR:: MALLOC PROBLEM for rpn (called from str2vals:62053)
ERROR:: problem evaluating argument 1 ($naca) for Branch 41 (udparg)
ERROR:: MALLOC PROBLEM for rpn (called from str2vals:62053)
ERROR:: problem evaluating argument 1 ($naca) for Branch 42 (udparg)
ERROR:: MALLOC PROBLEM for rpn (called from str2vals:62053)
ERROR:: problem evaluating argument 1 ($naca) for Branch 43 (udprim)
ERROR:: MALLOC PROBLEM for rpn (called from str2vals:62053)
ERROR:: problem evaluating argument 1 ($params) for Branch 1 (dimension)
ERROR:: MALLOC PROBLEM for rpn (called from str2vals:62053)
ERROR:: problem evaluating argument 2 (0.10) for Branch 2 (set)
ERROR:: MALLOC PROBLEM for rpn (called from str2vals:62053)
ERROR:: problem evaluating argument 2 (sqrt(area*aspect)) for Branch 3 (set)
ERROR:: MALLOC PROBLEM for rpn (called from str2vals:62053)
ERROR:: problem evaluating argument 2 (area/span*2/(taper+1)) for Branch 4 (set)
ERROR:: MALLOC PROBLEM for rpn (called from str2vals:62053)
ERROR:: problem evaluating argument 2 (croot*taper) for Branch 5 (set)
ERROR:: MALLOC PROBLEM for rpn (called from str2vals:62053)
ERROR:: problem evaluating argument 2 ((croot-ctip)/2) for Branch 6 (set)
ERROR:: MALLOC PROBLEM for rpn (called from str2vals:62053)
ERROR:: problem evaluating argument 1 (view:MSES) for Branch 7 (ifthen)
ERROR:: MALLOC PROBLEM for rpn (called from str2vals:62053)
ERROR:: problem evaluating argument 1 ($naca) for Branch 9 (udparg)
ERROR:: MALLOC PROBLEM for rpn (called from str2vals:62053)
ERROR:: problem evaluating argument 1 ($naca) for Branch 10 (udparg)
ERROR:: MALLOC PROBLEM for rpn (called from str2vals:62053)
ERROR:: problem evaluating argument 1 ($naca) for Branch 11 (udparg)
ERROR:: MALLOC PROBLEM for rpn (called from str2vals:62053)
ERROR:: problem evaluating argument 1 ($naca) for Branch 12 (udparg)
ERROR:: MALLOC PROBLEM for rpn (called from str2vals:62053)
ERROR:: problem evaluating argument 1 ($naca) for Branch 13 (udprim)
ERROR:: MALLOC PROBLEM for rpn (called from str2vals:62053)
ERROR:: problem evaluating argument 1 (90) for Branch 14 (rotatex)
ERROR:: MALLOC PROBLEM for rpn (called from str2vals:62053)
ERROR:: problem evaluating argument 1 (ctip) for Branch 15 (scale)
ERROR:: MALLOC PROBLEM for rpn (called from str2vals:62053)
ERROR:: problem evaluating argument 1 (xtip) for Branch 16 (translate)
ERROR:: MALLOC PROBLEM for rpn (called from str2vals:62053)
ERROR:: problem evaluating argument 1 ($wing) for Branch 17 (store)
ERROR:: MALLOC PROBLEM for rpn (called from str2vals:62053)
ERROR:: problem evaluating argument 1 ($naca) for Branch 18 (udparg)
ERROR:: MALLOC PROBLEM for rpn (called from str2vals:62053)
ERROR:: problem evaluating argument 1 ($naca) for Branch 19 (udparg)
ERROR:: MALLOC PROBLEM for rpn (called from str2vals:62053)
ERROR:: problem evaluating argument 1 ($naca) for Branch 20 (udparg)
ERROR:: MALLOC PROBLEM for rpn (called from str2vals:62053)
ERROR:: problem evaluating argument 1 ($naca) for Branch 21 (udparg)
ERROR:: MALLOC PROBLEM for rpn (called from str2vals:62053)
ERROR:: problem evaluating argument 1 ($naca) for Branch 22 (udprim)
ERROR:: MALLOC PROBLEM for rpn (called from str2vals:62053)
ERROR:: problem evaluating argument 1 (90) for Branch 23 (rotatex)
ERROR:: MALLOC PROBLEM for rpn (called from str2vals:62053)
ERROR:: problem evaluating argument 1 (croot) for Branch 24 (scale)
ERROR:: MALLOC PROBLEM for rpn (called from str2vals:62053)
ERROR:: problem evaluating argument 1 ($wing) for Branch 25 (store)
ERROR:: MALLOC PROBLEM for rpn (called from str2vals:62053)
ERROR:: problem evaluating argument 1 ($naca) for Branch 26 (udparg)
ERROR:: MALLOC PROBLEM for rpn (called from str2vals:62053)
ERROR:: problem evaluating argument 1 ($naca) for Branch 27 (udparg)
ERROR:: MALLOC PROBLEM for rpn (called from str2vals:62053)
ERROR:: problem evaluating argument 1 ($naca) for Branch 28 (udparg)
ERROR:: MALLOC PROBLEM for rpn (called from str2vals:62053)
ERROR:: problem evaluating argument 1 ($naca) for Branch 29 (udparg)
ERROR:: MALLOC PROBLEM for rpn (called from str2vals:62053)
ERROR:: problem evaluating argument 1 ($naca) for Branch 30 (udprim)
ERROR:: MALLOC PROBLEM for rpn (called from str2vals:62053)
ERROR:: problem evaluating argument 1 (90) for Branch 31 (rotatex)
ERROR:: MALLOC PROBLEM for rpn (called from str2vals:62053)
ERROR:: problem evaluating argument 1 (ctip) for Branch 32 (scale)
ERROR:: MALLOC PROBLEM for rpn (called from str2vals:62053)
ERROR:: problem evaluating argument 1 (xtip) for Branch 33 (translate)
ERROR:: MALLOC PROBLEM for rpn (called from str2vals:62053)
ERROR:: problem evaluating argument 1 ($wing) for Branch 34 (store)
ERROR:: MALLOC PROBLEM for rpn (called from str2vals:62053)
ERROR:: problem evaluating argument 1 (0) for Branch 35 (rule)
ERROR:: MALLOC PROBLEM for rpn (called from str2vals:62053)
ERROR:: problem evaluating argument 1 ($tessBody) for Branch 36 (store)
ERROR:: MALLOC PROBLEM for rpn (called from str2vals:62053)
ERROR:: problem evaluating argument 1 ($tessBody) for Branch 37 (restore)
ERROR:: MALLOC PROBLEM for rpn (called from str2vals:62053)
ERROR:: problem evaluating argument 1 ($naca) for Branch 39 (udparg)
ERROR:: MALLOC PROBLEM for rpn (called from str2vals:62053)
ERROR:: problem evaluating argument 1 ($naca) for Branch 40 (udparg)
ERROR:: MALLOC PROBLEM for rpn (called from str2vals:62053)
ERROR:: problem evaluating argument 1 ($naca) for Branch 41 (udparg)
ERROR:: MALLOC PROBLEM for rpn (called from str2vals:62053)
ERROR:: problem evaluating argument 1 ($naca) for Branch 42 (udparg)
ERROR:: MALLOC PROBLEM for rpn (called from str2vals:62053)
ERROR:: problem evaluating argument 1 ($naca) for Branch 43 (udprim)
ERROR:: MALLOC PROBLEM for rpn (called from str2vals:62053)
ERROR:: problem evaluating argument 1 ($params) for Branch 1 (dimension)
ERROR:: MALLOC PROBLEM for rpn (called from str2vals:62053)
ERROR:: problem evaluating argument 2 (0.10) for Branch 2 (set)
ERROR:: MALLOC PROBLEM for rpn (called from str2vals:62053)
ERROR:: problem evaluating argument 2 (sqrt(area*aspect)) for Branch 3 (set)
ERROR:: MALLOC PROBLEM for rpn (called from str2vals:62053)
ERROR:: problem evaluating argument 2 (area/span*2/(taper+1)) for Branch 4 (set)
ERROR:: MALLOC PROBLEM for rpn (called from str2vals:62053)
ERROR:: problem evaluating argument 2 (croot*taper) for Branch 5 (set)
ERROR:: MALLOC PROBLEM for rpn (called from str2vals:62053)
ERROR:: problem evaluating argument 2 ((croot-ctip)/2) for Branch 6 (set)
ERROR:: MALLOC PROBLEM for rpn (called from str2vals:62053)
ERROR:: problem evaluating argument 1 (view:MSES) for Branch 7 (ifthen)
ERROR:: MALLOC PROBLEM for rpn (called from str2vals:62053)
ERROR:: problem evaluating argument 1 ($naca) for Branch 9 (udparg)
ERROR:: MALLOC PROBLEM for rpn (called from str2vals:62053)
ERROR:: problem evaluating argument 1 ($naca) for Branch 10 (udparg)
ERROR:: MALLOC PROBLEM for rpn (called from str2vals:62053)
ERROR:: problem evaluating argument 1 ($naca) for Branch 11 (udparg)
ERROR:: MALLOC PROBLEM for rpn (called from str2vals:62053)
ERROR:: problem evaluating argument 1 ($naca) for Branch 12 (udparg)
ERROR:: MALLOC PROBLEM for rpn (called from str2vals:62053)
ERROR:: problem evaluating argument 1 ($naca) for Branch 13 (udprim)
ERROR:: MALLOC PROBLEM for rpn (called from str2vals:62053)
ERROR:: problem evaluating argument 1 (90) for Branch 14 (rotatex)
ERROR:: MALLOC PROBLEM for rpn (called from str2vals:62053)
ERROR:: problem evaluating argument 1 (ctip) for Branch 15 (scale)
ERROR:: MALLOC PROBLEM for rpn (called from str2vals:62053)
ERROR:: problem evaluating argument 1 (xtip) for Branch 16 (translate)
ERROR:: MALLOC PROBLEM for rpn (called from str2vals:62053)
ERROR:: problem evaluating argument 1 ($wing) for Branch 17 (store)
ERROR:: MALLOC PROBLEM for rpn (called from str2vals:62053)
ERROR:: problem evaluating argument 1 ($naca) for Branch 18 (udparg)
ERROR:: MALLOC PROBLEM for rpn (called from str2vals:62053)
ERROR:: problem evaluating argument 1 ($naca) for Branch 19 (udparg)
ERROR:: MALLOC PROBLEM for rpn (called from str2vals:62053)
ERROR:: problem evaluating argument 1 ($naca) for Branch 20 (udparg)
ERROR:: MALLOC PROBLEM for rpn (called from str2vals:62053)
ERROR:: problem evaluating argument 1 ($naca) for Branch 21 (udparg)
ERROR:: MALLOC PROBLEM for rpn (called from str2vals:62053)
ERROR:: problem evaluating argument 1 ($naca) for Branch 22 (udprim)
ERROR:: MALLOC PROBLEM for rpn (called from str2vals:62053)
ERROR:: problem evaluating argument 1 (90) for Branch 23 (rotatex)
ERROR:: MALLOC PROBLEM for rpn (called from str2vals:62053)
ERROR:: problem evaluating argument 1 (croot) for Branch 24 (scale)
ERROR:: MALLOC PROBLEM for rpn (called from str2vals:62053)
ERROR:: problem evaluating argument 1 ($wing) for Branch 25 (store)
ERROR:: MALLOC PROBLEM for rpn (called from str2vals:62053)
ERROR:: problem evaluating argument 1 ($naca) for Branch 26 (udparg)
ERROR:: MALLOC PROBLEM for rpn (called from str2vals:62053)
ERROR:: problem evaluating argument 1 ($naca) for Branch 27 (udparg)
ERROR:: MALLOC PROBLEM for rpn (called from str2vals:62053)
ERROR:: problem evaluating argument 1 ($naca) for Branch 28 (udparg)
ERROR:: MALLOC PROBLEM for rpn (called from str2vals:62053)
ERROR:: problem evaluating argument 1 ($naca) for Branch 29 (udparg)
ERROR:: MALLOC PROBLEM for rpn (called from str2vals:62053)
ERROR:: problem evaluating argument 1 ($naca) for Branch 30 (udprim)
ERROR:: MALLOC PROBLEM for rpn (called from str2vals:62053)
ERROR:: problem evaluating argument 1 (90) for Branch 31 (rotatex)
ERROR:: MALLOC PROBLEM for rpn (called from str2vals:62053)
ERROR:: problem evaluating argument 1 (ctip) for Branch 32 (scale)
ERROR:: MALLOC PROBLEM for rpn (called from str2vals:62053)
ERROR:: problem evaluating argument 1 (xtip) for Branch 33 (translate)
ERROR:: MALLOC PROBLEM for rpn (called from str2vals:62053)
ERROR:: problem evaluating argument 1 ($wing) for Branch 34 (store)
ERROR:: MALLOC PROBLEM for rpn (called from str2vals:62053)
ERROR:: problem evaluating argument 1 (0) for Branch 35 (rule)
ERROR:: MALLOC PROBLEM for rpn (called from str2vals:62053)
ERROR:: problem evaluating argument 1 ($tessBody) for Branch 36 (store)
ERROR:: MALLOC PROBLEM for rpn (called from str2vals:62053)
ERROR:: problem evaluating argument 1 ($tessBody) for Branch 37 (restore)
ERROR:: MALLOC PROBLEM for rpn (called from str2vals:62053)
ERROR:: problem evaluating argument 1 ($naca) for Branch 39 (udparg)
ERROR:: MALLOC PROBLEM for rpn (called from str2vals:62053)
ERROR:: problem evaluating argument 1 ($naca) for Branch 40 (udparg)
ERROR:: MALLOC PROBLEM for rpn (called from str2vals:62053)
ERROR:: problem evaluating argument 1 ($naca) for Branch 41 (udparg)
ERROR:: MALLOC PROBLEM for rpn (called from str2vals:62053)
ERROR:: problem evaluating argument 1 ($naca) for Branch 42 (udparg)
ERROR:: MALLOC PROBLEM for rpn (called from str2vals:62053)
ERROR:: problem evaluating argument 1 ($naca) for Branch 43 (udprim)
ERROR:: MALLOC PROBLEM for rpn (called from str2vals:62053)
ERROR:: problem evaluating argument 1 ($params) for Branch 1 (dimension)
ERROR:: MALLOC PROBLEM for rpn (called from str2vals:62053)
ERROR:: problem evaluating argument 2 (0.10) for Branch 2 (set)
ERROR:: MALLOC PROBLEM for rpn (called from str2vals:62053)
ERROR:: problem evaluating argument 2 (sqrt(area*aspect)) for Branch 3 (set)
ERROR:: MALLOC PROBLEM for rpn (called from str2vals:62053)
ERROR:: problem evaluating argument 2 (area/span*2/(taper+1)) for Branch 4 (set)
ERROR:: MALLOC PROBLEM for rpn (called from str2vals:62053)
ERROR:: problem evaluating argument 2 (croot*taper) for Branch 5 (set)
ERROR:: MALLOC PROBLEM for rpn (called from str2vals:62053)
ERROR:: problem evaluating argument 2 ((croot-ctip)/2) for Branch 6 (set)
ERROR:: MALLOC PROBLEM for rpn (called from str2vals:62053)
ERROR:: problem evaluating argument 1 (view:MSES) for Branch 7 (ifthen)
ERROR:: MALLOC PROBLEM for rpn (called from str2vals:62053)
ERROR:: problem evaluating argument 1 ($naca) for Branch 9 (udparg)
ERROR:: MALLOC PROBLEM for rpn (called from str2vals:62053)
ERROR:: problem evaluating argument 1 ($naca) for Branch 10 (udparg)
ERROR:: MALLOC PROBLEM for rpn (called from str2vals:62053)
ERROR:: problem evaluating argument 1 ($naca) for Branch 11 (udparg)
ERROR:: MALLOC PROBLEM for rpn (called from str2vals:62053)
ERROR:: problem evaluating argument 1 ($naca) for Branch 12 (udparg)
ERROR:: MALLOC PROBLEM for rpn (called from str2vals:62053)
ERROR:: problem evaluating argument 1 ($naca) for Branch 13 (udprim)
ERROR:: MALLOC PROBLEM for rpn (called from str2vals:62053)
ERROR:: problem evaluating argument 1 (90) for Branch 14 (rotatex)
ERROR:: MALLOC PROBLEM for rpn (called from str2vals:62053)
ERROR:: problem evaluating argument 1 (ctip) for Branch 15 (scale)
ERROR:: MALLOC PROBLEM for rpn (called from str2vals:62053)
ERROR:: problem evaluating argument 1 (xtip) for Branch 16 (translate)
ERROR:: MALLOC PROBLEM for rpn (called from str2vals:62053)
ERROR:: problem evaluating argument 1 ($wing) for Branch 17 (store)
ERROR:: MALLOC PROBLEM for rpn (called from str2vals:62053)
ERROR:: problem evaluating argument 1 ($naca) for Branch 18 (udparg)
ERROR:: MALLOC PROBLEM for rpn (called from str2vals:62053)
ERROR:: problem evaluating argument 1 ($naca) for Branch 19 (udparg)
ERROR:: MALLOC PROBLEM for rpn (called from str2vals:62053)
ERROR:: problem evaluating argument 1 ($naca) for Branch 20 (udparg)
ERROR:: MALLOC PROBLEM for rpn (called from str2vals:62053)
ERROR:: problem evaluating argument 1 ($naca) for Branch 21 (udparg)
ERROR:: MALLOC PROBLEM for rpn (called from str2vals:62053)
ERROR:: problem evaluating argument 1 ($naca) for Branch 22 (udprim)
ERROR:: MALLOC PROBLEM for rpn (called from str2vals:62053)
ERROR:: problem evaluating argument 1 (90) for Branch 23 (rotatex)
ERROR:: MALLOC PROBLEM for rpn (called from str2vals:62053)
ERROR:: problem evaluating argument 1 (croot) for Branch 24 (scale)
ERROR:: MALLOC PROBLEM for rpn (called from str2vals:62053)
ERROR:: problem evaluating argument 1 ($wing) for Branch 25 (store)
ERROR:: MALLOC PROBLEM for rpn (called from str2vals:62053)
ERROR:: problem evaluating argument 1 ($naca) for Branch 26 (udparg)
ERROR:: MALLOC PROBLEM for rpn (called from str2vals:62053)
ERROR:: problem evaluating argument 1 ($naca) for Branch 27 (udparg)
ERROR:: MALLOC PROBLEM for rpn (called from str2vals:62053)
ERROR:: problem evaluating argument 1 ($naca) for Branch 28 (udparg)
ERROR:: MALLOC PROBLEM for rpn (called from str2vals:62053)
ERROR:: problem evaluating argument 1 ($naca) for Branch 29 (udparg)
ERROR:: MALLOC PROBLEM for rpn (called from str2vals:62053)
ERROR:: problem evaluating argument 1 ($naca) for Branch 30 (udprim)
ERROR:: MALLOC PROBLEM for rpn (called from str2vals:62053)
ERROR:: problem evaluating argument 1 (90) for Branch 31 (rotatex)
ERROR:: MALLOC PROBLEM for rpn (called from str2vals:62053)
ERROR:: problem evaluating argument 1 (ctip) for Branch 32 (scale)
ERROR:: MALLOC PROBLEM for rpn (called from str2vals:62053)
ERROR:: problem evaluating argument 1 (xtip) for Branch 33 (translate)
ERROR:: MALLOC PROBLEM for rpn (called from str2vals:62053)
ERROR:: problem evaluating argument 1 ($wing) for Branch 34 (store)
ERROR:: MALLOC PROBLEM for rpn (called from str2vals:62053)
ERROR:: problem evaluating argument 1 (0) for Branch 35 (rule)
ERROR:: MALLOC PROBLEM for rpn (called from str2vals:62053)
ERROR:: problem evaluating argument 1 ($tessBody) for Branch 36 (store)
ERROR:: MALLOC PROBLEM for rpn (called from str2vals:62053)
ERROR:: problem evaluating argument 1 ($tessBody) for Branch 37 (restore)
ERROR:: MALLOC PROBLEM for rpn (called from str2vals:62053)
ERROR:: problem evaluating argument 1 ($naca) for Branch 39 (udparg)
ERROR:: MALLOC PROBLEM for rpn (called from str2vals:62053)
ERROR:: problem evaluating argument 1 ($naca) for Branch 40 (udparg)
ERROR:: MALLOC PROBLEM for rpn (called from str2vals:62053)
ERROR:: problem evaluating argument 1 ($naca) for Branch 41 (udparg)
ERROR:: MALLOC PROBLEM for rpn (called from str2vals:62053)
ERROR:: problem evaluating argument 1 ($naca) for Branch 42 (udparg)
ERROR:: MALLOC PROBLEM for rpn (called from str2vals:62053)
ERROR:: problem evaluating argument 1 ($naca) for Branch 43 (udprim)
ERROR:: MALLOC PROBLEM for rpn (called from str2vals:62053)
ERROR:: problem evaluating argument 1 ($params) for Branch 1 (dimension)
ERROR:: MALLOC PROBLEM for rpn (called from str2vals:62053)
ERROR:: problem evaluating argument 2 (0.10) for Branch 2 (set)
ERROR:: MALLOC PROBLEM for rpn (called from str2vals:62053)
ERROR:: problem evaluating argument 2 (sqrt(area*aspect)) for Branch 3 (set)
ERROR:: MALLOC PROBLEM for rpn (called from str2vals:62053)
ERROR:: problem evaluating argument 2 (area/span*2/(taper+1)) for Branch 4 (set)
ERROR:: MALLOC PROBLEM for rpn (called from str2vals:62053)
ERROR:: problem evaluating argument 2 (croot*taper) for Branch 5 (set)
ERROR:: MALLOC PROBLEM for rpn (called from str2vals:62053)
ERROR:: problem evaluating argument 2 ((croot-ctip)/2) for Branch 6 (set)
ERROR:: MALLOC PROBLEM for rpn (called from str2vals:62053)
ERROR:: problem evaluating argument 1 (view:MSES) for Branch 7 (ifthen)
ERROR:: MALLOC PROBLEM for rpn (called from str2vals:62053)
ERROR:: problem evaluating argument 1 ($naca) for Branch 9 (udparg)
ERROR:: MALLOC PROBLEM for rpn (called from str2vals:62053)
ERROR:: problem evaluating argument 1 ($naca) for Branch 10 (udparg)
ERROR:: MALLOC PROBLEM for rpn (called from str2vals:62053)
ERROR:: problem evaluating argument 1 ($naca) for Branch 11 (udparg)
ERROR:: MALLOC PROBLEM for rpn (called from str2vals:62053)
ERROR:: problem evaluating argument 1 ($naca) for Branch 12 (udparg)
ERROR:: MALLOC PROBLEM for rpn (called from str2vals:62053)
ERROR:: problem evaluating argument 1 ($naca) for Branch 13 (udprim)
ERROR:: MALLOC PROBLEM for rpn (called from str2vals:62053)
ERROR:: problem evaluating argument 1 (90) for Branch 14 (rotatex)
ERROR:: MALLOC PROBLEM for rpn (called from str2vals:62053)
ERROR:: problem evaluating argument 1 (ctip) for Branch 15 (scale)
ERROR:: MALLOC PROBLEM for rpn (called from str2vals:62053)
ERROR:: problem evaluating argument 1 (xtip) for Branch 16 (translate)
ERROR:: MALLOC PROBLEM for rpn (called from str2vals:62053)
ERROR:: problem evaluating argument 1 ($wing) for Branch 17 (store)
ERROR:: MALLOC PROBLEM for rpn (called from str2vals:62053)
ERROR:: problem evaluating argument 1 ($naca) for Branch 18 (udparg)
ERROR:: MALLOC PROBLEM for rpn (called from str2vals:62053)
ERROR:: problem evaluating argument 1 ($naca) for Branch 19 (udparg)
ERROR:: MALLOC PROBLEM for rpn (called from str2vals:62053)
ERROR:: problem evaluating argument 1 ($naca) for Branch 20 (udparg)
ERROR:: MALLOC PROBLEM for rpn (called from str2vals:62053)
ERROR:: problem evaluating argument 1 ($naca) for Branch 21 (udparg)
ERROR:: MALLOC PROBLEM for rpn (called from str2vals:62053)
ERROR:: problem evaluating argument 1 ($naca) for Branch 22 (udprim)
ERROR:: MALLOC PROBLEM for rpn (called from str2vals:62053)
ERROR:: problem evaluating argument 1 (90) for Branch 23 (rotatex)
ERROR:: MALLOC PROBLEM for rpn (called from str2vals:62053)
ERROR:: problem evaluating argument 1 (croot) for Branch 24 (scale)
ERROR:: MALLOC PROBLEM for rpn (called from str2vals:62053)
ERROR:: problem evaluating argument 1 ($wing) for Branch 25 (store)
ERROR:: MALLOC PROBLEM for rpn (called from str2vals:62053)
ERROR:: problem evaluating argument 1 ($naca) for Branch 26 (udparg)
ERROR:: MALLOC PROBLEM for rpn (called from str2vals:62053)
ERROR:: problem evaluating argument 1 ($naca) for Branch 27 (udparg)
ERROR:: MALLOC PROBLEM for rpn (called from str2vals:62053)
ERROR:: problem evaluating argument 1 ($naca) for Branch 28 (udparg)
ERROR:: MALLOC PROBLEM for rpn (called from str2vals:62053)
ERROR:: problem evaluating argument 1 ($naca) for Branch 29 (udparg)
ERROR:: MALLOC PROBLEM for rpn (called from str2vals:62053)
ERROR:: problem evaluating argument 1 ($naca) for Branch 30 (udprim)
ERROR:: MALLOC PROBLEM for rpn (called from str2vals:62053)
ERROR:: problem evaluating argument 1 (90) for Branch 31 (rotatex)
ERROR:: MALLOC PROBLEM for rpn (called from str2vals:62053)
ERROR:: problem evaluating argument 1 (ctip) for Branch 32 (scale)
ERROR:: MALLOC PROBLEM for rpn (called from str2vals:62053)
ERROR:: problem evaluating argument 1 (xtip) for Branch 33 (translate)
ERROR:: MALLOC PROBLEM for rpn (called from str2vals:62053)
ERROR:: problem evaluating argument 1 ($wing) for Branch 34 (store)
ERROR:: MALLOC PROBLEM for rpn (called from str2vals:62053)
ERROR:: problem evaluating argument 1 (0) for Branch 35 (rule)
ERROR:: MALLOC PROBLEM for rpn (called from str2vals:62053)
ERROR:: problem evaluating argument 1 ($tessBody) for Branch 36 (store)
ERROR:: MALLOC PROBLEM for rpn (called from str2vals:62053)
ERROR:: problem evaluating argument 1 ($tessBody) for Branch 37 (restore)
ERROR:: MALLOC PROBLEM for rpn (called from str2vals:62053)
ERROR:: problem evaluating argument 1 ($naca) for Branch 39 (udparg)
ERROR:: MALLOC PROBLEM for rpn (called from str2vals:62053)
ERROR:: problem evaluating argument 1 ($naca) for Branch 40 (udparg)
ERROR:: MALLOC PROBLEM for rpn (called from str2vals:62053)
ERROR:: problem evaluating argument 1 ($naca) for Branch 41 (udparg)
ERROR:: MALLOC PROBLEM for rpn (called from str2vals:62053)
ERROR:: problem evaluating argument 1 ($naca) for Branch 42 (udparg)
ERROR:: MALLOC PROBLEM for rpn (called from str2vals:62053)
ERROR:: problem evaluating argument 1 ($naca) for Branch 43 (udprim)
ERROR:: MALLOC PROBLEM for rpn (called from str2vals:62053)
ERROR:: problem evaluating argument 1 ($params) for Branch 1 (dimension)
ERROR:: MALLOC PROBLEM for rpn (called from str2vals:62053)
ERROR:: problem evaluating argument 2 (0.10) for Branch 2 (set)
ERROR:: MALLOC PROBLEM for rpn (called from str2vals:62053)
ERROR:: problem evaluating argument 2 (sqrt(area*aspect)) for Branch 3 (set)
ERROR:: MALLOC PROBLEM for rpn (called from str2vals:62053)
ERROR:: problem evaluating argument 2 (area/span*2/(taper+1)) for Branch 4 (set)
ERROR:: MALLOC PROBLEM for rpn (called from str2vals:62053)
ERROR:: problem evaluating argument 2 (croot*taper) for Branch 5 (set)
ERROR:: MALLOC PROBLEM for rpn (called from str2vals:62053)
ERROR:: problem evaluating argument 2 ((croot-ctip)/2) for Branch 6 (set)
ERROR:: MALLOC PROBLEM for rpn (called from str2vals:62053)
ERROR:: problem evaluating argument 1 (view:MSES) for Branch 7 (ifthen)
ERROR:: MALLOC PROBLEM for rpn (called from str2vals:62053)
ERROR:: problem evaluating argument 1 ($naca) for Branch 9 (udparg)
ERROR:: MALLOC PROBLEM for rpn (called from str2vals:62053)
ERROR:: problem evaluating argument 1 ($naca) for Branch 10 (udparg)
ERROR:: MALLOC PROBLEM for rpn (called from str2vals:62053)
ERROR:: problem evaluating argument 1 ($naca) for Branch 11 (udparg)
ERROR:: MALLOC PROBLEM for rpn (called from str2vals:62053)
ERROR:: problem evaluating argument 1 ($naca) for Branch 12 (udparg)
ERROR:: MALLOC PROBLEM for rpn (called from str2vals:62053)
ERROR:: problem evaluating argument 1 ($naca) for Branch 13 (udprim)
ERROR:: MALLOC PROBLEM for rpn (called from str2vals:62053)
ERROR:: problem evaluating argument 1 (90) for Branch 14 (rotatex)
ERROR:: MALLOC PROBLEM for rpn (called from str2vals:62053)
ERROR:: problem evaluating argument 1 (ctip) for Branch 15 (scale)
ERROR:: MALLOC PROBLEM for rpn (called from str2vals:62053)
ERROR:: problem evaluating argument 1 (xtip) for Branch 16 (translate)
ERROR:: MALLOC PROBLEM for rpn (called from str2vals:62053)
ERROR:: problem evaluating argument 1 ($wing) for Branch 17 (store)
ERROR:: MALLOC PROBLEM for rpn (called from str2vals:62053)
ERROR:: problem evaluating argument 1 ($naca) for Branch 18 (udparg)
ERROR:: MALLOC PROBLEM for rpn (called from str2vals:62053)
ERROR:: problem evaluating argument 1 ($naca) for Branch 19 (udparg)
ERROR:: MALLOC PROBLEM for rpn (called from str2vals:62053)
ERROR:: problem evaluating argument 1 ($naca) for Branch 20 (udparg)
ERROR:: MALLOC PROBLEM for rpn (called from str2vals:62053)
ERROR:: problem evaluating argument 1 ($naca) for Branch 21 (udparg)
ERROR:: MALLOC PROBLEM for rpn (called from str2vals:62053)
ERROR:: problem evaluating argument 1 ($naca) for Branch 22 (udprim)
ERROR:: MALLOC PROBLEM for rpn (called from str2vals:62053)
ERROR:: problem evaluating argument 1 (90) for Branch 23 (rotatex)
ERROR:: MALLOC PROBLEM for rpn (called from str2vals:62053)
ERROR:: problem evaluating argument 1 (croot) for Branch 24 (scale)
ERROR:: MALLOC PROBLEM for rpn (called from str2vals:62053)
ERROR:: problem evaluating argument 1 ($wing) for Branch 25 (store)
ERROR:: MALLOC PROBLEM for rpn (called from str2vals:62053)
ERROR:: problem evaluating argument 1 ($naca) for Branch 26 (udparg)
ERROR:: MALLOC PROBLEM for rpn (called from str2vals:62053)
ERROR:: problem evaluating argument 1 ($naca) for Branch 27 (udparg)
ERROR:: MALLOC PROBLEM for rpn (called from str2vals:62053)
ERROR:: problem evaluating argument 1 ($naca) for Branch 28 (udparg)
ERROR:: MALLOC PROBLEM for rpn (called from str2vals:62053)
ERROR:: problem evaluating argument 1 ($naca) for Branch 29 (udparg)
ERROR:: MALLOC PROBLEM for rpn (called from str2vals:62053)
ERROR:: problem evaluating argument 1 ($naca) for Branch 30 (udprim)
ERROR:: MALLOC PROBLEM for rpn (called from str2vals:62053)
ERROR:: problem evaluating argument 1 (90) for Branch 31 (rotatex)
ERROR:: MALLOC PROBLEM for rpn (called from str2vals:62053)
ERROR:: problem evaluating argument 1 (ctip) for Branch 32 (scale)
ERROR:: MALLOC PROBLEM for rpn (called from str2vals:62053)
ERROR:: problem evaluating argument 1 (xtip) for Branch 33 (translate)
ERROR:: MALLOC PROBLEM for rpn (called from str2vals:62053)
ERROR:: problem evaluating argument 1 ($wing) for Branch 34 (store)
ERROR:: MALLOC PROBLEM for rpn (called from str2vals:62053)
ERROR:: problem evaluating argument 1 (0) for Branch 35 (rule)
ERROR:: MALLOC PROBLEM for rpn (called from str2vals:62053)
ERROR:: problem evaluating argument 1 ($tessBody) for Branch 36 (store)
ERROR:: MALLOC PROBLEM for rpn (called from str2vals:62053)
ERROR:: problem evaluating argument 1 ($tessBody) for Branch 37 (restore)
ERROR:: MALLOC PROBLEM for rpn (called from str2vals:62053)
ERROR:: problem evaluating argument 1 ($naca) for Branch 39 (udparg)
ERROR:: MALLOC PROBLEM for rpn (called from str2vals:62053)
ERROR:: problem evaluating argument 1 ($naca) for Branch 40 (udparg)
ERROR:: MALLOC PROBLEM for rpn (called from str2vals:62053)
ERROR:: problem evaluating argument 1 ($naca) for Branch 41 (udparg)
ERROR:: MALLOC PROBLEM for rpn (called from str2vals:62053)
ERROR:: problem evaluating argument 1 ($naca) for Branch 42 (udparg)
ERROR:: MALLOC PROBLEM for rpn (called from str2vals:62053)
ERROR:: problem evaluating argument 1 ($naca) for Branch 43 (udprim)
ERROR:: MALLOC PROBLEM for rpn (called from str2vals:62053)
ERROR:: problem evaluating argument 1 ($params) for Branch 1 (dimension)
ERROR:: MALLOC PROBLEM for rpn (called from str2vals:62053)
ERROR:: problem evaluating argument 2 (0.10) for Branch 2 (set)
ERROR:: MALLOC PROBLEM for rpn (called from str2vals:62053)
ERROR:: problem evaluating argument 2 (sqrt(area*aspect)) for Branch 3 (set)
ERROR:: MALLOC PROBLEM for rpn (called from str2vals:62053)
ERROR:: problem evaluating argument 2 (area/span*2/(taper+1)) for Branch 4 (set)
ERROR:: MALLOC PROBLEM for rpn (called from str2vals:62053)
ERROR:: problem evaluating argument 2 (croot*taper) for Branch 5 (set)
ERROR:: MALLOC PROBLEM for rpn (called from str2vals:62053)
ERROR:: problem evaluating argument 2 ((croot-ctip)/2) for Branch 6 (set)
ERROR:: MALLOC PROBLEM for rpn (called from str2vals:62053)
ERROR:: problem evaluating argument 1 (view:MSES) for Branch 7 (ifthen)
ERROR:: MALLOC PROBLEM for rpn (called from str2vals:62053)
ERROR:: problem evaluating argument 1 ($naca) for Branch 9 (udparg)
ERROR:: MALLOC PROBLEM for rpn (called from str2vals:62053)
ERROR:: problem evaluating argument 1 ($naca) for Branch 10 (udparg)
ERROR:: MALLOC PROBLEM for rpn (called from str2vals:62053)
ERROR:: problem evaluating argument 1 ($naca) for Branch 11 (udparg)
ERROR:: MALLOC PROBLEM for rpn (called from str2vals:62053)
ERROR:: problem evaluating argument 1 ($naca) for Branch 12 (udparg)
ERROR:: MALLOC PROBLEM for rpn (called from str2vals:62053)
ERROR:: problem evaluating argument 1 ($naca) for Branch 13 (udprim)
ERROR:: MALLOC PROBLEM for rpn (called from str2vals:62053)
ERROR:: problem evaluating argument 1 (90) for Branch 14 (rotatex)
ERROR:: MALLOC PROBLEM for rpn (called from str2vals:62053)
ERROR:: problem evaluating argument 1 (ctip) for Branch 15 (scale)
ERROR:: MALLOC PROBLEM for rpn (called from str2vals:62053)
ERROR:: problem evaluating argument 1 (xtip) for Branch 16 (translate)
ERROR:: MALLOC PROBLEM for rpn (called from str2vals:62053)
ERROR:: problem evaluating argument 1 ($wing) for Branch 17 (store)
ERROR:: MALLOC PROBLEM for rpn (called from str2vals:62053)
ERROR:: problem evaluating argument 1 ($naca) for Branch 18 (udparg)
ERROR:: MALLOC PROBLEM for rpn (called from str2vals:62053)
ERROR:: problem evaluating argument 1 ($naca) for Branch 19 (udparg)
ERROR:: MALLOC PROBLEM for rpn (called from str2vals:62053)
ERROR:: problem evaluating argument 1 ($naca) for Branch 20 (udparg)
ERROR:: MALLOC PROBLEM for rpn (called from str2vals:62053)
ERROR:: problem evaluating argument 1 ($naca) for Branch 21 (udparg)
ERROR:: MALLOC PROBLEM for rpn (called from str2vals:62053)
ERROR:: problem evaluating argument 1 ($naca) for Branch 22 (udprim)
ERROR:: MALLOC PROBLEM for rpn (called from str2vals:62053)
ERROR:: problem evaluating argument 1 (90) for Branch 23 (rotatex)
ERROR:: MALLOC PROBLEM for rpn (called from str2vals:62053)
ERROR:: problem evaluating argument 1 (croot) for Branch 24 (scale)
ERROR:: MALLOC PROBLEM for rpn (called from str2vals:62053)
ERROR:: problem evaluating argument 1 ($wing) for Branch 25 (store)
ERROR:: MALLOC PROBLEM for rpn (called from str2vals:62053)
ERROR:: problem evaluating argument 1 ($naca) for Branch 26 (udparg)
ERROR:: MALLOC PROBLEM for rpn (called from str2vals:62053)
ERROR:: problem evaluating argument 1 ($naca) for Branch 27 (udparg)
ERROR:: MALLOC PROBLEM for rpn (called from str2vals:62053)
ERROR:: problem evaluating argument 1 ($naca) for Branch 28 (udparg)
ERROR:: MALLOC PROBLEM for rpn (called from str2vals:62053)
ERROR:: problem evaluating argument 1 ($naca) for Branch 29 (udparg)
ERROR:: MALLOC PROBLEM for rpn (called from str2vals:62053)
ERROR:: problem evaluating argument 1 ($naca) for Branch 30 (udprim)
ERROR:: MALLOC PROBLEM for rpn (called from str2vals:62053)
ERROR:: problem evaluating argument 1 (90) for Branch 31 (rotatex)
ERROR:: MALLOC PROBLEM for rpn (called from str2vals:62053)
ERROR:: problem evaluating argument 1 (ctip) for Branch 32 (scale)
ERROR:: MALLOC PROBLEM for rpn (called from str2vals:62053)
ERROR:: problem evaluating argument 1 (xtip) for Branch 33 (translate)
ERROR:: MALLOC PROBLEM for rpn (called from str2vals:62053)
ERROR:: problem evaluating argument 1 ($wing) for Branch 34 (store)
ERROR:: MALLOC PROBLEM for rpn (called from str2vals:62053)
ERROR:: problem evaluating argument 1 (0) for Branch 35 (rule)
ERROR:: MALLOC PROBLEM for rpn (called from str2vals:62053)
ERROR:: problem evaluating argument 1 ($tessBody) for Branch 36 (store)
ERROR:: MALLOC PROBLEM for rpn (called from str2vals:62053)
ERROR:: problem evaluating argument 1 ($tessBody) for Branch 37 (restore)
ERROR:: MALLOC PROBLEM for rpn (called from str2vals:62053)
ERROR:: problem evaluating argument 1 ($naca) for Branch 39 (udparg)
ERROR:: MALLOC PROBLEM for rpn (called from str2vals:62053)
ERROR:: problem evaluating argument 1 ($naca) for Branch 40 (udparg)
ERROR:: MALLOC PROBLEM for rpn (called from str2vals:62053)
ERROR:: problem evaluating argument 1 ($naca) for Branch 41 (udparg)
ERROR:: MALLOC PROBLEM for rpn (called from str2vals:62053)
ERROR:: problem evaluating argument 1 ($naca) for Branch 42 (udparg)
ERROR:: MALLOC PROBLEM for rpn (called from str2vals:62053)
ERROR:: problem evaluating argument 1 ($naca) for Branch 43 (udprim)
ERROR:: MALLOC PROBLEM for rpn (called from str2vals:62053)
ERROR:: problem evaluating argument 1 ($params) for Branch 1 (dimension)
ERROR:: MALLOC PROBLEM for rpn (called from str2vals:62053)
ERROR:: problem evaluating argument 2 (0.10) for Branch 2 (set)
ERROR:: MALLOC PROBLEM for rpn (called from str2vals:62053)
ERROR:: problem evaluating argument 2 (sqrt(area*aspect)) for Branch 3 (set)
ERROR:: MALLOC PROBLEM for rpn (called from str2vals:62053)
ERROR:: problem evaluating argument 2 (area/span*2/(taper+1)) for Branch 4 (set)
ERROR:: MALLOC PROBLEM for rpn (called from str2vals:62053)
ERROR:: problem evaluating argument 2 (croot*taper) for Branch 5 (set)
ERROR:: MALLOC PROBLEM for rpn (called from str2vals:62053)
ERROR:: problem evaluating argument 2 ((croot-ctip)/2) for Branch 6 (set)
ERROR:: MALLOC PROBLEM for rpn (called from str2vals:62053)
ERROR:: problem evaluating argument 1 (view:MSES) for Branch 7 (ifthen)
ERROR:: MALLOC PROBLEM for rpn (called from str2vals:62053)
ERROR:: problem evaluating argument 1 ($naca) for Branch 9 (udparg)
ERROR:: MALLOC PROBLEM for rpn (called from str2vals:62053)
ERROR:: problem evaluating argument 1 ($naca) for Branch 10 (udparg)
ERROR:: MALLOC PROBLEM for rpn (called from str2vals:62053)
ERROR:: problem evaluating argument 1 ($naca) for Branch 11 (udparg)
ERROR:: MALLOC PROBLEM for rpn (called from str2vals:62053)
ERROR:: problem evaluating argument 1 ($naca) for Branch 12 (udparg)
ERROR:: MALLOC PROBLEM for rpn (called from str2vals:62053)
ERROR:: problem evaluating argument 1 ($naca) for Branch 13 (udprim)
ERROR:: MALLOC PROBLEM for rpn (called from str2vals:62053)
ERROR:: problem evaluating argument 1 (90) for Branch 14 (rotatex)
ERROR:: MALLOC PROBLEM for rpn (called from str2vals:62053)
ERROR:: problem evaluating argument 1 (ctip) for Branch 15 (scale)
ERROR:: MALLOC PROBLEM for rpn (called from str2vals:62053)
ERROR:: problem evaluating argument 1 (xtip) for Branch 16 (translate)
ERROR:: MALLOC PROBLEM for rpn (called from str2vals:62053)
ERROR:: problem evaluating argument 1 ($wing) for Branch 17 (store)
ERROR:: MALLOC PROBLEM for rpn (called from str2vals:62053)
ERROR:: problem evaluating argument 1 ($naca) for Branch 18 (udparg)
ERROR:: MALLOC PROBLEM for rpn (called from str2vals:62053)
ERROR:: problem evaluating argument 1 ($naca) for Branch 19 (udparg)
ERROR:: MALLOC PROBLEM for rpn (called from str2vals:62053)
ERROR:: problem evaluating argument 1 ($naca) for Branch 20 (udparg)
ERROR:: MALLOC PROBLEM for rpn (called from str2vals:62053)
ERROR:: problem evaluating argument 1 ($naca) for Branch 21 (udparg)
ERROR:: MALLOC PROBLEM for rpn (called from str2vals:62053)
ERROR:: problem evaluating argument 1 ($naca) for Branch 22 (udprim)
ERROR:: MALLOC PROBLEM for rpn (called from str2vals:62053)
ERROR:: problem evaluating argument 1 (90) for Branch 23 (rotatex)
ERROR:: MALLOC PROBLEM for rpn (called from str2vals:62053)
ERROR:: problem evaluating argument 1 (croot) for Branch 24 (scale)
ERROR:: MALLOC PROBLEM for rpn (called from str2vals:62053)
ERROR:: problem evaluating argument 1 ($wing) for Branch 25 (store)
ERROR:: MALLOC PROBLEM for rpn (called from str2vals:62053)
ERROR:: problem evaluating argument 1 ($naca) for Branch 26 (udparg)
ERROR:: MALLOC PROBLEM for rpn (called from str2vals:62053)
ERROR:: problem evaluating argument 1 ($naca) for Branch 27 (udparg)
ERROR:: MALLOC PROBLEM for rpn (called from str2vals:62053)
ERROR:: problem evaluating argument 1 ($naca) for Branch 28 (udparg)
ERROR:: MALLOC PROBLEM for rpn (called from str2vals:62053)
ERROR:: problem evaluating argument 1 ($naca) for Branch 29 (udparg)
ERROR:: MALLOC PROBLEM for rpn (called from str2vals:62053)
ERROR:: problem evaluating argument 1 ($naca) for Branch 30 (udprim)
ERROR:: MALLOC PROBLEM for rpn (called from str2vals:62053)
ERROR:: problem evaluating argument 1 (90) for Branch 31 (rotatex)
ERROR:: MALLOC PROBLEM for rpn (called from str2vals:62053)
ERROR:: problem evaluating argument 1 (ctip) for Branch 32 (scale)
ERROR:: MALLOC PROBLEM for rpn (called from str2vals:62053)
ERROR:: problem evaluating argument 1 (xtip) for Branch 33 (translate)
ERROR:: MALLOC PROBLEM for rpn (called from str2vals:62053)
ERROR:: problem evaluating argument 1 ($wing) for Branch 34 (store)
ERROR:: MALLOC PROBLEM for rpn (called from str2vals:62053)
ERROR:: problem evaluating argument 1 (0) for Branch 35 (rule)
ERROR:: MALLOC PROBLEM for rpn (called from str2vals:62053)
ERROR:: problem evaluating argument 1 ($tessBody) for Branch 36 (store)
ERROR:: MALLOC PROBLEM for rpn (called from str2vals:62053)
ERROR:: problem evaluating argument 1 ($tessBody) for Branch 37 (restore)
ERROR:: MALLOC PROBLEM for rpn (called from str2vals:62053)
ERROR:: problem evaluating argument 1 ($naca) for Branch 39 (udparg)
ERROR:: MALLOC PROBLEM for rpn (called from str2vals:62053)
ERROR:: problem evaluating argument 1 ($naca) for Branch 40 (udparg)
ERROR:: MALLOC PROBLEM for rpn (called from str2vals:62053)
ERROR:: problem evaluating argument 1 ($naca) for Branch 41 (udparg)
ERROR:: MALLOC PROBLEM for rpn (called from str2vals:62053)
ERROR:: problem evaluating argument 1 ($naca) for Branch 42 (udparg)
ERROR:: MALLOC PROBLEM for rpn (called from str2vals:62053)
ERROR:: problem evaluating argument 1 ($naca) for Branch 43 (udprim)
ERROR:: MALLOC PROBLEM for rpn (called from str2vals:62053)
ERROR:: problem evaluating argument 1 ($params) for Branch 1 (dimension)
ERROR:: MALLOC PROBLEM for rpn (called from str2vals:62053)
ERROR:: problem evaluating argument 2 (0.10) for Branch 2 (set)
ERROR:: MALLOC PROBLEM for rpn (called from str2vals:62053)
ERROR:: problem evaluating argument 2 (sqrt(area*aspect)) for Branch 3 (set)
ERROR:: MALLOC PROBLEM for rpn (called from str2vals:62053)
ERROR:: problem evaluating argument 2 (area/span*2/(taper+1)) for Branch 4 (set)
ERROR:: MALLOC PROBLEM for rpn (called from str2vals:62053)
ERROR:: problem evaluating argument 2 (croot*taper) for Branch 5 (set)
ERROR:: MALLOC PROBLEM for rpn (called from str2vals:62053)
ERROR:: problem evaluating argument 2 ((croot-ctip)/2) for Branch 6 (set)
ERROR:: MALLOC PROBLEM for rpn (called from str2vals:62053)
ERROR:: problem evaluating argument 1 (view:MSES) for Branch 7 (ifthen)
ERROR:: MALLOC PROBLEM for rpn (called from str2vals:62053)
ERROR:: problem evaluating argument 1 ($naca) for Branch 9 (udparg)
ERROR:: MALLOC PROBLEM for rpn (called from str2vals:62053)
ERROR:: problem evaluating argument 1 ($naca) for Branch 10 (udparg)
ERROR:: MALLOC PROBLEM for rpn (called from str2vals:62053)
ERROR:: problem evaluating argument 1 ($naca) for Branch 11 (udparg)
ERROR:: MALLOC PROBLEM for rpn (called from str2vals:62053)
ERROR:: problem evaluating argument 1 ($naca) for Branch 12 (udparg)
ERROR:: MALLOC PROBLEM for rpn (called from str2vals:62053)
ERROR:: problem evaluating argument 1 ($naca) for Branch 13 (udprim)
ERROR:: MALLOC PROBLEM for rpn (called from str2vals:62053)
ERROR:: problem evaluating argument 1 (90) for Branch 14 (rotatex)
ERROR:: MALLOC PROBLEM for rpn (called from str2vals:62053)
ERROR:: problem evaluating argument 1 (ctip) for Branch 15 (scale)
ERROR:: MALLOC PROBLEM for rpn (called from str2vals:62053)
ERROR:: problem evaluating argument 1 (xtip) for Branch 16 (translate)
ERROR:: MALLOC PROBLEM for rpn (called from str2vals:62053)
ERROR:: problem evaluating argument 1 ($wing) for Branch 17 (store)
ERROR:: MALLOC PROBLEM for rpn (called from str2vals:62053)
ERROR:: problem evaluating argument 1 ($naca) for Branch 18 (udparg)
ERROR:: MALLOC PROBLEM for rpn (called from str2vals:62053)
ERROR:: problem evaluating argument 1 ($naca) for Branch 19 (udparg)
ERROR:: MALLOC PROBLEM for rpn (called from str2vals:62053)
ERROR:: problem evaluating argument 1 ($naca) for Branch 20 (udparg)
ERROR:: MALLOC PROBLEM for rpn (called from str2vals:62053)
ERROR:: problem evaluating argument 1 ($naca) for Branch 21 (udparg)
ERROR:: MALLOC PROBLEM for rpn (called from str2vals:62053)
ERROR:: problem evaluating argument 1 ($naca) for Branch 22 (udprim)
ERROR:: MALLOC PROBLEM for rpn (called from str2vals:62053)
ERROR:: problem evaluating argument 1 (90) for Branch 23 (rotatex)
ERROR:: MALLOC PROBLEM for rpn (called from str2vals:62053)
ERROR:: problem evaluating argument 1 (croot) for Branch 24 (scale)
ERROR:: MALLOC PROBLEM for rpn (called from str2vals:62053)
ERROR:: problem evaluating argument 1 ($wing) for Branch 25 (store)
ERROR:: MALLOC PROBLEM for rpn (called from str2vals:62053)
ERROR:: problem evaluating argument 1 ($naca) for Branch 26 (udparg)
ERROR:: MALLOC PROBLEM for rpn (called from str2vals:62053)
ERROR:: problem evaluating argument 1 ($naca) for Branch 27 (udparg)
ERROR:: MALLOC PROBLEM for rpn (called from str2vals:62053)
ERROR:: problem evaluating argument 1 ($naca) for Branch 28 (udparg)
ERROR:: MALLOC PROBLEM for rpn (called from str2vals:62053)
ERROR:: problem evaluating argument 1 ($naca) for Branch 29 (udparg)
ERROR:: MALLOC PROBLEM for rpn (called from str2vals:62053)
ERROR:: problem evaluating argument 1 ($naca) for Branch 30 (udprim)
ERROR:: MALLOC PROBLEM for rpn (called from str2vals:62053)
ERROR:: problem evaluating argument 1 (90) for Branch 31 (rotatex)
ERROR:: MALLOC PROBLEM for rpn (called from str2vals:62053)
ERROR:: problem evaluating argument 1 (ctip) for Branch 32 (scale)
ERROR:: MALLOC PROBLEM for rpn (called from str2vals:62053)
ERROR:: problem evaluating argument 1 (xtip) for Branch 33 (translate)
ERROR:: MALLOC PROBLEM for rpn (called from str2vals:62053)
ERROR:: problem evaluating argument 1 ($wing) for Branch 34 (store)
ERROR:: MALLOC PROBLEM for rpn (called from str2vals:62053)
ERROR:: problem evaluating argument 1 (0) for Branch 35 (rule)
ERROR:: MALLOC PROBLEM for rpn (called from str2vals:62053)
ERROR:: problem evaluating argument 1 ($tessBody) for Branch 36 (store)
ERROR:: MALLOC PROBLEM for rpn (called from str2vals:62053)
ERROR:: problem evaluating argument 1 ($tessBody) for Branch 37 (restore)
ERROR:: MALLOC PROBLEM for rpn (called from str2vals:62053)
ERROR:: problem evaluating argument 1 ($naca) for Branch 39 (udparg)
ERROR:: MALLOC PROBLEM for rpn (called from str2vals:62053)
ERROR:: problem evaluating argument 1 ($naca) for Branch 40 (udparg)
ERROR:: MALLOC PROBLEM for rpn (called from str2vals:62053)
ERROR:: problem evaluating argument 1 ($naca) for Branch 41 (udparg)
ERROR:: MALLOC PROBLEM for rpn (called from str2vals:62053)
ERROR:: problem evaluating argument 1 ($naca) for Branch 42 (udparg)
ERROR:: MALLOC PROBLEM for rpn (called from str2vals:62053)
ERROR:: problem evaluating argument 1 ($naca) for Branch 43 (udprim)
ERROR:: MALLOC PROBLEM for rpn (called from str2vals:62053)
ERROR:: problem evaluating argument 1 ($params) for Branch 1 (dimension)
ERROR:: MALLOC PROBLEM for rpn (called from str2vals:62053)
ERROR:: problem evaluating argument 2 (0.10) for Branch 2 (set)
ERROR:: MALLOC PROBLEM for rpn (called from str2vals:62053)
ERROR:: problem evaluating argument 2 (sqrt(area*aspect)) for Branch 3 (set)
ERROR:: MALLOC PROBLEM for rpn (called from str2vals:62053)
ERROR:: problem evaluating argument 2 (area/span*2/(taper+1)) for Branch 4 (set)
ERROR:: MALLOC PROBLEM for rpn (called from str2vals:62053)
ERROR:: problem evaluating argument 2 (croot*taper) for Branch 5 (set)
ERROR:: MALLOC PROBLEM for rpn (called from str2vals:62053)
ERROR:: problem evaluating argument 2 ((croot-ctip)/2) for Branch 6 (set)
ERROR:: MALLOC PROBLEM for rpn (called from str2vals:62053)
ERROR:: problem evaluating argument 1 (view:MSES) for Branch 7 (ifthen)
ERROR:: MALLOC PROBLEM for rpn (called from str2vals:62053)
ERROR:: problem evaluating argument 1 ($naca) for Branch 9 (udparg)
ERROR:: MALLOC PROBLEM for rpn (called from str2vals:62053)
ERROR:: problem evaluating argument 1 ($naca) for Branch 10 (udparg)
ERROR:: MALLOC PROBLEM for rpn (called from str2vals:62053)
ERROR:: problem evaluating argument 1 ($naca) for Branch 11 (udparg)
ERROR:: MALLOC PROBLEM for rpn (called from str2vals:62053)
ERROR:: problem evaluating argument 1 ($naca) for Branch 12 (udparg)
ERROR:: MALLOC PROBLEM for rpn (called from str2vals:62053)
ERROR:: problem evaluating argument 1 ($naca) for Branch 13 (udprim)
ERROR:: MALLOC PROBLEM for rpn (called from str2vals:62053)
ERROR:: problem evaluating argument 1 (90) for Branch 14 (rotatex)
ERROR:: MALLOC PROBLEM for rpn (called from str2vals:62053)
ERROR:: problem evaluating argument 1 (ctip) for Branch 15 (scale)
ERROR:: MALLOC PROBLEM for rpn (called from str2vals:62053)
ERROR:: problem evaluating argument 1 (xtip) for Branch 16 (translate)
ERROR:: MALLOC PROBLEM for rpn (called from str2vals:62053)
ERROR:: problem evaluating argument 1 ($wing) for Branch 17 (store)
ERROR:: MALLOC PROBLEM for rpn (called from str2vals:62053)
ERROR:: problem evaluating argument 1 ($naca) for Branch 18 (udparg)
ERROR:: MALLOC PROBLEM for rpn (called from str2vals:62053)
ERROR:: problem evaluating argument 1 ($naca) for Branch 19 (udparg)
ERROR:: MALLOC PROBLEM for rpn (called from str2vals:62053)
ERROR:: problem evaluating argument 1 ($naca) for Branch 20 (udparg)
ERROR:: MALLOC PROBLEM for rpn (called from str2vals:62053)
ERROR:: problem evaluating argument 1 ($naca) for Branch 21 (udparg)
ERROR:: MALLOC PROBLEM for rpn (called from str2vals:62053)
ERROR:: problem evaluating argument 1 ($naca) for Branch 22 (udprim)
ERROR:: MALLOC PROBLEM for rpn (called from str2vals:62053)
ERROR:: problem evaluating argument 1 (90) for Branch 23 (rotatex)
ERROR:: MALLOC PROBLEM for rpn (called from str2vals:62053)
ERROR:: problem evaluating argument 1 (croot) for Branch 24 (scale)
ERROR:: MALLOC PROBLEM for rpn (called from str2vals:62053)
ERROR:: problem evaluating argument 1 ($wing) for Branch 25 (store)
ERROR:: MALLOC PROBLEM for rpn (called from str2vals:62053)
ERROR:: problem evaluating argument 1 ($naca) for Branch 26 (udparg)
ERROR:: MALLOC PROBLEM for rpn (called from str2vals:62053)
ERROR:: problem evaluating argument 1 ($naca) for Branch 27 (udparg)
ERROR:: MALLOC PROBLEM for rpn (called from str2vals:62053)
ERROR:: problem evaluating argument 1 ($naca) for Branch 28 (udparg)
ERROR:: MALLOC PROBLEM for rpn (called from str2vals:62053)
ERROR:: problem evaluating argument 1 ($naca) for Branch 29 (udparg)
ERROR:: MALLOC PROBLEM for rpn (called from str2vals:62053)
ERROR:: problem evaluating argument 1 ($naca) for Branch 30 (udprim)
ERROR:: MALLOC PROBLEM for rpn (called from str2vals:62053)
ERROR:: problem evaluating argument 1 (90) for Branch 31 (rotatex)
ERROR:: MALLOC PROBLEM for rpn (called from str2vals:62053)
ERROR:: problem evaluating argument 1 (ctip) for Branch 32 (scale)
ERROR:: MALLOC PROBLEM for rpn (called from str2vals:62053)
ERROR:: problem evaluating argument 1 (xtip) for Branch 33 (translate)
ERROR:: MALLOC PROBLEM for rpn (called from str2vals:62053)
ERROR:: problem evaluating argument 1 ($wing) for Branch 34 (store)
ERROR:: MALLOC PROBLEM for rpn (called from str2vals:62053)
ERROR:: problem evaluating argument 1 (0) for Branch 35 (rule)
ERROR:: MALLOC PROBLEM for rpn (called from str2vals:62053)
ERROR:: problem evaluating argument 1 ($tessBody) for Branch 36 (store)
ERROR:: MALLOC PROBLEM for rpn (called from str2vals:62053)
ERROR:: problem evaluating argument 1 ($tessBody) for Branch 37 (restore)
ERROR:: MALLOC PROBLEM for rpn (called from str2vals:62053)
ERROR:: problem evaluating argument 1 ($naca) for Branch 39 (udparg)
ERROR:: MALLOC PROBLEM for rpn (called from str2vals:62053)
ERROR:: problem evaluating argument 1 ($naca) for Branch 40 (udparg)
ERROR:: MALLOC PROBLEM for rpn (called from str2vals:62053)
ERROR:: problem evaluating argument 1 ($naca) for Branch 41 (udparg)
ERROR:: MALLOC PROBLEM for rpn (called from str2vals:62053)
ERROR:: problem evaluating argument 1 ($naca) for Branch 42 (udparg)
ERROR:: MALLOC PROBLEM for rpn (called from str2vals:62053)
ERROR:: problem evaluating argument 1 ($naca) for Branch 43 (udprim)
ERROR:: MALLOC PROBLEM for rpn (called from str2vals:62053)
ERROR:: problem evaluating argument 1 ($params) for Branch 1 (dimension)
ERROR:: MALLOC PROBLEM for rpn (called from str2vals:62053)
ERROR:: problem evaluating argument 2 (0.10) for Branch 2 (set)
ERROR:: MALLOC PROBLEM for rpn (called from str2vals:62053)
ERROR:: problem evaluating argument 2 (sqrt(area*aspect)) for Branch 3 (set)
ERROR:: MALLOC PROBLEM for rpn (called from str2vals:62053)
ERROR:: problem evaluating argument 2 (area/span*2/(taper+1)) for Branch 4 (set)
ERROR:: MALLOC PROBLEM for rpn (called from str2vals:62053)
ERROR:: problem evaluating argument 2 (croot*taper) for Branch 5 (set)
ERROR:: MALLOC PROBLEM for rpn (called from str2vals:62053)
ERROR:: problem evaluating argument 2 ((croot-ctip)/2) for Branch 6 (set)
ERROR:: MALLOC PROBLEM for rpn (called from str2vals:62053)
ERROR:: problem evaluating argument 1 (view:MSES) for Branch 7 (ifthen)
ERROR:: MALLOC PROBLEM for rpn (called from str2vals:62053)
ERROR:: problem evaluating argument 1 ($naca) for Branch 9 (udparg)
ERROR:: MALLOC PROBLEM for rpn (called from str2vals:62053)
ERROR:: problem evaluating argument 1 ($naca) for Branch 10 (udparg)
ERROR:: MALLOC PROBLEM for rpn (called from str2vals:62053)
ERROR:: problem evaluating argument 1 ($naca) for Branch 11 (udparg)
ERROR:: MALLOC PROBLEM for rpn (called from str2vals:62053)
ERROR:: problem evaluating argument 1 ($naca) for Branch 12 (udparg)
ERROR:: MALLOC PROBLEM for rpn (called from str2vals:62053)
ERROR:: problem evaluating argument 1 ($naca) for Branch 13 (udprim)
ERROR:: MALLOC PROBLEM for rpn (called from str2vals:62053)
ERROR:: problem evaluating argument 1 (90) for Branch 14 (rotatex)
ERROR:: MALLOC PROBLEM for rpn (called from str2vals:62053)
ERROR:: problem evaluating argument 1 (ctip) for Branch 15 (scale)
ERROR:: MALLOC PROBLEM for rpn (called from str2vals:62053)
ERROR:: problem evaluating argument 1 (xtip) for Branch 16 (translate)
ERROR:: MALLOC PROBLEM for rpn (called from str2vals:62053)
ERROR:: problem evaluating argument 1 ($wing) for Branch 17 (store)
ERROR:: MALLOC PROBLEM for rpn (called from str2vals:62053)
ERROR:: problem evaluating argument 1 ($naca) for Branch 18 (udparg)
ERROR:: MALLOC PROBLEM for rpn (called from str2vals:62053)
ERROR:: problem evaluating argument 1 ($naca) for Branch 19 (udparg)
ERROR:: MALLOC PROBLEM for rpn (called from str2vals:62053)
ERROR:: problem evaluating argument 1 ($naca) for Branch 20 (udparg)
ERROR:: MALLOC PROBLEM for rpn (called from str2vals:62053)
ERROR:: problem evaluating argument 1 ($naca) for Branch 21 (udparg)
ERROR:: MALLOC PROBLEM for rpn (called from str2vals:62053)
ERROR:: problem evaluating argument 1 ($naca) for Branch 22 (udprim)
ERROR:: MALLOC PROBLEM for rpn (called from str2vals:62053)
ERROR:: problem evaluating argument 1 (90) for Branch 23 (rotatex)
ERROR:: MALLOC PROBLEM for rpn (called from str2vals:62053)
ERROR:: problem evaluating argument 1 (croot) for Branch 24 (scale)
ERROR:: MALLOC PROBLEM for rpn (called from str2vals:62053)
ERROR:: problem evaluating argument 1 ($wing) for Branch 25 (store)
ERROR:: MALLOC PROBLEM for rpn (called from str2vals:62053)
ERROR:: problem evaluating argument 1 ($naca) for Branch 26 (udparg)
ERROR:: MALLOC PROBLEM for rpn (called from str2vals:62053)
ERROR:: problem evaluating argument 1 ($naca) for Branch 27 (udparg)
ERROR:: MALLOC PROBLEM for rpn (called from str2vals:62053)
ERROR:: problem evaluating argument 1 ($naca) for Branch 28 (udparg)
ERROR:: MALLOC PROBLEM for rpn (called from str2vals:62053)
ERROR:: problem evaluating argument 1 ($naca) for Branch 29 (udparg)
ERROR:: MALLOC PROBLEM for rpn (called from str2vals:62053)
ERROR:: problem evaluating argument 1 ($naca) for Branch 30 (udprim)
ERROR:: MALLOC PROBLEM for rpn (called from str2vals:62053)
ERROR:: problem evaluating argument 1 (90) for Branch 31 (rotatex)
ERROR:: MALLOC PROBLEM for rpn (called from str2vals:62053)
ERROR:: problem evaluating argument 1 (ctip) for Branch 32 (scale)
ERROR:: MALLOC PROBLEM for rpn (called from str2vals:62053)
ERROR:: problem evaluating argument 1 (xtip) for Branch 33 (translate)
ERROR:: MALLOC PROBLEM for rpn (called from str2vals:62053)
ERROR:: problem evaluating argument 1 ($wing) for Branch 34 (store)
ERROR:: MALLOC PROBLEM for rpn (called from str2vals:62053)
ERROR:: problem evaluating argument 1 (0) for Branch 35 (rule)
ERROR:: MALLOC PROBLEM for rpn (called from str2vals:62053)
ERROR:: problem evaluating argument 1 ($tessBody) for Branch 36 (store)
ERROR:: MALLOC PROBLEM for rpn (called from str2vals:62053)
ERROR:: problem evaluating argument 1 ($tessBody) for Branch 37 (restore)
ERROR:: MALLOC PROBLEM for rpn (called from str2vals:62053)
ERROR:: problem evaluating argument 1 ($naca) for Branch 39 (udparg)
ERROR:: MALLOC PROBLEM for rpn (called from str2vals:62053)
ERROR:: problem evaluating argument 1 ($naca) for Branch 40 (udparg)
ERROR:: MALLOC PROBLEM for rpn (called from str2vals:62053)
ERROR:: problem evaluating argument 1 ($naca) for Branch 41 (udparg)
ERROR:: MALLOC PROBLEM for rpn (called from str2vals:62053)
ERROR:: problem evaluating argument 1 ($naca) for Branch 42 (udparg)
ERROR:: MALLOC PROBLEM for rpn (called from str2vals:62053)
ERROR:: problem evaluating argument 1 ($naca) for Branch 43 (udprim)

Getting CFD design variables.......
	Number of design variables - 3
	Design Variable name - camber
	Design Variable name - maxloc
	Design Variable name - thickness
	Done getting CFD design variables
 CAPS Info: Sensitivity FD step 1.000000e-05
 CAPS Info: Sensitivity FD step 1.000000e-05
 CAPS Info: Sensitivity FD step 1.000000e-05
 CAPS Info: Sensitivity FD step 1.000000e-05
 CAPS Info: Sensitivity FD step 1.000000e-05

Getting CFD design variables.......
	Number of design variables - 3
	Design Variable name - camber
	Design Variable name - maxloc
	Design Variable name - thickness
	Done getting CFD design variables
 CAPS Info: Sensitivity FD step 1.000000e-05
 CAPS Info: Sensitivity FD step 1.000000e-05
 CAPS Info: Sensitivity FD step 1.000000e-05
 CAPS Info: Sensitivity FD step 1.000000e-05
 CAPS Info: Sensitivity FD step 1.000000e-05

Getting CFD design variables.......
	Number of design variables - 3
	Design Variable name - camber
	Design Variable name - maxloc
	Design Variable name - thickness
	Done getting CFD design variables
 CAPS Info: Sensitivity FD step 1.000000e-05
 CAPS Info: Sensitivity FD step 1.000000e-05
 CAPS Info: Sensitivity FD step 1.000000e-05
 CAPS Info: Sensitivity FD step 1.000000e-05
 CAPS Info: Sensitivity FD step 1.000000e-05

Objective
---------
   4405.1966144310 newton

Variables
---------
   AR                :       18.1848183556        [-]         aspect ratio                                                            
   Alpha_p20_MSES_0  :       18.2922005538       degree       Angle of Attack + 20deg from MSES, segment 0                            
   Alpha_p20_MSES_1  :       18.6564330391       degree       Angle of Attack + 20deg from MSES, segment 1                            
   Alpha_p20_MSES_2  :       14.0174962666       degree       Angle of Attack + 20deg from MSES, segment 2                            
   C_D_0             :        0.0085736716        [-]         Drag Coefficient, segment 0                                             
   C_D_1             :        0.0088422773        [-]         Drag Coefficient, segment 1                                             
   C_D_2             :        0.0067754033        [-]         Drag Coefficient, segment 2                                             
   C_Dfuse_0         :        0.0019045425        [-]         Fuselage Drag Coefficient, segment 0                                    
   C_Dfuse_1         :        0.0019045425        [-]         Fuselage Drag Coefficient, segment 1                                    
   C_Dfuse_2         :        0.0019045425        [-]         Fuselage Drag Coefficient, segment 2                                    
   C_Di_0            :        0.0043959078        [-]         Induced Drag Coefficient, segment 0                                     
   C_Di_1            :        0.0045180085        [-]         Induced Drag Coefficient, segment 1                                     
   C_Di_2            :        0.0002725705        [-]         Induced Drag Coefficient, segment 2                                     
   C_Dp_0            :        0.0022732213        [-]         Wing Profile Drag Coefficient, segment 0                                
   C_Dp_1            :        0.0024197263        [-]         Wing Profile Drag Coefficient, segment 1                                
   C_Dp_2            :        0.0045982894        [-]         Wing Profile Drag Coefficient, segment 2                                
   C_L_0             :        0.4882875942        [-]         Lift Coefficient, segment 0                                             
   C_L_1             :        0.4943630997        [-]         Lift Coefficient, segment 1                                             
   C_L_2             :        0.1212073837        [-]         Lift Coefficient, segment 2                                             
   C_L_MSES_0        :        0.4882875942        [-]         Lift Coefficient from MSES, segment 0                                   
   C_L_MSES_1        :        0.4943630997        [-]         Lift Coefficient from MSES, segment 1                                   
   C_L_MSES_2        :        0.1212073837        [-]         Lift Coefficient from MSES, segment 2                                   
   I_cap_bar         :        0.0000207179        [-]         Area moment of inertia of cap on 2D cross section, normalized by chord^4
   M_r_bar           :    31546.8392949836       newton       Root Bending unit per unit chord                                        
   P_max             :   969568.9977958364        watt        Maximum Engine Power                                                    
   R                 :     5000.0000066133     kilometer      Single Segment range                                                    
   Re_0              :  4813152.6840300383        [-]         Reynolds Number, segment 0                                              
   Re_1              :  4641640.6968982657        [-]         Reynolds Number, segment 1                                              
   Re_2              :  9603761.0280203428        [-]         Reynolds Number, segment 2                                              
   S                 :       26.2562487043     meter ** 2     total wing area                                                         
   T_0               :      570.5627748495       newton       Thrust, segment 0                                                       
   T_1               :      540.5053766732       newton       Thrust, segment 1                                                       
   T_2               :     1813.9083516895       newton       Thrust, segment 2                                                       
   V_0               :       75.0299619258   meter / second   Velocity, segment 0                                                     
   V_1               :       72.3044636226   meter / second   Velocity, segment 1                                                     
   V_2               :      150.0000063667   meter / second   Velocity, segment 2                                                     
   V_stall           :       37.9930280726   meter / second   stall speed                                                             
   W_0               :    32547.8845654022       newton       Weight, segment 0                                                       
   W_1               :    30401.6392964854       newton       Weight, segment 1                                                       
   W_2               :    32547.8845654022       newton       Weight, segment 2                                                       
   W_MTO             :    34820.6121104940       newton       Maximum Takeoff Weight                                                  
   W_cap             :     4091.9654763224       newton       Weight of Wing Spar Cap                                                 
   W_eng             :     2361.5552837266       newton       Engine Weight                                                           
   W_fuel_out        :     2258.9514654989       newton       Weight of fuel, outbound                                                
   W_fuel_ret        :     2146.2451489320       newton       Weight of fuel, return                                                  
   W_pay             :     4905.0000833740       newton       Payload Weight                                                          
   W_tilde           :    21966.5553786283       newton       Dry Weight, no wing                                                     
   W_web             :      125.5765268863       newton       Weight of Wing Spar Shear Web                                           
   W_wing            :     8435.0837926925       newton       wing weight                                                             
   W_zfw             :    30401.6392039186       newton       Zero Fuel Weight                                                        
   camberLocation    :        0.7421742679        [-]         location of maximum airfoil camber scaled by chord                      
   eta_0_0           :        0.2787915714        [-]         Overall Efficiency, segment 0                                           
   eta_0_1           :        0.2783034714        [-]         Overall Efficiency, segment 1                                           
   eta_0_2           :        0.2825300971        [-]         Overall Efficiency, segment 2                                           
   eta_i_0           :        0.9371145258        [-]         Inviscid Propeller Efficiency, segment 0                                
   eta_i_1           :        0.9354738535        [-]         Inviscid Propeller Efficiency, segment 1                                
   eta_i_2           :        0.9496809988        [-]         Inviscid Propeller Efficiency, segment 2                                
   eta_prop_0        :        0.7965473470        [-]         Propeller Efficiency, segment 0                                         
   eta_prop_1        :        0.7951527755        [-]         Propeller Efficiency, segment 1                                         
   eta_prop_2        :        0.8072288490        [-]         Propeller Efficiency, segment 2                                         
   maxCamber         :        0.0613401870        [-]         maximum airfoil camber scaled by chord                                  
   nu                :        0.7859964219        [-]         Placeholder, (1+lam_w+lam_w**2)/(1+lam_w)**2                            
   p                 :        1.9000000074        [-]         Dummy Variable (1+2*lam_w)                                              
   q                 :        1.4500000123        [-]         Dummy Variable (1+lam_w)                                                
   t_cap_bar         :        0.0046800540        [-]         Spar cap thickness per unit chord                                       
   t_web_bar         :        0.0006371237        [-]         Spar web thickness per unit chord                                       
   tau               :        0.1499092591        [-]         airfoil thickness to chord ratio                                        
   z_bre_0           :        0.0670927385        [-]         Breguet Range Factor, segment 0                                         
   z_bre_1           :        0.0682376990        [-]         Breguet Range Factor, segment 1                                         

Sensitivities
-------------
   Sensitivities not available for optimizations of type Sequential Log Convex Program 

Solve Report
------------
   Solve Method           :  Sequential Log Convex Program 
   Classification         :  Iterative 
   Solver                 :  cvxopt 
   Number of Iterations   :  25 
   Termination Status     :  Converged, magnitude of step (7.11e-08) is witin specified tolerance (1.00e-04) 

Messages
--------
    1. Attempted step of size 1.00e+00 at iteration 1 is too large and is causing a constraint to return as imaginary.  Decreasing according to the tau schedule.
    2. Attempted step of size 1.00e+00 at iteration 7 is too large and is causing a constraint to return as imaginary.  Decreasing according to the tau schedule.
    3. Wolfe Condition 1 failed at iteration 8 (Step 8).  Watchdog counter is 1
    4. Wolfe Condition 1 failed at iteration 11 (Step 11).  Watchdog counter is 1
    5. Attempted step of size 1.00e+00 at iteration 13 is too large and is causing a constraint to return as imaginary.  Decreasing according to the tau schedule.
    6. Wolfe Condition 1 failed at iteration 13 (Step 13).  Watchdog counter is 1
    7. Attempted step of size 1.00e+00 at iteration 14 is too large and is causing a constraint to return as imaginary.  Decreasing according to the tau schedule.
    8. Attempted step of size 1.00e+00 at iteration 15 is too large and is causing a constraint to return as imaginary.  Decreasing according to the tau schedule.
    9. Attempted step of size 3.00e-01 at iteration 15 is too large and is causing a constraint to return as imaginary.  Decreasing according to the tau schedule.
   10. Wolfe Condition 1 failed at iteration 16 (Step 16).  Watchdog counter is 1
   11. Wolfe Condition 1 failed at iteration 18 (Step 18).  Watchdog counter is 1
   12. Wolfe Condition 1 failed at iteration 19 (Step 19).  Watchdog counter is 2
   13. Attempted step of size 3.41e-01 at iteration 20 is too large and is causing a constraint to return as imaginary.  Decreasing according to the tau schedule.
   14. Attempted step of size 2.68e-01 at iteration 23 is too large and is causing a constraint to return as imaginary.  Decreasing according to the tau schedule.
   15. Attempted step of size 8.03e-02 at iteration 23 is too large and is causing a constraint to return as imaginary.  Decreasing according to the tau schedule.
   16. Attempted step of size 2.41e-02 at iteration 23 is too large and is causing a constraint to return as imaginary.  Decreasing according to the tau schedule.
   17. Attempted step of size 7.22e-03 at iteration 23 is too large and is causing a constraint to return as imaginary.  Decreasing according to the tau schedule.
   18. Attempted step of size 2.17e-03 at iteration 23 is too large and is causing a constraint to return as imaginary.  Decreasing according to the tau schedule.
   19. Attempted step of size 2.51e-01 at iteration 24 is too large and is causing a constraint to return as imaginary.  Decreasing according to the tau schedule.
   20. Attempted step of size 7.54e-02 at iteration 24 is too large and is causing a constraint to return as imaginary.  Decreasing according to the tau schedule.
   21. Attempted step of size 2.26e-02 at iteration 24 is too large and is causing a constraint to return as imaginary.  Decreasing according to the tau schedule.
   22. Attempted step of size 6.78e-03 at iteration 24 is too large and is causing a constraint to return as imaginary.  Decreasing according to the tau schedule.
   23. Attempted step of size 2.03e-03 at iteration 24 is too large and is causing a constraint to return as imaginary.  Decreasing according to the tau schedule.
   24. Attempted step of size 6.10e-04 at iteration 24 is too large and is causing a constraint to return as imaginary.  Decreasing according to the tau schedule.
   25. Attempted step of size 1.83e-04 at iteration 24 is too large and is causing a constraint to return as imaginary.  Decreasing according to the tau schedule.
   26. Attempted step of size 5.49e-05 at iteration 24 is too large and is causing a constraint to return as imaginary.  Decreasing according to the tau schedule.
   27. Attempted step of size 1.65e-05 at iteration 24 is too large and is causing a constraint to return as imaginary.  Decreasing according to the tau schedule.
   28. Attempted step of size 4.94e-06 at iteration 24 is too large and is causing a constraint to return as imaginary.  Decreasing according to the tau schedule.
   29. Attempted step of size 1.48e-06 at iteration 24 is too large and is causing a constraint to return as imaginary.  Decreasing according to the tau schedule.
   30. Attempted step of size 4.45e-07 at iteration 24 is too large and is causing a constraint to return as imaginary.  Decreasing according to the tau schedule.
   31. Attempted step of size 1.33e-07 at iteration 24 is too large and is causing a constraint to return as imaginary.  Decreasing according to the tau schedule.
   32. Attempted step of size 4.00e-08 at iteration 24 is too large and is causing a constraint to return as imaginary.  Decreasing according to the tau schedule.
   33. Attempted step of size 1.20e-08 at iteration 24 is too large and is causing a constraint to return as imaginary.  Decreasing according to the tau schedule.
   34. Attempted step of size 3.60e-09 at iteration 24 is too large and is causing a constraint to return as imaginary.  Decreasing according to the tau schedule.
   35. Attempted step of size 1.08e-09 at iteration 24 is too large and is causing a constraint to return as imaginary.  Decreasing according to the tau schedule.
   36. Attempted step of size 3.24e-10 at iteration 24 is too large and is causing a constraint to return as imaginary.  Decreasing according to the tau schedule.
   37. Attempted step of size 9.73e-11 at iteration 24 is too large and is causing a constraint to return as imaginary.  Decreasing according to the tau schedule.
   38. Attempted step of size 2.92e-11 at iteration 24 is too large and is causing a constraint to return as imaginary.  Decreasing according to the tau schedule.
   39. Attempted step of size 8.76e-12 at iteration 24 is too large and is causing a constraint to return as imaginary.  Decreasing according to the tau schedule.
   40. Attempted step of size 2.63e-12 at iteration 24 is too large and is causing a constraint to return as imaginary.  Decreasing according to the tau schedule.
   41. Attempted step of size 7.88e-13 at iteration 24 is too large and is causing a constraint to return as imaginary.  Decreasing according to the tau schedule.
   42. Wolfe Condition 1 failed at iteration 24 (Step 24).  Watchdog counter is 1


real	19m45.084s
user	0m0.436s
sys	0m1.828s
+ status=0
+ set +x

=================================================
CAPS verification (using pyCAPS) case pyCAPS/Camber.py passed (as expected)
=================================================


=================================================
+ echo 'pyCAPS/CMConstraint.py test;'
+ tee -a /c/Users/jenkins/workspace/ESP_RegCaps/7.6/CAPS/CORSAIRLITE/WIN64.2017/ESP/WIN64/examples/regressionTest/pyCAPSlog.txt
pyCAPS/CMConstraint.py test;
+ python -u pyCAPS/CMConstraint.py -outLevel=0
+ tee -a /c/Users/jenkins/workspace/ESP_RegCaps/7.6/CAPS/CORSAIRLITE/WIN64.2017/ESP/WIN64/examples/regressionTest/pyCAPSlog.txt
128 File(s) copied
9 File(s) copied

Getting CFD design variables.......
	Number of design variables - 3
	Design Variable name - camber
	Design Variable name - maxloc
	Design Variable name - thickness
	Done getting CFD design variables
 CAPS Info: Sensitivity FD step 1.000000e-05
 CAPS Info: Sensitivity FD step 1.000000e-05
 CAPS Info: Sensitivity FD step 1.000000e-05
 CAPS Info: Sensitivity FD step 1.000000e-05
 CAPS Info: Sensitivity FD step 1.000000e-05

Getting CFD design variables.......
	Number of design variables - 3
	Design Variable name - camber
	Design Variable name - maxloc
	Design Variable name - thickness
	Done getting CFD design variables
 CAPS Info: Sensitivity FD step 1.000000e-05
 CAPS Info: Sensitivity FD step 1.000000e-05
 CAPS Info: Sensitivity FD step 1.000000e-05
 CAPS Info: Sensitivity FD step 1.000000e-05
 CAPS Info: Sensitivity FD step 1.000000e-05

Getting CFD design variables.......
	Number of design variables - 3
	Design Variable name - camber
	Design Variable name - maxloc
	Design Variable name - thickness
	Done getting CFD design variables
 CAPS Info: Sensitivity FD step 1.000000e-05
 CAPS Info: Sensitivity FD step 1.000000e-05
 CAPS Info: Sensitivity FD step 1.000000e-05
 CAPS Info: Sensitivity FD step 1.000000e-05
 CAPS Info: Sensitivity FD step 1.000000e-05

Getting CFD design variables.......
	Number of design variables - 3
	Design Variable name - camber
	Design Variable name - maxloc
	Design Variable name - thickness
	Done getting CFD design variables
 CAPS Info: Sensitivity FD step 1.000000e-05
 CAPS Info: Sensitivity FD step 1.000000e-05
 CAPS Info: Sensitivity FD step 1.000000e-05
 CAPS Info: Sensitivity FD step 1.000000e-05
 CAPS Info: Sensitivity FD step 1.000000e-05
The system cannot execute the specified program.

Getting CFD design variables.......
	Number of design variables - 3
	Design Variable name - camber
	Design Variable name - maxloc
	Design Variable name - thickness
	Done getting CFD design variables
 CAPS Info: Sensitivity FD step 1.000000e-05
 CAPS Info: Sensitivity FD step 1.000000e-05
 CAPS Info: Sensitivity FD step 1.000000e-05
 CAPS Info: Sensitivity FD step 1.000000e-05
 CAPS Info: Sensitivity FD step 1.000000e-05
The system cannot execute the specified program.

Getting CFD design variables.......
	Number of design variables - 3
	Design Variable name - camber
	Design Variable name - maxloc
	Design Variable name - thickness
	Done getting CFD design variables
 CAPS Info: Sensitivity FD step 1.000000e-05
 CAPS Info: Sensitivity FD step 1.000000e-05
 CAPS Info: Sensitivity FD step 1.000000e-05
 CAPS Info: Sensitivity FD step 1.000000e-05
 CAPS Info: Sensitivity FD step 1.000000e-05

Getting CFD design variables.......
	Number of design variables - 3
	Design Variable name - camber
	Design Variable name - maxloc
	Design Variable name - thickness
	Done getting CFD design variables
 CAPS Info: Sensitivity FD step 1.000000e-05
 CAPS Info: Sensitivity FD step 1.000000e-05
 CAPS Info: Sensitivity FD step 1.000000e-05
 CAPS Info: Sensitivity FD step 1.000000e-05
 CAPS Info: Sensitivity FD step 1.000000e-05
The system cannot execute the specified program.

Getting CFD design variables.......
	Number of design variables - 3
	Design Variable name - camber
	Design Variable name - maxloc
	Design Variable name - thickness
	Done getting CFD design variables
 CAPS Info: Sensitivity FD step 1.000000e-05
 CAPS Info: Sensitivity FD step 1.000000e-05
 CAPS Info: Sensitivity FD step 1.000000e-05
 CAPS Info: Sensitivity FD step 1.000000e-05
 CAPS Info: Sensitivity FD step 1.000000e-05
The system cannot execute the specified program.

Getting CFD design variables.......
	Number of design variables - 3
	Design Variable name - camber
	Design Variable name - maxloc
	Design Variable name - thickness
	Done getting CFD design variables
 CAPS Info: Sensitivity FD step 1.000000e-05
 CAPS Info: Sensitivity FD step 1.000000e-05
 CAPS Info: Sensitivity FD step 1.000000e-05
 CAPS Info: Sensitivity FD step 1.000000e-05
 CAPS Info: Sensitivity FD step 1.000000e-05
The system cannot execute the specified program.

Getting CFD design variables.......
	Number of design variables - 3
	Design Variable name - camber
	Design Variable name - maxloc
	Design Variable name - thickness
	Done getting CFD design variables
 CAPS Info: Sensitivity FD step 1.000000e-05
 CAPS Info: Sensitivity FD step 1.000000e-05
 CAPS Info: Sensitivity FD step 1.000000e-05
 CAPS Info: Sensitivity FD step 1.000000e-05
 CAPS Info: Sensitivity FD step 1.000000e-05
The system cannot execute the specified program.

Getting CFD design variables.......
	Number of design variables - 3
	Design Variable name - camber
	Design Variable name - maxloc
	Design Variable name - thickness
	Done getting CFD design variables
 CAPS Info: Sensitivity FD step 1.000000e-05
 CAPS Info: Sensitivity FD step 1.000000e-05
 CAPS Info: Sensitivity FD step 1.000000e-05
 CAPS Info: Sensitivity FD step 1.000000e-05
 CAPS Info: Sensitivity FD step 1.000000e-05
The system cannot execute the specified program.

Getting CFD design variables.......
	Number of design variables - 3
	Design Variable name - camber
	Design Variable name - maxloc
	Design Variable name - thickness
	Done getting CFD design variables
 CAPS Info: Sensitivity FD step 1.000000e-05
 CAPS Info: Sensitivity FD step 1.000000e-05
 CAPS Info: Sensitivity FD step 1.000000e-05
 CAPS Info: Sensitivity FD step 1.000000e-05
 CAPS Info: Sensitivity FD step 1.000000e-05
The system cannot execute the specified program.

Getting CFD design variables.......
	Number of design variables - 3
	Design Variable name - camber
	Design Variable name - maxloc
	Design Variable name - thickness
	Done getting CFD design variables
 CAPS Info: Sensitivity FD step 1.000000e-05
 CAPS Info: Sensitivity FD step 1.000000e-05
 CAPS Info: Sensitivity FD step 1.000000e-05
 CAPS Info: Sensitivity FD step 1.000000e-05
 CAPS Info: Sensitivity FD step 1.000000e-05

Getting CFD design variables.......
	Number of design variables - 3
	Design Variable name - camber
	Design Variable name - maxloc
	Design Variable name - thickness
	Done getting CFD design variables
 CAPS Info: Sensitivity FD step 1.000000e-05
 CAPS Info: Sensitivity FD step 1.000000e-05
 CAPS Info: Sensitivity FD step 1.000000e-05
 CAPS Info: Sensitivity FD step 1.000000e-05
 CAPS Info: Sensitivity FD step 1.000000e-05
The system cannot execute the specified program.

Getting CFD design variables.......
	Number of design variables - 3
	Design Variable name - camber
	Design Variable name - maxloc
	Design Variable name - thickness
	Done getting CFD design variables
 CAPS Info: Sensitivity FD step 1.000000e-05
 CAPS Info: Sensitivity FD step 1.000000e-05
 CAPS Info: Sensitivity FD step 1.000000e-05
 CAPS Info: Sensitivity FD step 1.000000e-05
 CAPS Info: Sensitivity FD step 1.000000e-05
The system cannot execute the specified program.

Getting CFD design variables.......
	Number of design variables - 3
	Design Variable name - camber
	Design Variable name - maxloc
	Design Variable name - thickness
	Done getting CFD design variables
 CAPS Info: Sensitivity FD step 1.000000e-05
 CAPS Info: Sensitivity FD step 1.000000e-05
 CAPS Info: Sensitivity FD step 1.000000e-05
 CAPS Info: Sensitivity FD step 1.000000e-05
 CAPS Info: Sensitivity FD step 1.000000e-05
The system cannot execute the specified program.

Getting CFD design variables.......
	Number of design variables - 3
	Design Variable name - camber
	Design Variable name - maxloc
	Design Variable name - thickness
	Done getting CFD design variables
 CAPS Info: Sensitivity FD step 1.000000e-05
 CAPS Info: Sensitivity FD step 1.000000e-05
 CAPS Info: Sensitivity FD step 1.000000e-05
 CAPS Info: Sensitivity FD step 1.000000e-05
 CAPS Info: Sensitivity FD step 1.000000e-05
The system cannot execute the specified program.

Getting CFD design variables.......
	Number of design variables - 3
	Design Variable name - camber
	Design Variable name - maxloc
	Design Variable name - thickness
	Done getting CFD design variables
 CAPS Info: Sensitivity FD step 1.000000e-05
 CAPS Info: Sensitivity FD step 1.000000e-05
 CAPS Info: Sensitivity FD step 1.000000e-05
 CAPS Info: Sensitivity FD step 1.000000e-05
 CAPS Info: Sensitivity FD step 1.000000e-05
The system cannot execute the specified program.

Getting CFD design variables.......
	Number of design variables - 3
	Design Variable name - camber
	Design Variable name - maxloc
	Design Variable name - thickness
	Done getting CFD design variables
 CAPS Info: Sensitivity FD step 1.000000e-05
 CAPS Info: Sensitivity FD step 1.000000e-05
 CAPS Info: Sensitivity FD step 1.000000e-05
 CAPS Info: Sensitivity FD step 1.000000e-05
 CAPS Info: Sensitivity FD step 1.000000e-05
The system cannot execute the specified program.

Getting CFD design variables.......
	Number of design variables - 3
	Design Variable name - camber
	Design Variable name - maxloc
	Design Variable name - thickness
	Done getting CFD design variables
 CAPS Info: Sensitivity FD step 1.000000e-05
 CAPS Info: Sensitivity FD step 1.000000e-05
 CAPS Info: Sensitivity FD step 1.000000e-05
 CAPS Info: Sensitivity FD step 1.000000e-05
 CAPS Info: Sensitivity FD step 1.000000e-05
The system cannot execute the specified program.

Getting CFD design variables.......
	Number of design variables - 3
	Design Variable name - camber
	Design Variable name - maxloc
	Design Variable name - thickness
	Done getting CFD design variables
 CAPS Info: Sensitivity FD step 1.000000e-05
 CAPS Info: Sensitivity FD step 1.000000e-05
 CAPS Info: Sensitivity FD step 1.000000e-05
 CAPS Info: Sensitivity FD step 1.000000e-05
 CAPS Info: Sensitivity FD step 1.000000e-05
The system cannot execute the specified program.

Getting CFD design variables.......
	Number of design variables - 3
	Design Variable name - camber
	Design Variable name - maxloc
	Design Variable name - thickness
	Done getting CFD design variables
 CAPS Info: Sensitivity FD step 1.000000e-05
 CAPS Info: Sensitivity FD step 1.000000e-05
 CAPS Info: Sensitivity FD step 1.000000e-05
 CAPS Info: Sensitivity FD step 1.000000e-05
 CAPS Info: Sensitivity FD step 1.000000e-05
The system cannot execute the specified program.

Getting CFD design variables.......
	Number of design variables - 3
	Design Variable name - camber
	Design Variable name - maxloc
	Design Variable name - thickness
	Done getting CFD design variables
 CAPS Info: Sensitivity FD step 1.000000e-05
 CAPS Info: Sensitivity FD step 1.000000e-05
 CAPS Info: Sensitivity FD step 1.000000e-05
 CAPS Info: Sensitivity FD step 1.000000e-05
 CAPS Info: Sensitivity FD step 1.000000e-05
The system cannot execute the specified program.

Getting CFD design variables.......
	Number of design variables - 3
	Design Variable name - camber
	Design Variable name - maxloc
	Design Variable name - thickness
	Done getting CFD design variables
 CAPS Info: Sensitivity FD step 1.000000e-05
 CAPS Info: Sensitivity FD step 1.000000e-05
 CAPS Info: Sensitivity FD step 1.000000e-05
 CAPS Info: Sensitivity FD step 1.000000e-05
 CAPS Info: Sensitivity FD step 1.000000e-05
The system cannot execute the specified program.

Getting CFD design variables.......
	Number of design variables - 3
	Design Variable name - camber
	Design Variable name - maxloc
	Design Variable name - thickness
	Done getting CFD design variables
 CAPS Info: Sensitivity FD step 1.000000e-05
 CAPS Info: Sensitivity FD step 1.000000e-05
 CAPS Info: Sensitivity FD step 1.000000e-05
 CAPS Info: Sensitivity FD step 1.000000e-05
 CAPS Info: Sensitivity FD step 1.000000e-05
The system cannot execute the specified program.

Getting CFD design variables.......
	Number of design variables - 3
	Design Variable name - camber
	Design Variable name - maxloc
	Design Variable name - thickness
	Done getting CFD design variables
 CAPS Info: Sensitivity FD step 1.000000e-05
 CAPS Info: Sensitivity FD step 1.000000e-05
 CAPS Info: Sensitivity FD step 1.000000e-05
 CAPS Info: Sensitivity FD step 1.000000e-05
 CAPS Info: Sensitivity FD step 1.000000e-05
The system cannot execute the specified program.

Getting CFD design variables.......
	Number of design variables - 3
	Design Variable name - camber
	Design Variable name - maxloc
	Design Variable name - thickness
	Done getting CFD design variables
 CAPS Info: Sensitivity FD step 1.000000e-05
 CAPS Info: Sensitivity FD step 1.000000e-05
 CAPS Info: Sensitivity FD step 1.000000e-05
 CAPS Info: Sensitivity FD step 1.000000e-05
 CAPS Info: Sensitivity FD step 1.000000e-05
The system cannot execute the specified program.

Getting CFD design variables.......
	Number of design variables - 3
	Design Variable name - camber
	Design Variable name - maxloc
	Design Variable name - thickness
	Done getting CFD design variables
 CAPS Info: Sensitivity FD step 1.000000e-05
 CAPS Info: Sensitivity FD step 1.000000e-05
 CAPS Info: Sensitivity FD step 1.000000e-05
 CAPS Info: Sensitivity FD step 1.000000e-05
 CAPS Info: Sensitivity FD step 1.000000e-05
The system cannot execute the specified program.

Getting CFD design variables.......
	Number of design variables - 3
	Design Variable name - camber
	Design Variable name - maxloc
	Design Variable name - thickness
	Done getting CFD design variables
 CAPS Info: Sensitivity FD step 1.000000e-05
 CAPS Info: Sensitivity FD step 1.000000e-05
 CAPS Info: Sensitivity FD step 1.000000e-05
 CAPS Info: Sensitivity FD step 1.000000e-05
 CAPS Info: Sensitivity FD step 1.000000e-05
The system cannot execute the specified program.

Getting CFD design variables.......
	Number of design variables - 3
	Design Variable name - camber
	Design Variable name - maxloc
	Design Variable name - thickness
	Done getting CFD design variables
 CAPS Info: Sensitivity FD step 1.000000e-05
 CAPS Info: Sensitivity FD step 1.000000e-05
 CAPS Info: Sensitivity FD step 1.000000e-05
 CAPS Info: Sensitivity FD step 1.000000e-05
 CAPS Info: Sensitivity FD step 1.000000e-05
The system cannot execute the specified program.

Getting CFD design variables.......
	Number of design variables - 3
	Design Variable name - camber
	Design Variable name - maxloc
	Design Variable name - thickness
	Done getting CFD design variables
 CAPS Info: Sensitivity FD step 1.000000e-05
 CAPS Info: Sensitivity FD step 1.000000e-05
 CAPS Info: Sensitivity FD step 1.000000e-05
 CAPS Info: Sensitivity FD step 1.000000e-05
 CAPS Info: Sensitivity FD step 1.000000e-05
The system cannot execute the specified program.

Getting CFD design variables.......
	Number of design variables - 3
	Design Variable name - camber
	Design Variable name - maxloc
	Design Variable name - thickness
	Done getting CFD design variables
 CAPS Info: Sensitivity FD step 1.000000e-05
 CAPS Info: Sensitivity FD step 1.000000e-05
 CAPS Info: Sensitivity FD step 1.000000e-05
 CAPS Info: Sensitivity FD step 1.000000e-05
 CAPS Info: Sensitivity FD step 1.000000e-05
The system cannot execute the specified program.

Getting CFD design variables.......
	Number of design variables - 3
	Design Variable name - camber
	Design Variable name - maxloc
	Design Variable name - thickness
	Done getting CFD design variables
 CAPS Info: Sensitivity FD step 1.000000e-05
 CAPS Info: Sensitivity FD step 1.000000e-05
 CAPS Info: Sensitivity FD step 1.000000e-05
 CAPS Info: Sensitivity FD step 1.000000e-05
 CAPS Info: Sensitivity FD step 1.000000e-05
The system cannot execute the specified program.

Getting CFD design variables.......
	Number of design variables - 3
	Design Variable name - camber
	Design Variable name - maxloc
	Design Variable name - thickness
	Done getting CFD design variables
 CAPS Info: Sensitivity FD step 1.000000e-05
 CAPS Info: Sensitivity FD step 1.000000e-05
 CAPS Info: Sensitivity FD step 1.000000e-05
 CAPS Info: Sensitivity FD step 1.000000e-05
 CAPS Info: Sensitivity FD step 1.000000e-05
The system cannot execute the specified program.

Getting CFD design variables.......
	Number of design variables - 3
	Design Variable name - camber
	Design Variable name - maxloc
	Design Variable name - thickness
	Done getting CFD design variables
 CAPS Info: Sensitivity FD step 1.000000e-05
 CAPS Info: Sensitivity FD step 1.000000e-05
 CAPS Info: Sensitivity FD step 1.000000e-05
 CAPS Info: Sensitivity FD step 1.000000e-05
 CAPS Info: Sensitivity FD step 1.000000e-05
The system cannot execute the specified program.
C:\Users\jenkins\workspace\ESP_RegCaps\7.6\CAPS\CORSAIRLITE\WIN64.2017\CAPS\pyCAPS\corsairlite\core\pint_custom\quantity.py:1190: RuntimeWarning: invalid value encountered in scalar divide
  magnitude = magnitude_op(new_self._magnitude, other._magnitude)
C:\Users\jenkins\workspace\ESP_RegCaps\7.6\CAPS\CORSAIRLITE\WIN64.2017\CAPS\pyCAPS\corsairlite\optimization\solverWrappers\cvxopt\sequentialLogConvexProgram.py:977: RuntimeWarning: invalid value encountered in scalar divide
  BssTB_sTBs = [[Bs[i] * sTB[j]/sTBs for i in range(0,len(Bs))] for j in range(0,len(sTB))]
Build timed out (after 120 minutes). Marking the build as failed.
Build was aborted
[GNU C Compiler (gcc)Clang] Skipping execution of recorder since overall result is 'FAILURE'
[PostBuildScript] - [INFO] Executing post build scripts.
[PostBuildScript] - [INFO] build step #0 should only be executed on MATRIX
[WS-CLEANUP] Deleting project workspace...
[WS-CLEANUP] Skipped based on build state FAILURE
Finished: FAILURE