Console Output

Started by upstream project "SANS_Commit" build number 9280
originally caused by:
 Started by remote host 18.18.33.14
Running as SYSTEM
[EnvInject] - Loading node environment variables.
Building remotely on macys in workspace /Users/jenkins/workspace/SANS_Commit/builddir/release_clang/buildnode/macys
[WS-CLEANUP] Deleting project workspace...
[WS-CLEANUP] Done
The recommended git tool is: NONE
using credential 3614a4cf-01de-4393-97de-73734b7dd5a2
Fetching changes from the remote Git repository
Pruning obsolete local branches
 > JGit fetch # timeout=10
Verifying host key for acdl.mit.edu using /Users/jenkins/.ssh/known_hosts 
Merging Revision dd60591d7579237d6df102511702363f3536c97c (refs/remotes/acdl/darmofal/develop) to acdl/develop, UserMergeOptions{mergeRemote='acdl', mergeTarget='develop', mergeStrategy='DEFAULT', fastForwardMode='FF'}
Checking out Revision dd60591d7579237d6df102511702363f3536c97c (HEAD, acdl/darmofal/develop, acdl/develop)
Commit message: "Fixed a merge conflict in sansBOOM spacetime toy"
Using 'Changelog to branch' strategy.
The recommended git tool is: NONE
using credential 3614a4cf-01de-4393-97de-73734b7dd5a2
The recommended git tool is: NONE
using credential 3614a4cf-01de-4393-97de-73734b7dd5a2
[GitCheckoutListener] Recording commits of 'git ssh://jenkins@acdl.mit.edu/home/svnroot/SANSproto'
[GitCheckoutListener] Found previous build 'SANS_Commit/builddir=release_clang,buildnode=macys #9279' that contains recorded Git commits
[GitCheckoutListener] -> Starting recording of new commits since '8edabd4'
[GitCheckoutListener] -> Multiple parent commits found - storing latest commit of local merge 'dd60591'
[GitCheckoutListener] -> Using parent commit '7bf4f98' of local merge as starting point
[GitCheckoutListener] -> Storing target branch head '9c8b9f6' (second parent of local merge) 
[GitCheckoutListener] -> Recorded 200 new commits
[GitCheckoutListener] -> The latest commit 'dd60591d7579237d6df102511702363f3536c97c' is a merge commit
[GitCheckoutListener] -> Git commit decorator could not be created for SCM 'hudson.plugins.git.GitSCM@126a7c4'
[macys] $ /bin/bash -xe /var/folders/xs/_fh4l1p54zqcl6mbk4zclcfr0000gp/T/jenkins3303226179121745903.sh
+ /bin/bash -ex /Users/jenkins/workspace/SANS_Commit/builddir/release_clang/buildnode/macys/scripts/jenkins/SANS_Commit.sh
+ cd /Users/jenkins/workspace/SANS_Commit/builddir/release_clang/buildnode/macys
+ echo 'Removing any lingering untracked files'
Removing any lingering untracked files
++ git ls-files --others --exclude-standard
+ [[ release_clang == *\c\o\v\e\r\a\g\e* ]]
+ source /Users/jenkins/workspace/SANS_Commit/builddir/release_clang/buildnode/macys/scripts/jenkins/copy_external.sh
+++ hostname
++ [[ macys.mit.edu == \r\e\y\n\o\l\d\s* ]]
+++ hostname
++ [[ macys.mit.edu == \m\a\c\y\s* ]]
++ cp /Users/jenkins/util/SANSexternal/tetgen1.5.0.tar.gz /Users/jenkins/util/SANSexternal/tetgen1.6.0.tar.gz /Users/jenkins/util/SANSexternal/triangle.zip /Users/jenkins/workspace/SANS_Commit/builddir/release_clang/buildnode/macys/external/
+ cmakedir=/Users/jenkins/workspace/SANS_Commit/builddir/release_clang/buildnode/macys/build/release_clang
+ mkdir -p /Users/jenkins/workspace/SANS_Commit/builddir/release_clang/buildnode/macys/build/release_clang
+ cd /Users/jenkins/workspace/SANS_Commit/builddir/release_clang/buildnode/macys/build/release_clang
+ mkdir -p /Users/jenkins/workspace/SANS_Commit/builddir/release_clang/buildnode/macys/build/boosttest
+ rm -rf '/Users/jenkins/workspace/SANS_Commit/builddir/release_clang/buildnode/macys/test/unit/tmp/*'
+ rm -rf '/Users/jenkins/workspace/SANS_Commit/builddir/release_clang/buildnode/macys/test/system/tmp/*'
+ rm -f '/Users/jenkins/workspace/SANS_Commit/builddir/release_clang/buildnode/macys/build/boosttest/*.xml'
+ rm -f /Users/jenkins/workspace/SANS_Commit/builddir/release_clang/buildnode/macys/build/coverage.xml
+ [[ release_clang == *\c\o\v\e\r\a\g\e* ]]
+ CMAKE_ARGS=-DUSE_COTIRE=OFF
++ hostname
+ [[ macys.mit.edu == \r\e\y\n\o\l\d\s ]]
++ hostname
+ [[ macys.mit.edu != \m\a\c\y\s\.\m\i\t\.\e\d\u ]]
+ CMAKE_ARGS='-DUSE_COTIRE=OFF -DUSE_CCACHE=ON -DCCACHE_MAX_SIZE=10G -DCCACHE_CONFIGPATH=/Users/jenkins/SANS_ccache/builddir/release_clang/buildnode/macys'
+ source /Users/jenkins/workspace/SANS_Commit/builddir/release_clang/buildnode/macys/scripts/jenkins/jenkins_env.sh
++ shopt -s nocasematch
+++ pwd
++ dir=/Users/jenkins/workspace/SANS_Commit/builddir/release_clang/buildnode/macys/build/release_clang
+++ basename /Users/jenkins/workspace/SANS_Commit/builddir/release_clang/buildnode/macys/build/release_clang
++ builddir=release_clang
++ export AFLR_VERSION=10.17.5
++ AFLR_VERSION=10.17.5
++ CAS_VERSION=7.6.0
+++ hostname
++ [[ macys.mit.edu == *\r\e\y\n\o\l\d\s* ]]
+++ hostname
++ [[ macys.mit.edu == *\m\a\c\y\s* ]]
++ export PATH=/usr/local/bin:/usr/local/sbin:/usr/local/opt/python/libexec/bin:/usr/bin:/bin:/usr/sbin:/sbin
++ PATH=/usr/local/bin:/usr/local/sbin:/usr/local/opt/python/libexec/bin:/usr/bin:/bin:/usr/sbin:/sbin
++ export LAPACK_DIR=/usr/local/opt/lapack/
++ LAPACK_DIR=/usr/local/opt/lapack/
++ export ESP_DIR=/Users/jenkins/util/ESP/EngSketchPad
++ ESP_DIR=/Users/jenkins/util/ESP/EngSketchPad
++ export CAS_DIR=/Users/jenkins/util/ESP/OpenCASCADE-7.6.0
++ CAS_DIR=/Users/jenkins/util/ESP/OpenCASCADE-7.6.0
++ export AFLR_DIR=/Users/jenkins/util/AFLR/aflr_lib_10.17.5
++ AFLR_DIR=/Users/jenkins/util/AFLR/aflr_lib_10.17.5
+++ ls -d /Users/jenkins/util/PETSc/petsc/install_dir
++ export PETSC_DIR=/Users/jenkins/util/PETSc/petsc/install_dir
++ PETSC_DIR=/Users/jenkins/util/PETSc/petsc/install_dir
++ export PARMETIS_DIR=/Users/jenkins/util/parmetis/parmetis-4.0.3/install
++ PARMETIS_DIR=/Users/jenkins/util/parmetis/parmetis-4.0.3/install
++ export PATH=/Users/jenkins/util/fefloa/bin:/usr/local/bin:/usr/local/sbin:/usr/local/opt/python/libexec/bin:/usr/bin:/bin:/usr/sbin:/sbin
++ PATH=/Users/jenkins/util/fefloa/bin:/usr/local/bin:/usr/local/sbin:/usr/local/opt/python/libexec/bin:/usr/bin:/bin:/usr/sbin:/sbin
++ export Boost_NO_SYSTEM_PATHS=OFF
++ Boost_NO_SYSTEM_PATHS=OFF
++ export ASAN_OPTIONS=detect_odr_violation=0
++ ASAN_OPTIONS=detect_odr_violation=0
++ env
+ source /Users/jenkins/workspace/SANS_Commit/builddir/release_clang/buildnode/macys/scripts/jenkins/cmake_jenkins.sh -DXML_BOOST_CHECK=ON -DUSE_LAPACK=ON -DUSE_COTIRE=OFF -DUSE_CCACHE=ON -DCCACHE_MAX_SIZE=10G -DCCACHE_CONFIGPATH=/Users/jenkins/SANS_ccache/builddir/release_clang/buildnode/macys
+++ git rev-parse --show-toplevel
++ WORKSPACE=/Users/jenkins/workspace/SANS_Commit/builddir/release_clang/buildnode/macys
+++ uname -a
++ [[ Darwin macys.mit.edu 22.1.0 Darwin Kernel Version 22.1.0: Sun Oct  9 20:14:54 PDT 2022; root:xnu-8792.41.9~2/RELEASE_X86_64 x86_64 == \D\a\r\w\i\n* ]]
++ CMAKEARGS=' -DMPIEXEC_MAX_NUMPROCS=2'
+++ hostname
++ [[ macys.mit.edu == \r\e\y\n\o\l\d\s ]]
+++ hostname
++ [[ macys.mit.edu == \m\a\c\y\s* ]]
++ CMAKEARGS=' -DMPIEXEC_MAX_NUMPROCS=2 -DUSE_TETGEN=ON -DUSE_TRIANGLE=ON'
++ cmake -DBoost_NO_SYSTEM_PATHS=OFF -DXDIR_DEFAULT=ON -DUI_CAPSAIM=ON -DUI_OPENCSM_UDF=ON -DMPIEXEC_MAX_NUMPROCS=2 -DUSE_TETGEN=ON -DUSE_TRIANGLE=ON -DXML_BOOST_CHECK=ON -DUSE_LAPACK=ON -DUSE_COTIRE=OFF -DUSE_CCACHE=ON -DCCACHE_MAX_SIZE=10G -DCCACHE_CONFIGPATH=/Users/jenkins/SANS_ccache/builddir/release_clang/buildnode/macys /Users/jenkins/workspace/SANS_Commit/builddir/release_clang/buildnode/macys


         _____ ___    _   _______
        / ___//   |  / | / / ___/
        \__ \/ /| | /  |/ /\__ \ 
       ___/ / ___ |/ /|  /___/ / 
      /____/_/  |_/_/ |_//____/  

 Solution Adaptive Numerical Simulator


-- Could NOT find PkgConfig (missing: PKG_CONFIG_EXECUTABLE) 
-- Found Boost: /usr/local/include (found suitable version "1.80.0", minimum required is "1.50") found components: unit_test_framework iostreams filesystem system mpi serialization regex 
-- Found Boost: /usr/local/include (found version "1.80.0") found components: unit_test_framework iostreams filesystem system mpi serialization python311 numpy311 regex 
-- Found Accelerate BLAS
-- Could NOT find TETGEN (missing: TETGEN_LIBRARIES TETGEN_INCLUDE_DIRS) 
-- Checking for /Users/jenkins/workspace/SANS_Commit/builddir/release_clang/buildnode/macys/external/tetgen1.6.0.tar.gz
-- Using /Users/jenkins/workspace/SANS_Commit/builddir/release_clang/buildnode/macys/external/tetgen1.6.0.tar.gz
-- Could NOT find AVRO (missing: AVRO_LIBRARY) 
-- Checking for /Users/jenkins/workspace/SANS_Commit/builddir/release_clang/buildnode/macys/external/triangle.zip
-- Using /Users/jenkins/workspace/SANS_Commit/builddir/release_clang/buildnode/macys/external/triangle.zip
-- Could NOT find SEACAS (missing: SEACAS_LIBRARIES) 
-- Please install qcachegrind for graphical profiling.
-- Please install massif-visualizer for graphical heap memory usage.
#############################################
#
#  SANS configuration:
#
#        CMAKE_BUILD_TYPE:         Release
#        CMAKE_INSTALL_PREFIX:     /usr/local
#        CMAKE_CXX_COMPILER name:  Clang 14.0.0.14000029 on platform Darwin x86_64
#        CMAKE_CXX_COMPILER path:  /usr/bin/clang++
#
#        CMAKE_CXX_IMPLICIT_INCLUDE_DIRECTORIES:
#                                  
#                                  /Library/Developer/CommandLineTools/SDKs/MacOSX12.3.sdk/usr/include/c++/v1 
#                                  /Library/Developer/CommandLineTools/usr/lib/clang/14.0.0/include 
#                                  /Library/Developer/CommandLineTools/SDKs/MacOSX12.3.sdk/usr/include 
#                                  /Library/Developer/CommandLineTools/usr/include 
#
#        CMAKE_CXX_IMPLICIT_LINK_DIRECTORIES:
#                                  
#                                  /Library/Developer/CommandLineTools/SDKs/MacOSX12.3.sdk/usr/lib 
#
#  Compiler flags used for this build:
#
#        CMAKE_CXX_FLAGS:          -std=c++11 -Wall -Wstrict-aliasing 
#                                  -Wnon-virtual-dtor -pedantic -Wno-variadic-macros 
#                                  -Wno-#pragma-messages -Wno-undefined-var-template -fstrict-aliasing 
#                                  -fPIC 
#
#        CMAKE_CXX_FLAGS_RELEASE:  -O3 -funroll-loops 
#
#  Required dependencies: 
#
#        EGADS -----------> Met with existing library:
#                                Include Directories:
#                                  /Users/jenkins/util/ESP/EngSketchPad/include
#                                Libraries:
#                                  /Users/jenkins/util/ESP/EngSketchPad/lib/libegads.dylib
#
#        Boost -----------> Met with existing library:
#                                Include Directories:
#                                  /usr/local/include
#                                Libraries:
#                                  /usr/local/lib/libboost_unit_test_framework-mt.dylib
#                                  /usr/local/lib/libboost_iostreams-mt.dylib
#                                  /usr/local/lib/libboost_filesystem-mt.dylib
#                                  /usr/local/lib/libboost_system-mt.dylib
#                                  /usr/local/lib/libboost_mpi-mt.dylib
#                                  /usr/local/lib/libboost_serialization-mt.dylib
#                                  /usr/local/lib/libboost_python311-mt.dylib
#                                  /usr/local/lib/libboost_numpy311-mt.dylib
#                                  /usr/local/lib/libboost_regex-mt.dylib
#
#        PYTHON ----------> Met with existing library:
#                                Include Directories:
#                                  /usr/local/opt/python@3.11/Frameworks/Python.framework/Versions/3.11/include/python3.11
#                                Libraries:
#                                  /usr/local/opt/python@3.11/Frameworks/Python.framework/Versions/3.11/lib/libpython3.11.dylib
#
#        NLOPT -----------> Met with existing library:
#                                Include Directories:
#                                  /usr/local/include
#                                Libraries:
#                                  /usr/local/lib/libnlopt.dylib
#
#        SUITESPARSE -----> Met with existing library:
#                                Include Directories:
#                                  /usr/local/include
#                                Libraries:
#                                  /usr/local/lib/libumfpack.dylib
#                                  /usr/local/lib/libamd.dylib
#                                  /usr/local/lib/libcholmod.dylib
#                                  /usr/local/lib/libcamd.dylib
#                                  /usr/local/lib/libcolamd.dylib
#                                  /usr/local/lib/libccolamd.dylib
#                                  /usr/local/lib/libsuitesparseconfig.dylib
#
#        BLAS ------------> Met with existing library:
#                                Include Directories:
#                                Libraries:
#                                  /Library/Developer/CommandLineTools/SDKs/MacOSX.sdk/System/Library/Frameworks/Accelerate.framework
#
#        METIS -----------> Met with existing library:
#                                Include Directories:
#                                  /usr/local/include
#                                Libraries:
#                                  /usr/local/lib/libmetis.dylib
#
#        PARMETIS --------> Met with existing library:
#                                Include Directories:
#                                  /Users/jenkins/util/parmetis/parmetis-4.0.3/install/include
#                                Libraries:
#                                  /Users/jenkins/util/parmetis/parmetis-4.0.3/install/lib/libparmetis.a
#
#  Optional dependencies:
#
#        AFLR ------------> ON. -- Met with existing library:
#                                Include Directories:
#                                  /Users/jenkins/util/AFLR/aflr_lib_10.17.5/src
#                                Libraries:
#                                  /Users/jenkins/util/AFLR/aflr_lib_10.17.5/MacOSX-x86-64/lib/libanbl3.a
#                                  /Users/jenkins/util/AFLR/aflr_lib_10.17.5/MacOSX-x86-64/lib/libbl1.a
#                                  /Users/jenkins/util/AFLR/aflr_lib_10.17.5/MacOSX-x86-64/lib/libaflr4.a
#                                  /Users/jenkins/util/AFLR/aflr_lib_10.17.5/MacOSX-x86-64/lib/libaflr3.a
#                                  /Users/jenkins/util/AFLR/aflr_lib_10.17.5/MacOSX-x86-64/lib/libaflr2c.a
#                                  /Users/jenkins/util/AFLR/aflr_lib_10.17.5/MacOSX-x86-64/lib/libice3.a
#                                  /Users/jenkins/util/AFLR/aflr_lib_10.17.5/MacOSX-x86-64/lib/libice2.a
#                                  /Users/jenkins/util/AFLR/aflr_lib_10.17.5/MacOSX-x86-64/lib/libotb.a
#                                  /Users/jenkins/util/AFLR/aflr_lib_10.17.5/MacOSX-x86-64/lib/libdftr2.a
#                                  /Users/jenkins/util/AFLR/aflr_lib_10.17.5/MacOSX-x86-64/lib/libdftr3.a
#                                  /Users/jenkins/util/AFLR/aflr_lib_10.17.5/MacOSX-x86-64/lib/libsurf_auto_cpp.a
#                                  /Users/jenkins/util/AFLR/aflr_lib_10.17.5/MacOSX-x86-64/lib/libsurf_auto.a
#                                  /Users/jenkins/util/AFLR/aflr_lib_10.17.5/MacOSX-x86-64/lib/libaflr4.a
#                                  /Users/jenkins/util/AFLR/aflr_lib_10.17.5/MacOSX-x86-64/lib/libdgeom.a
#                                  /Users/jenkins/util/AFLR/aflr_lib_10.17.5/MacOSX-x86-64/lib/librec3.a
#                                  /Users/jenkins/util/AFLR/aflr_lib_10.17.5/MacOSX-x86-64/lib/librec2.a
#                                  /Users/jenkins/util/AFLR/aflr_lib_10.17.5/MacOSX-x86-64/lib/libug.a
#                                  /Users/jenkins/util/AFLR/aflr_lib_10.17.5/MacOSX-x86-64/lib/libug3.a
#                                  /Users/jenkins/util/AFLR/aflr_lib_10.17.5/MacOSX-x86-64/lib/libug2.a
#                                  /Users/jenkins/util/AFLR/aflr_lib_10.17.5/MacOSX-x86-64/lib/libuvmap.a
#                                  /Users/jenkins/util/AFLR/aflr_lib_10.17.5/MacOSX-x86-64/lib/libegen.a
#                                  /Users/jenkins/util/AFLR/aflr_lib_10.17.5/MacOSX-x86-64/lib/libqtb.a
#                                  /Users/jenkins/util/AFLR/aflr_lib_10.17.5/MacOSX-x86-64/lib/libug_gq.a
#                                  /Users/jenkins/util/AFLR/aflr_lib_10.17.5/MacOSX-x86-64/lib/libotb.a
#                                  /Users/jenkins/util/AFLR/aflr_lib_10.17.5/MacOSX-x86-64/lib/libug_mp.a
#
#        AVRO ------------> OFF -- Could not find library.
#
#        CAPS ------------> ON. -- Met with existing library:
#                                Include Directories:
#                                  /Users/jenkins/util/ESP/EngSketchPad/include
#                                Libraries:
#                                  /Users/jenkins/util/ESP/EngSketchPad/lib/libaimUtil.a
#                                  /Users/jenkins/util/ESP/EngSketchPad/lib/libocsm.dylib
#                                  /Users/jenkins/util/ESP/EngSketchPad/lib/libudunits2.dylib
#
#        LAPACK ----------> ON. -- Met with existing library:
#                                Libraries:
#                                  /Library/Developer/CommandLineTools/SDKs/MacOSX.sdk/System/Library/Frameworks/Accelerate.framework
#
#        MKL -------------> OFF.
#
#        PETSC -----------> ON. -- Met with existing library:
#                                Include Directories:
#                                  /Users/jenkins/util/PETSc/petsc/install_dir/include
#                                Libraries:
#                                  /Users/jenkins/util/PETSc/petsc/install_dir/lib/libpetsc.dylib
#
#        REFINE ----------> OFF.
#
#        SEACAS ----------> OFF -- Could not find library.
#
#        TETGEN ----------> ON. -- Met with internal build. -- Could not find library.
#                                Include Directories:
#                                  /Users/jenkins/workspace/SANS_Commit/builddir/release_clang/buildnode/macys/build/release_clang/libtetgen-prefix/src/libtetgen
#                                Libraries:
#                                  /Users/jenkins/workspace/SANS_Commit/builddir/release_clang/buildnode/macys/build/release_clang/libtetgen-prefix/src/libtetgen-build/libtet.a
#
#        TRIANGLE --------> ON. -- Met with internal build. -- Could not find library.
#                                Include Directories:
#                                  /Users/jenkins/workspace/SANS_Commit/builddir/release_clang/buildnode/macys/build/release_clang/libtriangle-prefix/src/libtriangle
#                                Libraries:
#                                  /Users/jenkins/workspace/SANS_Commit/builddir/release_clang/buildnode/macys/build/release_clang/libtriangle-prefix/src/libtriangle/libtriangle.a
#
#        MPI -------------> ON. -- Met with existing library:
#                                Include Directories:
#                                  /usr/local/Cellar/open-mpi/4.1.4_2/include
#                                Libraries:
#                                  /usr/local/Cellar/open-mpi/4.1.4_2/lib/libmpi.dylib
#                                mpiexec:
#                                  /usr/local/bin/mpiexec
#
#############################################


-- Configuring done
-- Generating done
-- Build files have been written to: /Users/jenkins/workspace/SANS_Commit/builddir/release_clang/buildnode/macys/build/release_clang

real	2m19.700s
user	0m20.464s
sys	0m31.243s
+ cp /Users/jenkins/workspace/SANS_Commit/builddir/release_clang/buildnode/macys/scripts/jenkins/Makefile.parallel .
+ nproc=2
+ [[ release_clang == *\i\n\t\e\l* ]]
+ [[ release_clang == *\c\o\v\e\r\a\g\e* ]]
+ make -f Makefile.parallel depends
make libmeshb > libmeshb.out
make libtriangle > libtriangle.out
make libtetgen > libtetgen.out
make libmeshb
Built target libmeshb

real	0m5.392s
user	0m5.278s
sys	0m0.082s
make libtriangle
Built target libtriangle

real	0m5.391s
user	0m5.299s
sys	0m0.077s
make libtetgen
Built target libtetgen

real	0m5.494s
user	0m5.400s
sys	0m0.077s

real	0m20.253s
user	0m20.149s
sys	0m0.556s
+ make -j 2 -f Makefile.parallel headercheck
make gmshLib_headercheck > gmshLib_headercheck.out
make EGADSLib_headercheck > EGADSLib_headercheck.out
make BlockLinAlgLib_headercheck > BlockLinAlgLib_headercheck.out
make PorousMediaLib_headercheck > PorousMediaLib_headercheck.out
make QuaternionLib_headercheck > QuaternionLib_headercheck.out
make ElementFieldLib_headercheck > ElementFieldLib_headercheck.out
make toolsLib_headercheck > toolsLib_headercheck.out
make pdeLib_headercheck > pdeLib_headercheck.out
make BasisFunctionLib_headercheck > BasisFunctionLib_headercheck.out
make AnalyticMetricLib_headercheck > AnalyticMetricLib_headercheck.out
make ArtificialViscosityLib_headercheck > ArtificialViscosityLib_headercheck.out
make ugridLib_headercheck > ugridLib_headercheck.out
make LorenzLib_headercheck > LorenzLib_headercheck.out
make EGTessLib_headercheck > EGTessLib_headercheck.out
make PanelMethodLib_headercheck > PanelMethodLib_headercheck.out
make EmbeddingLib_headercheck > EmbeddingLib_headercheck.out
make XFieldLib_headercheck > XFieldLib_headercheck.out
make TCNELib_headercheck > TCNELib_headercheck.out
make SurrealLib_headercheck > SurrealLib_headercheck.out
make FullPotentialLib_headercheck > FullPotentialLib_headercheck.out
make PointwiseLib_headercheck > PointwiseLib_headercheck.out
make FieldLib_headercheck > FieldLib_headercheck.out
make MPILib_headercheck > MPILib_headercheck.out
make HSMLib_headercheck > HSMLib_headercheck.out
make NSLib_headercheck > NSLib_headercheck.out
make DistanceLib_headercheck > DistanceLib_headercheck.out
make SparseLinAlgLib_headercheck > SparseLinAlgLib_headercheck.out
make TetGenLib_headercheck > TetGenLib_headercheck.out
make sansBOOMLib_headercheck > sansBOOMLib_headercheck.out
make AdvectionDiffusionLib_headercheck > AdvectionDiffusionLib_headercheck.out
make CauchyRiemannLib_headercheck > CauchyRiemannLib_headercheck.out
make DenseLinAlgLib_headercheck > DenseLinAlgLib_headercheck.out
make NDConvertLib_headercheck > NDConvertLib_headercheck.out
make libMeshbLib_headercheck > libMeshbLib_headercheck.out
make UnitGridsLib_headercheck > UnitGridsLib_headercheck.out
make MetricLib_headercheck > MetricLib_headercheck.out
make PythonLib_headercheck > PythonLib_headercheck.out
make LIPSolverLib_headercheck > LIPSolverLib_headercheck.out
make BodyForceSolverLib_headercheck > BodyForceSolverLib_headercheck.out
make StokesLib_headercheck > StokesLib_headercheck.out
make FieldCGLib_headercheck > FieldCGLib_headercheck.out
make FieldEGLib_headercheck > FieldEGLib_headercheck.out
make pdeSensorLib_headercheck > pdeSensorLib_headercheck.out
make Discretization_headercheck > Discretization_headercheck.out
make NonLinearSolverLib_headercheck > NonLinearSolverLib_headercheck.out
make FieldDGLib_headercheck > FieldDGLib_headercheck.out
make QuadratureLib_headercheck > QuadratureLib_headercheck.out
make ErrorEstimateLib_headercheck > ErrorEstimateLib_headercheck.out
make XField1DLib_headercheck > XField1DLib_headercheck.out
make AxisymmetricNSLib_headercheck > AxisymmetricNSLib_headercheck.out
make ContinuationLib_headercheck > ContinuationLib_headercheck.out
make AdaptationLib_headercheck > AdaptationLib_headercheck.out
make ShallowWaterLib_headercheck > ShallowWaterLib_headercheck.out
make AnalyticFunctionLib_headercheck > AnalyticFunctionLib_headercheck.out
make OutputFunctionalLib_headercheck > OutputFunctionalLib_headercheck.out
make LinearAlgebraLib_headercheck > LinearAlgebraLib_headercheck.out
make sansBOOM2DLib_headercheck > sansBOOM2DLib_headercheck.out
make IBL_Lib_headercheck > IBL_Lib_headercheck.out
make sansBOOM2DLib_headercheck
Built target libtriangle
Built target libtetgen
Building CXX object src/pde/sansBOOM2D/CMakeFiles/sansBOOM2DLib_headercheck.dir/BCsansBOOM2D.h.cxx.o
Building CXX object src/pde/sansBOOM2D/CMakeFiles/sansBOOM2DLib_headercheck.dir/ICsansBOOM2D.h.cxx.o
In file included from /Users/jenkins/workspace/SANS_Commit/builddir/release_clang/buildnode/macys/build/release_clang/src/pde/sansBOOM2D/BCsansBOOM2D.h.cxx:2:
In file included from /Users/jenkins/workspace/SANS_Commit/builddir/release_clang/buildnode/macys/src/pde/sansBOOM2D/BCsansBOOM2D.h:21:
/Users/jenkins/workspace/SANS_Commit/builddir/release_clang/buildnode/macys/src/pde/sansBOOM2D/PDEsansBOOM2D.h:414:46: error: reference to non-static member function must be called
    source(H, tau, sig, time, q, qtau, qsig, source);
                                             ^~~~~~
/Users/jenkins/workspace/SANS_Commit/builddir/release_clang/buildnode/macys/src/pde/sansBOOM2D/PDEsansBOOM2D.h:407:8: note: possible target for call
  void source(
       ^
/Users/jenkins/workspace/SANS_Commit/builddir/release_clang/buildnode/macys/src/pde/sansBOOM2D/PDEsansBOOM2D.h:393:8: note: possible target for call
  void source(
       ^
1 error generated.
make[4]: *** [src/pde/sansBOOM2D/CMakeFiles/sansBOOM2DLib_headercheck.dir/BCsansBOOM2D.h.cxx.o] Error 1
make[3]: *** [src/pde/sansBOOM2D/CMakeFiles/sansBOOM2DLib_headercheck.dir/all] Error 2
make[2]: *** [src/pde/sansBOOM2D/CMakeFiles/sansBOOM2DLib_headercheck.dir/rule] Error 2
make[1]: *** [sansBOOM2DLib_headercheck] Error 2

real	0m7.522s
user	0m8.027s
sys	0m0.813s
make: *** [sansBOOM2DLib_headercheck] Error 1
make: *** Waiting for unfinished jobs....
Build step 'Execute shell' marked build as failure
[GNU C Compiler (gcc)ClangIntel Compiler (C, Fortran)Vera++] Skipping execution of recorder since overall result is 'FAILURE'
INFO: Processing BoostTest-1.x (default)
INFO: [BoostTest-1.x (default)] - No test report file(s) were found with the pattern 'build/boosttest/*.xml' relative to '/Users/jenkins/workspace/SANS_Commit/builddir/release_clang/buildnode/macys' for the testing framework 'BoostTest-1.x (default)'.
Did you enter a pattern relative to (and within) the workspace directory?
Did you generate the result report(s) for 'BoostTest-1.x (default)'?"
WARNING: All test reports are empty.
INFO: Check 'Failed Tests' threshold.
INFO: Check 'Skipped Tests' threshold.
[Checks API] No suitable checks publisher found.
INFO: Setting the build status to org.jenkinsci.plugins.xunit.XUnitProcessorResult@8ac482f
[Cobertura] Skipping Cobertura coverage report as build was not SUCCESS or better ...

Finished: FAILURE