Console Output

Skipping 1,321 KB.. Full Log
322/907 Test #322: HField_CG_btest ..................................................................................   Passed    0.13 sec
        Start 323: HField_DG_btest
323/907 Test #323: HField_DG_btest ..................................................................................   Passed    0.13 sec
        Start 324: NormalField_btest
324/907 Test #324: NormalField_btest ................................................................................   Passed    8.19 sec
        Start 325: ProjectGlobalField_btest
325/907 Test #325: ProjectGlobalField_btest .........................................................................   Passed    1.19 sec
        Start 326: ProjectSolnCell_Continuous_btest
326/907 Test #326: ProjectSolnCell_Continuous_btest .................................................................   Passed    0.11 sec
        Start 327: ProjectSolnCell_Discontinuous_btest
327/907 Test #327: ProjectSolnCell_Discontinuous_btest ..............................................................   Passed    0.16 sec
        Start 328: Project_DG_to_CG_btest
328/907 Test #328: Project_DG_to_CG_btest ...........................................................................   Passed    0.87 sec
        Start 329: XField1D_Curved_btest
329/907 Test #329: XField1D_Curved_btest ............................................................................   Passed    0.06 sec
        Start 330: XField1D_Line_btest
330/907 Test #330: XField1D_Line_btest ..............................................................................   Passed    0.06 sec
        Start 331: XField2D_Curved_btest
331/907 Test #331: XField2D_Curved_btest ............................................................................   Passed    0.13 sec
        Start 332: XField2D_Curvilinear_btest
332/907 Test #332: XField2D_Curvilinear_btest .......................................................................   Passed    0.11 sec
        Start 333: XField2D_Line_Curved_btest
333/907 Test #333: XField2D_Line_Curved_btest .......................................................................   Passed    0.07 sec
        Start 334: XField2D_Line_btest
334/907 Test #334: XField2D_Line_btest ..............................................................................   Passed    0.08 sec
        Start 335: XField2D_Triangle_btest
335/907 Test #335: XField2D_Triangle_btest ..........................................................................   Passed    0.08 sec
        Start 336: XField3D_Curved_Hex_btest
336/907 Test #336: XField3D_Curved_Hex_btest ........................................................................   Passed    9.31 sec
        Start 337: XField3D_Curved_Tet_btest
337/907 Test #337: XField3D_Curved_Tet_btest ........................................................................   Passed    1.19 sec
        Start 338: XField3D_Triangle_btest
338/907 Test #338: XField3D_Triangle_btest ..........................................................................   Passed    0.10 sec
        Start 339: XFieldAssociativityArea_Triangle_btest
339/907 Test #339: XFieldAssociativityArea_Triangle_btest ...........................................................   Passed    0.09 sec
        Start 340: XField_BoundaryTrace_btest
340/907 Test #340: XField_BoundaryTrace_btest .......................................................................   Passed    0.12 sec
        Start 341: XField_CellToTrace_btest
341/907 Test #341: XField_CellToTrace_btest .........................................................................   Passed    0.08 sec
        Start 342: XField_Lagrange_Partition_btest
342/907 Test #342: XField_Lagrange_Partition_btest ..................................................................   Passed    0.14 sec
        Start 343: XField_Lagrange_btest
343/907 Test #343: XField_Lagrange_btest ............................................................................   Passed    0.15 sec
        Start 344: for_each_BoundaryFieldTraceGroup_Cell_btest
344/907 Test #344: for_each_BoundaryFieldTraceGroup_Cell_btest ......................................................   Passed    0.12 sec
        Start 345: for_each_InteriorFieldTraceGroup_Cell_btest
345/907 Test #345: for_each_InteriorFieldTraceGroup_Cell_btest ......................................................   Passed    0.12 sec
        Start 346: BoundingBox_btest
346/907 Test #346: BoundingBox_btest ................................................................................   Passed    0.06 sec
        Start 347: ElementArea_Quad_btest
347/907 Test #347: ElementArea_Quad_btest ...........................................................................   Passed    4.90 sec
        Start 348: ElementArea_Triangle_btest
348/907 Test #348: ElementArea_Triangle_btest .......................................................................   Passed   16.07 sec
        Start 349: ElementAssociativityArea_Quad_btest
349/907 Test #349: ElementAssociativityArea_Quad_btest ..............................................................   Passed    0.09 sec
        Start 350: ElementAssociativityArea_Triangle_btest
350/907 Test #350: ElementAssociativityArea_Triangle_btest ..........................................................   Passed    0.07 sec
        Start 351: ElementAssociativityLine_btest
351/907 Test #351: ElementAssociativityLine_btest ...................................................................   Passed    0.06 sec
        Start 352: ElementAssociativityNode_btest
352/907 Test #352: ElementAssociativityNode_btest ...................................................................   Passed    0.05 sec
        Start 353: ElementAssociativitySpacetime_Pentatope_btest
353/907 Test #353: ElementAssociativitySpacetime_Pentatope_btest ....................................................   Passed    0.16 sec
        Start 354: ElementAssociativityVolume_Hexahedron_btest
354/907 Test #354: ElementAssociativityVolume_Hexahedron_btest ......................................................   Passed    0.09 sec
        Start 355: ElementAssociativityVolume_Tetrahedron_btest
355/907 Test #355: ElementAssociativityVolume_Tetrahedron_btest .....................................................   Passed    0.06 sec
        Start 356: ElementIntegral_Functional_btest
356/907 Test #356: ElementIntegral_Functional_btest .................................................................   Passed    0.09 sec
        Start 357: ElementLine_btest
357/907 Test #357: ElementLine_btest ................................................................................   Passed    0.16 sec
        Start 358: ElementNode_btest
358/907 Test #358: ElementNode_btest ................................................................................   Passed    0.07 sec
        Start 359: ElementPointData_btest
359/907 Test #359: ElementPointData_btest ...........................................................................   Passed    0.11 sec
        Start 360: ElementProjection_L2_Line_btest
360/907 Test #360: ElementProjection_L2_Line_btest ..................................................................   Passed    0.07 sec
        Start 361: ElementProjection_L2_Pentatope_btest
361/907 Test #361: ElementProjection_L2_Pentatope_btest .............................................................   Passed    0.17 sec
        Start 362: ElementProjection_L2_Tet_btest
362/907 Test #362: ElementProjection_L2_Tet_btest ...................................................................   Passed    0.07 sec
        Start 363: ElementProjection_L2_Triangle_btest
363/907 Test #363: ElementProjection_L2_Triangle_btest ..............................................................   Passed    0.14 sec
        Start 364: ElementProjection_Specialization_L2_Triangle_btest
364/907 Test #364: ElementProjection_Specialization_L2_Triangle_btest ...............................................   Passed    0.08 sec
        Start 365: ElementSpacetime_Pentatope_btest
365/907 Test #365: ElementSpacetime_Pentatope_btest .................................................................   Passed    3.29 sec
        Start 366: ElementTuple_btest
366/907 Test #366: ElementTuple_btest ...............................................................................   Passed    0.08 sec
        Start 367: ElementVolume_Hexahedron_Cache_Hierarchical_btest
367/907 Test #367: ElementVolume_Hexahedron_Cache_Hierarchical_btest ................................................   Passed    6.02 sec
        Start 368: ElementVolume_Hexahedron_Cache_Lagrange_btest
368/907 Test #368: ElementVolume_Hexahedron_Cache_Lagrange_btest ....................................................   Passed  141.50 sec
        Start 369: ElementVolume_Hexahedron_Cache_Legendre_btest
369/907 Test #369: ElementVolume_Hexahedron_Cache_Legendre_btest ....................................................   Passed   65.35 sec
        Start 370: ElementVolume_Hexahedron_btest
370/907 Test #370: ElementVolume_Hexahedron_btest ...................................................................   Passed    0.10 sec
        Start 371: ElementVolume_Tetrahedron_btest
371/907 Test #371: ElementVolume_Tetrahedron_btest ..................................................................   Passed   16.41 sec
        Start 372: ElementXFieldAreaBase_Quad_btest
372/907 Test #372: ElementXFieldAreaBase_Quad_btest .................................................................   Passed    0.10 sec
        Start 373: ElementXFieldAreaBase_Triangle_btest
373/907 Test #373: ElementXFieldAreaBase_Triangle_btest .............................................................   Passed    0.09 sec
        Start 374: ElementXFieldArea_2D_Quad_btest
374/907 Test #374: ElementXFieldArea_2D_Quad_btest ..................................................................   Passed    0.07 sec
        Start 375: ElementXFieldArea_2D_Triangle_btest
375/907 Test #375: ElementXFieldArea_2D_Triangle_btest ..............................................................   Passed    0.10 sec
        Start 376: ElementXFieldArea_3D_Quad_btest
376/907 Test #376: ElementXFieldArea_3D_Quad_btest ..................................................................   Passed    0.08 sec
        Start 377: ElementXFieldArea_3D_Triangle_btest
377/907 Test #377: ElementXFieldArea_3D_Triangle_btest ..............................................................   Passed    0.09 sec
        Start 378: ElementXFieldLineBase_btest
378/907 Test #378: ElementXFieldLineBase_btest ......................................................................   Passed    0.08 sec
        Start 379: ElementXFieldLine_1D_btest
379/907 Test #379: ElementXFieldLine_1D_btest .......................................................................   Passed    0.06 sec
        Start 380: ElementXFieldLine_2D_btest
380/907 Test #380: ElementXFieldLine_2D_btest .......................................................................   Passed    0.07 sec
        Start 381: ElementXFieldSpacetime_Pentatope_btest
381/907 Test #381: ElementXFieldSpacetime_Pentatope_btest ...........................................................   Passed    0.14 sec
        Start 382: ElementXFieldVolume_4D_Tetrahedron_btest
382/907 Test #382: ElementXFieldVolume_4D_Tetrahedron_btest .........................................................   Passed    0.16 sec
        Start 383: ElementXFieldVolume_Hexahedron_btest
383/907 Test #383: ElementXFieldVolume_Hexahedron_btest .............................................................   Passed    0.11 sec
        Start 384: ElementXFieldVolume_Tetrahedron_btest
384/907 Test #384: ElementXFieldVolume_Tetrahedron_btest ............................................................   Passed    0.14 sec
        Start 385: RefCoordSolver_btest
385/907 Test #385: RefCoordSolver_btest .............................................................................   Passed    0.16 sec
        Start 386: ReferenceElementMesh_btest
386/907 Test #386: ReferenceElementMesh_btest .......................................................................   Passed    0.14 sec
        Start 387: UniqueElem_btest
387/907 Test #387: UniqueElem_btest .................................................................................   Passed    0.06 sec
        Start 388: Field1D_LocalPatch_Edge_CG_btest
388/907 Test #388: Field1D_LocalPatch_Edge_CG_btest .................................................................   Passed    0.09 sec
        Start 389: Field1D_LocalPatch_Element_DG_btest
389/907 Test #389: Field1D_LocalPatch_Element_DG_btest ..............................................................   Passed    0.13 sec
        Start 390: Field2D_LocalPatch_Edge_CG_btest
390/907 Test #390: Field2D_LocalPatch_Edge_CG_btest .................................................................   Passed    2.24 sec
        Start 391: Field2D_LocalPatch_Element_DG_btest
391/907 Test #391: Field2D_LocalPatch_Element_DG_btest ..............................................................   Passed    0.24 sec
        Start 392: Field3D_LocalPatch_Edge_CG_btest
392/907 Test #392: Field3D_LocalPatch_Edge_CG_btest .................................................................   Passed    8.62 sec
        Start 393: Field3D_LocalPatch_Element_DG_btest
393/907 Test #393: Field3D_LocalPatch_Element_DG_btest ..............................................................   Passed   16.19 sec
        Start 394: Field4D_LocalPatch_Edge_CG_btest
394/907 Test #394: Field4D_LocalPatch_Edge_CG_btest .................................................................   Passed    2.95 sec
        Start 395: Field4D_LocalPatch_Element_DG_btest
395/907 Test #395: Field4D_LocalPatch_Element_DG_btest ..............................................................   Passed   10.88 sec
        Start 396: XField1D_LocalPatch_Edge_CG_btest
396/907 Test #396: XField1D_LocalPatch_Edge_CG_btest ................................................................   Passed    0.09 sec
        Start 397: XField1D_LocalPatch_Element_CG_btest
397/907 Test #397: XField1D_LocalPatch_Element_CG_btest .............................................................   Passed    0.07 sec
        Start 398: XField1D_LocalPatch_Element_DG_btest
398/907 Test #398: XField1D_LocalPatch_Element_DG_btest .............................................................   Passed    0.09 sec
        Start 399: XField2D_LocalPatch_Edge_CG_btest
399/907 Test #399: XField2D_LocalPatch_Edge_CG_btest ................................................................   Passed    0.14 sec
        Start 400: XField2D_LocalPatch_Element_CG_btest
400/907 Test #400: XField2D_LocalPatch_Element_CG_btest .............................................................   Passed    0.16 sec
        Start 401: XField2D_LocalPatch_Element_DG_btest
401/907 Test #401: XField2D_LocalPatch_Element_DG_btest .............................................................   Passed    0.46 sec
        Start 402: XField3D_LocalPatch_Edge_CG_btest
402/907 Test #402: XField3D_LocalPatch_Edge_CG_btest ................................................................   Passed    1.36 sec
        Start 403: XField3D_LocalPatch_Element_CG_btest
403/907 Test #403: XField3D_LocalPatch_Element_CG_btest .............................................................   Passed    3.41 sec
        Start 404: XField3D_LocalPatch_Element_DG_btest
404/907 Test #404: XField3D_LocalPatch_Element_DG_btest .............................................................   Passed    1.16 sec
        Start 405: XField4D_LocalPatch_Element_CG_btest
405/907 Test #405: XField4D_LocalPatch_Element_CG_btest .............................................................   Passed    1.73 sec
        Start 406: XField4D_LocalPatch_Element_DG_btest
406/907 Test #406: XField4D_LocalPatch_Element_DG_btest .............................................................   Passed    0.63 sec
        Start 407: XField_LocalPatch_HighOrderTet_btest
407/907 Test #407: XField_LocalPatch_HighOrderTet_btest .............................................................   Passed    9.36 sec
        Start 408: XField_LocalPatch_HighOrderTriangle_btest
408/907 Test #408: XField_LocalPatch_HighOrderTriangle_btest ........................................................   Passed    1.16 sec
        Start 409: XField_LocalPatch_Line_btest
409/907 Test #409: XField_LocalPatch_Line_btest .....................................................................   Passed    0.08 sec
        Start 410: XField_LocalPatch_Pentatope_btest
410/907 Test #410: XField_LocalPatch_Pentatope_btest ................................................................   Passed    0.17 sec
        Start 411: XField_LocalPatch_Simplex_forCG_btest
411/907 Test #411: XField_LocalPatch_Simplex_forCG_btest ............................................................   Passed    0.28 sec
        Start 412: XField_LocalPatch_Simplex_forDG_btest
412/907 Test #412: XField_LocalPatch_Simplex_forDG_btest ............................................................   Passed    0.27 sec
        Start 413: XField_LocalPatch_Tet_btest
413/907 Test #413: XField_LocalPatch_Tet_btest ......................................................................   Passed    6.29 sec
        Start 414: XField_LocalPatch_Triangle_btest
414/907 Test #414: XField_LocalPatch_Triangle_btest .................................................................   Passed    0.27 sec
        Start 415: MatrixBlock_2x2_Decompose_LUP_btest
415/907 Test #415: MatrixBlock_2x2_Decompose_LUP_btest ..............................................................   Passed    0.07 sec
        Start 416: MatrixBlock_2x2_Decompose_LU_btest
416/907 Test #416: MatrixBlock_2x2_Decompose_LU_btest ...............................................................   Passed    0.06 sec
        Start 417: MatrixBlock_2x2_DenseMatrix_btest
417/907 Test #417: MatrixBlock_2x2_DenseMatrix_btest ................................................................   Passed    0.07 sec
        Start 418: MatrixBlock_2x2_InverseLUP_btest
418/907 Test #418: MatrixBlock_2x2_InverseLUP_btest .................................................................   Passed    0.08 sec
        Start 419: MatrixBlock_2x2_InverseLU_btest
419/907 Test #419: MatrixBlock_2x2_InverseLU_btest ..................................................................   Passed    0.09 sec
        Start 420: MatrixBlock_2x2_SparseMatrix_CRS_btest
420/907 Test #420: MatrixBlock_2x2_SparseMatrix_CRS_btest ...........................................................   Passed    0.07 sec
        Start 421: MatrixBlock_2x2_Transpose_btest
421/907 Test #421: MatrixBlock_2x2_Transpose_btest ..................................................................   Passed    0.06 sec
        Start 422: MatrixBlock_3x3_DenseMatrix_btest
422/907 Test #422: MatrixBlock_3x3_DenseMatrix_btest ................................................................   Passed    0.05 sec
        Start 423: MatrixBlock_3x3_SparseMatrix_CRS_btest
423/907 Test #423: MatrixBlock_3x3_SparseMatrix_CRS_btest ...........................................................   Passed    0.06 sec
        Start 424: MatrixBlock_4x4_SparseMatrix_CRS_btest
424/907 Test #424: MatrixBlock_4x4_SparseMatrix_CRS_btest ...........................................................   Passed    0.07 sec
        Start 425: VectorBlock_2_DenseVector_btest
425/907 Test #425: VectorBlock_2_DenseVector_btest ..................................................................   Passed    0.06 sec
        Start 426: VectorBlock_2_SparseVector_btest
426/907 Test #426: VectorBlock_2_SparseVector_btest .................................................................   Passed    0.06 sec
        Start 427: VectorBlock_3_DenseVector_btest
427/907 Test #427: VectorBlock_3_DenseVector_btest ..................................................................   Passed    0.05 sec
        Start 428: VectorBlock_4_btest
428/907 Test #428: VectorBlock_4_btest ..............................................................................   Passed    0.05 sec
        Start 429: DenseLinAlg_MatrixUtil_btest
429/907 Test #429: DenseLinAlg_MatrixUtil_btest .....................................................................   Passed    0.06 sec
        Start 430: MatrixDView_btest
430/907 Test #430: MatrixDView_btest ................................................................................   Passed    0.07 sec
        Start 431: MatrixD_Array_btest
431/907 Test #431: MatrixD_Array_btest ..............................................................................   Passed    0.05 sec
        Start 432: MatrixD_BlockView_btest
432/907 Test #432: MatrixD_BlockView_btest ..........................................................................   Passed    0.06 sec
        Start 433: MatrixD_Decompose_LUP_btest
433/907 Test #433: MatrixD_Decompose_LUP_btest ......................................................................   Passed    0.06 sec
        Start 434: MatrixD_Decompose_LU_btest
434/907 Test #434: MatrixD_Decompose_LU_btest .......................................................................   Passed    0.07 sec
        Start 435: MatrixD_Det_btest
435/907 Test #435: MatrixD_Det_btest ................................................................................   Passed    0.06 sec
        Start 436: MatrixD_Diag_btest
436/907 Test #436: MatrixD_Diag_btest ...............................................................................   Passed    0.06 sec
        Start 437: MatrixD_InverseLUP_btest
437/907 Test #437: MatrixD_InverseLUP_btest .........................................................................   Passed    0.10 sec
        Start 438: MatrixD_InverseLU_btest
438/907 Test #438: MatrixD_InverseLU_btest ..........................................................................   Passed    0.09 sec
        Start 439: MatrixD_InverseQR_btest
439/907 Test #439: MatrixD_InverseQR_btest ..........................................................................   Passed    0.10 sec
        Start 440: MatrixD_LAPACK_btest
440/907 Test #440: MatrixD_LAPACK_btest .............................................................................   Passed    0.06 sec
        Start 441: MatrixD_Mul_Native_btest
441/907 Test #441: MatrixD_Mul_Native_btest .........................................................................   Passed    0.08 sec
        Start 442: MatrixD_NonZeroPattern_btest
442/907 Test #442: MatrixD_NonZeroPattern_btest .....................................................................   Passed    0.07 sec
        Start 443: MatrixD_Transpose_btest
443/907 Test #443: MatrixD_Transpose_btest ..........................................................................   Passed    0.06 sec
        Start 444: MatrixD_Tuple_btest
444/907 Test #444: MatrixD_Tuple_btest ..............................................................................   Passed    0.07 sec
        Start 445: MatrixD_btest
445/907 Test #445: MatrixD_btest ....................................................................................   Passed    0.07 sec
        Start 446: MatrixD_of_MatrixS_btest
446/907 Test #446: MatrixD_of_MatrixS_btest .........................................................................   Passed    0.08 sec
        Start 447: MatrixS_Decompose_LUP_btest
447/907 Test #447: MatrixS_Decompose_LUP_btest ......................................................................   Passed    0.07 sec
        Start 448: MatrixS_Decompose_LU_btest
448/907 Test #448: MatrixS_Decompose_LU_btest .......................................................................   Passed    0.06 sec
        Start 449: MatrixS_Decompose_QR_btest
449/907 Test #449: MatrixS_Decompose_QR_btest .......................................................................   Passed    0.06 sec
        Start 450: MatrixS_Det_btest
450/907 Test #450: MatrixS_Det_btest ................................................................................   Passed    0.06 sec
        Start 451: MatrixS_Diag_btest
451/907 Test #451: MatrixS_Diag_btest ...............................................................................   Passed    0.06 sec
        Start 452: MatrixS_FrobNorm_btest
452/907 Test #452: MatrixS_FrobNorm_btest ...........................................................................   Passed    0.06 sec
        Start 453: MatrixS_InverseLUP_btest
453/907 Test #453: MatrixS_InverseLUP_btest .........................................................................   Passed    0.08 sec
        Start 454: MatrixS_InverseLU_btest
454/907 Test #454: MatrixS_InverseLU_btest ..........................................................................   Passed    0.09 sec
        Start 455: MatrixS_InverseQR_btest
455/907 Test #455: MatrixS_InverseQR_btest ..........................................................................   Passed    0.08 sec
        Start 456: MatrixS_LpNorm_btest
456/907 Test #456: MatrixS_LpNorm_btest .............................................................................   Passed    0.06 sec
        Start 457: MatrixS_MatrixUtil_btest
457/907 Test #457: MatrixS_MatrixUtil_btest .........................................................................   Passed    0.06 sec
        Start 458: MatrixS_Mul_Native_btest
458/907 Test #458: MatrixS_Mul_Native_btest .........................................................................   Passed    0.08 sec
        Start 459: MatrixS_SVD_btest
459/907 Test #459: MatrixS_SVD_btest ................................................................................   Passed    0.06 sec
        Start 460: MatrixS_SurrealD_btest
460/907 Test #460: MatrixS_SurrealD_btest ...........................................................................   Passed    0.07 sec
        Start 461: MatrixS_SurrealS_btest
461/907 Test #461: MatrixS_SurrealS_btest ...........................................................................   Passed    0.06 sec
        Start 462: MatrixS_Trace_btest
462/907 Test #462: MatrixS_Trace_btest ..............................................................................   Passed    0.07 sec
        Start 463: MatrixS_Transpose_btest
463/907 Test #463: MatrixS_Transpose_btest ..........................................................................   Passed    0.06 sec
        Start 464: MatrixS_btest
464/907 Test #464: MatrixS_btest ....................................................................................   Passed    0.07 sec
        Start 465: MatrixS_of_MatrixS_btest
465/907 Test #465: MatrixS_of_MatrixS_btest .........................................................................   Passed    0.06 sec
        Start 466: MatrixSymS_Decompose_Cholesky_btest
466/907 Test #466: MatrixSymS_Decompose_Cholesky_btest ..............................................................   Passed    0.06 sec
        Start 467: MatrixSymS_Decompose_LDLT_btest
467/907 Test #467: MatrixSymS_Decompose_LDLT_btest ..................................................................   Passed    0.05 sec
        Start 468: MatrixSymS_Eigen_btest
468/907 Test #468: MatrixSymS_Eigen_btest ...........................................................................   Passed    0.07 sec
        Start 469: MatrixSymS_Exp_btest
469/907 Test #469: MatrixSymS_Exp_btest .............................................................................   Passed    0.06 sec
        Start 470: MatrixSymS_InverseCholesky_btest
470/907 Test #470: MatrixSymS_InverseCholesky_btest .................................................................   Passed    0.08 sec
        Start 471: MatrixSymS_InverseLDLT_btest
471/907 Test #471: MatrixSymS_InverseLDLT_btest .....................................................................   Passed    0.09 sec
        Start 472: MatrixSymS_Log_btest
472/907 Test #472: MatrixSymS_Log_btest .............................................................................   Passed    0.07 sec
        Start 473: MatrixSymS_Pow_btest
473/907 Test #473: MatrixSymS_Pow_btest .............................................................................   Passed    0.06 sec
        Start 474: MatrixSymS_SurrealS_btest
474/907 Test #474: MatrixSymS_SurrealS_btest ........................................................................   Passed    0.06 sec
        Start 475: MatrixSymS_btest
475/907 Test #475: MatrixSymS_btest .................................................................................   Passed    0.07 sec
        Start 476: VectorD_DenseVectorSize_btest
476/907 Test #476: VectorD_DenseVectorSize_btest ....................................................................   Passed    0.06 sec
        Start 477: VectorD_btest
477/907 Test #477: VectorD_btest ....................................................................................   Passed    0.06 sec
        Start 478: VectorD_dot_btest
478/907 Test #478: VectorD_dot_btest ................................................................................   Passed    0.06 sec
        Start 479: VectorD_norm_btest
479/907 Test #479: VectorD_norm_btest ...............................................................................   Passed    0.06 sec
        Start 480: VectorS_InnerProduct_btest
480/907 Test #480: VectorS_InnerProduct_btest .......................................................................   Passed    0.06 sec
        Start 481: VectorS_OuterProduct_btest
481/907 Test #481: VectorS_OuterProduct_btest .......................................................................   Passed    0.06 sec
        Start 482: VectorS_SurrealD_btest
482/907 Test #482: VectorS_SurrealD_btest ...........................................................................   Passed    0.06 sec
        Start 483: VectorS_SurrealD_deriv_btest
483/907 Test #483: VectorS_SurrealD_deriv_btest .....................................................................   Passed    0.05 sec
        Start 484: VectorS_SurrealS_btest
484/907 Test #484: VectorS_SurrealS_btest ...........................................................................   Passed    0.06 sec
        Start 485: VectorS_SurrealS_deriv_btest
485/907 Test #485: VectorS_SurrealS_deriv_btest .....................................................................   Passed    0.06 sec
        Start 486: VectorS_btest
486/907 Test #486: VectorS_btest ....................................................................................   Passed    0.06 sec
        Start 487: VectorS_cross_btest
487/907 Test #487: VectorS_cross_btest ..............................................................................   Passed    0.06 sec
        Start 488: VectorS_dot_btest
488/907 Test #488: VectorS_dot_btest ................................................................................   Passed    0.06 sec
        Start 489: VectorS_norm_btest
489/907 Test #489: VectorS_norm_btest ...............................................................................   Passed    0.07 sec
        Start 490: FGMRES_btest
490/907 Test #490: FGMRES_btest .....................................................................................   Passed    0.08 sec
        Start 491: ILU0_btest
491/907 Test #491: ILU0_btest .......................................................................................   Passed    0.07 sec
        Start 492: LU_SGS_btest
492/907 Test #492: LU_SGS_btest .....................................................................................   Passed    0.08 sec
        Start 493: LinearSolver_btest
493/907 Test #493: LinearSolver_btest ...............................................................................   Passed    0.10 sec
        Start 494: MatrixD_SparseMatrix_CRS_MatrixD_MatrixS_btest
494/907 Test #494: MatrixD_SparseMatrix_CRS_MatrixD_MatrixS_btest ...................................................   Passed    0.06 sec
        Start 495: MatrixD_SparseMatrix_CRS_MatrixD_btest
495/907 Test #495: MatrixD_SparseMatrix_CRS_MatrixD_btest ...........................................................   Passed    0.06 sec
        Start 496: MatrixD_SparseMatrix_CRS_MatrixS_btest
496/907 Test #496: MatrixD_SparseMatrix_CRS_MatrixS_btest ...........................................................   Passed    0.06 sec
        Start 497: MatrixD_SparseMatrix_CRS_Real_btest
497/907 Test #497: MatrixD_SparseMatrix_CRS_Real_btest ..............................................................   Passed    0.06 sec
        Start 498: SparseMatrix_CRS_MatrixD_MatrixS_btest
498/907 Test #498: SparseMatrix_CRS_MatrixD_MatrixS_btest ...........................................................   Passed    0.06 sec
        Start 499: SparseMatrix_CRS_MatrixD_btest
499/907 Test #499: SparseMatrix_CRS_MatrixD_btest ...................................................................   Passed    0.06 sec
        Start 500: SparseMatrix_CRS_MatrixS_btest
500/907 Test #500: SparseMatrix_CRS_MatrixS_btest ...................................................................   Passed    0.06 sec
        Start 501: SparseMatrix_CRS_Real_btest
501/907 Test #501: SparseMatrix_CRS_Real_btest ......................................................................   Passed    0.07 sec
        Start 502: SparseMatrix_Diag_btest
502/907 Test #502: SparseMatrix_Diag_btest ..........................................................................   Passed    0.06 sec
        Start 503: SparseVector_Real_btest
503/907 Test #503: SparseVector_Real_btest ..........................................................................   Passed    0.06 sec
        Start 504: SparseVector_VectorD_VectorS_btest
504/907 Test #504: SparseVector_VectorD_VectorS_btest ...............................................................   Passed    0.06 sec
        Start 505: SparseVector_VectorD_btest
505/907 Test #505: SparseVector_VectorD_btest .......................................................................   Passed    0.06 sec
        Start 506: SparseVector_VectorS_btest
506/907 Test #506: SparseVector_VectorS_btest .......................................................................   Passed    0.07 sec
        Start 507: UMFPACK_btest
507/907 Test #507: UMFPACK_btest ....................................................................................   Passed    0.10 sec
        Start 508: VectorD_SparseVector_Real_btest
508/907 Test #508: VectorD_SparseVector_Real_btest ..................................................................   Passed    0.07 sec
        Start 509: VectorD_SparseVector_VectorD_btest
509/907 Test #509: VectorD_SparseVector_VectorD_btest ...............................................................   Passed    0.07 sec
        Start 510: VectorD_SparseVector_VectorS_btest
510/907 Test #510: VectorD_SparseVector_VectorS_btest ...............................................................   Passed    0.06 sec
        Start 511: PETSc_LinearSolver_btest
511/907 Test #511: PETSc_LinearSolver_btest .........................................................................   Passed    0.11 sec
        Start 512: PETSc_MDF_Ordering_btest
512/907 Test #512: PETSc_MDF_Ordering_btest .........................................................................   Passed    0.09 sec
        Start 513: PETSc_btest
513/907 Test #513: PETSc_btest ......................................................................................   Passed    0.11 sec
        Start 514: AFLR2_btest
514/907 Test #514: AFLR2_btest ......................................................................................   Passed    0.13 sec
        Start 515: AFLR3_btest
515/907 Test #515: AFLR3_btest ......................................................................................   Passed    5.88 sec
        Start 516: MetricAnalytical_btest
516/907 Test #516: MetricAnalytical_btest ...........................................................................   Passed    0.06 sec
        Start 517: CamberBlade_btest
517/907 Test #517: CamberBlade_btest ................................................................................   Passed    4.90 sec
        Start 518: CubicCamber_btest
518/907 Test #518: CubicCamber_btest ................................................................................   Passed    0.07 sec
        Start 519: EGApproximate_btest
519/907 Test #519: EGApproximate_btest ..............................................................................   Passed    0.10 sec
        Start 520: EGBody_btest
520/907 Test #520: EGBody_btest .....................................................................................   Passed    0.08 sec
        Start 521: EGContext_btest
521/907 Test #521: EGContext_btest ..................................................................................   Passed    0.09 sec
        Start 522: EGEdge_btest
522/907 Test #522: EGEdge_btest .....................................................................................   Passed    0.07 sec
        Start 523: EGFace_btest
523/907 Test #523: EGFace_btest .....................................................................................   Passed    0.09 sec
        Start 524: EGLine_btest
524/907 Test #524: EGLine_btest .....................................................................................   Passed    0.07 sec
        Start 525: EGLoop_btest
525/907 Test #525: EGLoop_btest .....................................................................................   Passed    0.07 sec
        Start 526: EGModel_btest
526/907 Test #526: EGModel_btest ....................................................................................   Passed    0.07 sec
        Start 527: EGNode_btest
527/907 Test #527: EGNode_btest .....................................................................................   Passed    0.07 sec
        Start 528: EGObject_btest
528/907 Test #528: EGObject_btest ...................................................................................   Passed    0.07 sec
        Start 529: Generated_btest
529/907 Test #529: Generated_btest ..................................................................................   Passed    0.08 sec
        Start 530: QuadCamber_btest
530/907 Test #530: QuadCamber_btest .................................................................................   Passed    0.07 sec
        Start 531: ThicknessNACA6_btest
531/907 Test #531: ThicknessNACA6_btest .............................................................................   Passed    0.08 sec
        Start 532: transform_btest
532/907 Test #532: transform_btest ..................................................................................   Passed    0.08 sec
        Start 533: EGTessEdge_btest
533/907 Test #533: EGTessEdge_btest .................................................................................   Passed    0.07 sec
        Start 534: EGTessModel_btest
534/907 Test #534: EGTessModel_btest ................................................................................   Passed    0.27 sec
        Start 535: EGTessellation_btest
535/907 Test #535: EGTessellation_btest .............................................................................   Passed    0.11 sec
        Start 536: MesherInterface_Embedding_btest
536/907 Test #536: MesherInterface_Embedding_btest ..................................................................   Passed    0.11 sec
        Start 537: MesherInterface_Epic_btest
537/907 Test #537: MesherInterface_Epic_btest .......................................................................   Passed    0.35 sec
        Start 538: WriteMeshMetric_Epic_btest
538/907 Test #538: WriteMeshMetric_Epic_btest .......................................................................   Passed    0.20 sec
        Start 539: WriteSolution_PX_btest
539/907 Test #539: WriteSolution_PX_btest ...........................................................................   Passed    0.26 sec
        Start 540: XField_PX_btest
540/907 Test #540: XField_PX_btest ..................................................................................   Passed    0.97 sec
        Start 541: EGTetGen_btest
541/907 Test #541: EGTetGen_btest ...................................................................................   Passed    0.95 sec
        Start 542: makeTetGenModel_btest
542/907 Test #542: makeTetGenModel_btest ............................................................................   Passed    6.82 sec
        Start 543: makeWakedAirfoil_btest
543/907 Test #543: makeWakedAirfoil_btest ...........................................................................   Passed    0.22 sec
        Start 544: MetricOps_btest
544/907 Test #544: MetricOps_btest ..................................................................................   Passed    0.08 sec
        Start 545: MesherInterface_Poitwise_btest
545/907 Test #545: MesherInterface_Poitwise_btest ...................................................................   Passed    0.15 sec
        Start 546: Write_PointwisePCD_btest
546/907 Test #546: Write_PointwisePCD_btest .........................................................................   Passed    0.13 sec
        Start 547: refine2D_btest
547/907 Test #547: refine2D_btest ...................................................................................   Passed   10.26 sec
        Start 548: refine3D_btest
548/907 Test #548: refine3D_btest ...................................................................................   Passed   57.85 sec
        Start 549: ReadSolution_libMeshb_btest
549/907 Test #549: ReadSolution_libMeshb_btest ......................................................................   Passed    0.16 sec
        Start 550: WriteMesh_libMeshb_btest
550/907 Test #550: WriteMesh_libMeshb_btest .........................................................................   Passed    0.12 sec
        Start 551: WriteSolution_libMeshb_btest
551/907 Test #551: WriteSolution_libMeshb_btest .....................................................................   Passed    0.12 sec
        Start 552: XField_libMeshb_btest
552/907 Test #552: XField_libMeshb_btest ............................................................................   Passed    0.16 sec
        Start 553: MesherInterface_FeFloa_btest
553/907 Test #553: MesherInterface_FeFloa_btest .....................................................................   Passed    0.17 sec
        Start 554: XField_gmsh_btest
554/907 Test #554: XField_gmsh_btest ................................................................................   Passed    3.96 sec
        Start 555: XField_ugrid_btest
555/907 Test #555: XField_ugrid_btest ...............................................................................   Passed    0.15 sec
        Start 556: XField1D_btest
556/907 Test #556: XField1D_btest ...................................................................................   Passed    0.07 sec
        Start 557: HalvingSearchLineUpdate_btest
557/907 Test #557: HalvingSearchLineUpdate_btest ....................................................................   Passed    0.08 sec
        Start 558: NewtonSolver_Parameters_btest
558/907 Test #558: NewtonSolver_Parameters_btest ....................................................................   Passed    0.09 sec
        Start 559: NewtonSolver_btest
559/907 Test #559: NewtonSolver_btest ...............................................................................   Passed    0.20 sec
        Start 560: ScalarGoldenSearchLineUpdate_btest
560/907 Test #560: ScalarGoldenSearchLineUpdate_btest ...............................................................   Passed    0.09 sec
        Start 561: PiecewiseConstSourcePanel_FlatPlate3D_btest
561/907 Test #561: PiecewiseConstSourcePanel_FlatPlate3D_btest ......................................................   Passed    0.11 sec
        Start 562: XfoilPanelEquationSet_btest
562/907 Test #562: XfoilPanelEquationSet_btest ......................................................................   Passed    0.10 sec
        Start 563: XfoilPanel_btest
563/907 Test #563: XfoilPanel_btest .................................................................................   Passed    0.09 sec
        Start 564: OutputCell_SolutionErrorL2_btest
564/907 Test #564: OutputCell_SolutionErrorL2_btest .................................................................   Passed    0.07 sec
        Start 565: OutputCell_SolutionErrorSquared_btest
565/907 Test #565: OutputCell_SolutionErrorSquared_btest ............................................................   Passed    0.06 sec
        Start 566: OutputCell_SolutionSquared_btest
566/907 Test #566: OutputCell_SolutionSquared_btest .................................................................   Passed    0.07 sec
        Start 567: OutputCell_Solution_btest
567/907 Test #567: OutputCell_Solution_btest ........................................................................   Passed    0.06 sec
        Start 568: OutputCell_WeightedSolution_btest
568/907 Test #568: OutputCell_WeightedSolution_btest ................................................................   Passed    0.07 sec
        Start 569: AdvectionDiffusion_Sensor_btest
569/907 Test #569: AdvectionDiffusion_Sensor_btest ..................................................................   Passed    0.06 sec
        Start 570: AdvectiveFlux1D_btest
570/907 Test #570: AdvectiveFlux1D_btest ............................................................................   Passed    0.07 sec
        Start 571: AdvectiveFlux2D_btest
571/907 Test #571: AdvectiveFlux2D_btest ............................................................................   Passed    0.06 sec
        Start 572: AdvectiveFlux3D_btest
572/907 Test #572: AdvectiveFlux3D_btest ............................................................................   Passed    0.06 sec
        Start 573: BCAdvectionDiffusion1D_btest
573/907 Test #573: BCAdvectionDiffusion1D_btest .....................................................................   Passed    0.08 sec
        Start 574: BCAdvectionDiffusion2D_btest
574/907 Test #574: BCAdvectionDiffusion2D_btest .....................................................................   Passed    0.10 sec
        Start 575: ForcingFunction1D_MMS_btest
575/907 Test #575: ForcingFunction1D_MMS_btest ......................................................................   Passed    0.07 sec
        Start 576: ForcingFunction2D_MMS_btest
576/907 Test #576: ForcingFunction2D_MMS_btest ......................................................................   Passed    0.06 sec
        Start 577: ForcingFunction2D_btest
577/907 Test #577: ForcingFunction2D_btest ..........................................................................   Passed    0.07 sec
        Start 578: ForcingFunction3D_MMS_btest
578/907 Test #578: ForcingFunction3D_MMS_btest ......................................................................   Passed    0.06 sec
        Start 579: ForcingFunction3D_btest
579/907 Test #579: ForcingFunction3D_btest ..........................................................................   Passed    0.07 sec
        Start 580: OutputAdvectionDiffusion_btest
580/907 Test #580: OutputAdvectionDiffusion_btest ...................................................................   Passed    0.06 sec
        Start 581: PDEAdvectionDiffusion1D_btest
581/907 Test #581: PDEAdvectionDiffusion1D_btest ....................................................................   Passed    0.08 sec
        Start 582: PDEAdvectionDiffusion2D_btest
582/907 Test #582: PDEAdvectionDiffusion2D_btest ....................................................................   Passed    0.07 sec
        Start 583: PDEAdvectionDiffusion3D_btest
583/907 Test #583: PDEAdvectionDiffusion3D_btest ....................................................................   Passed    0.08 sec
        Start 584: PDEAdvectionDiffusion_ArtificialViscosity2D_btest
584/907 Test #584: PDEAdvectionDiffusion_ArtificialViscosity2D_btest ................................................   Passed    0.07 sec
        Start 585: Source1D_btest
585/907 Test #585: Source1D_btest ...................................................................................   Passed    0.07 sec
        Start 586: Source2D_btest
586/907 Test #586: Source2D_btest ...................................................................................   Passed    0.07 sec
        Start 587: Source3D_btest
587/907 Test #587: Source3D_btest ...................................................................................   Passed    0.06 sec
        Start 588: ViscousFlux1D_btest
588/907 Test #588: ViscousFlux1D_btest ..............................................................................   Passed    0.07 sec
        Start 589: ViscousFlux2D_btest
589/907 Test #589: ViscousFlux2D_btest ..............................................................................   Passed    0.06 sec
        Start 590: ViscousFlux3D_btest
590/907 Test #590: ViscousFlux3D_btest ..............................................................................   Passed    0.07 sec
        Start 591: AVSensor_AdvectiveFlux1D_btest
591/907 Test #591: AVSensor_AdvectiveFlux1D_btest ...................................................................   Passed    0.06 sec
        Start 592: AVSensor_AdvectiveFlux2D_btest
592/907 Test #592: AVSensor_AdvectiveFlux2D_btest ...................................................................   Passed    0.07 sec
        Start 593: AVSensor_Source1D_Euler_btest
593/907 Test #593: AVSensor_Source1D_Euler_btest ....................................................................   Passed    0.09 sec
        Start 594: AVSensor_Source1D_btest
594/907 Test #594: AVSensor_Source1D_btest ..........................................................................   Passed    0.07 sec
        Start 595: AVSensor_Source2D_Euler_btest
595/907 Test #595: AVSensor_Source2D_Euler_btest ....................................................................   Passed    0.14 sec
        Start 596: AVSensor_Source2D_TwoPhase_btest
596/907 Test #596: AVSensor_Source2D_TwoPhase_btest .................................................................   Passed    0.06 sec
        Start 597: AVSensor_Source3D_Euler_btest
597/907 Test #597: AVSensor_Source3D_Euler_btest ....................................................................   Passed    0.29 sec
        Start 598: AVSensor_ViscousFlux1D_btest
598/907 Test #598: AVSensor_ViscousFlux1D_btest .....................................................................   Passed    0.08 sec
        Start 599: AVSensor_ViscousFlux2D_btest
599/907 Test #599: AVSensor_ViscousFlux2D_btest .....................................................................   Passed    0.08 sec
        Start 600: AVSensor_ViscousFlux3D_btest
600/907 Test #600: AVSensor_ViscousFlux3D_btest .....................................................................   Passed    0.09 sec
        Start 601: PDEmitAVSensor1D_btest
601/907 Test #601: PDEmitAVSensor1D_btest ...........................................................................   Passed    0.07 sec
        Start 602: PDEmitAVSensor2D_btest
602/907 Test #602: PDEmitAVSensor2D_btest ...........................................................................   Passed    0.06 sec
        Start 603: PDEmitAVSensor3D_btest
603/907 Test #603: PDEmitAVSensor3D_btest ...........................................................................   Passed    0.08 sec
        Start 604: ArrayFunction2D_btest
604/907 Test #604: ArrayFunction2D_btest ............................................................................   Passed    0.07 sec
        Start 605: ScalarFunction1D_btest
605/907 Test #605: ScalarFunction1D_btest ...........................................................................   Passed    0.08 sec
        Start 606: ScalarFunction2D_btest
606/907 Test #606: ScalarFunction2D_btest ...........................................................................   Passed    0.11 sec
        Start 607: ScalarFunction3D_btest
607/907 Test #607: ScalarFunction3D_btest ...........................................................................   Passed    0.08 sec
        Start 608: PDEEikonal_Distance2D_btest
608/907 Test #608: PDEEikonal_Distance2D_btest ......................................................................   Passed    0.07 sec
        Start 609: BCCauchyRiemann2D_btest
609/907 Test #609: BCCauchyRiemann2D_btest ..........................................................................   Passed    0.06 sec
        Start 610: PDECauchyRiemann2D_SurrealD_btest
610/907 Test #610: PDECauchyRiemann2D_SurrealD_btest ................................................................   Passed    0.07 sec
        Start 611: PDECauchyRiemann2D_SurrealS_btest
611/907 Test #611: PDECauchyRiemann2D_SurrealS_btest ................................................................   Passed    0.06 sec
        Start 612: PDECauchyRiemann2D_btest
612/907 Test #612: PDECauchyRiemann2D_btest .........................................................................   Passed    0.07 sec
        Start 613: BCFullPotential3D_btest
613/907 Test #613: BCFullPotential3D_btest ..........................................................................   Passed    0.08 sec
        Start 614: BCIncompressiblePotentialTwoField2D_sansLG_btest
614/907 Test #614: BCIncompressiblePotentialTwoField2D_sansLG_btest .................................................   Passed    0.10 sec
        Start 615: BCLinearizedIncompressiblePotential2D_btest
615/907 Test #615: BCLinearizedIncompressiblePotential2D_btest ......................................................   Passed    0.06 sec
        Start 616: BCLinearizedIncompressiblePotential2D_sansLG_btest
616/907 Test #616: BCLinearizedIncompressiblePotential2D_sansLG_btest ...............................................   Passed    0.09 sec
        Start 617: BCLinearizedIncompressiblePotential3D_btest
617/907 Test #617: BCLinearizedIncompressiblePotential3D_btest ......................................................   Passed    0.10 sec
        Start 618: LinearizedIncompressiblePotential3D_Circulation_btest
618/907 Test #618: LinearizedIncompressiblePotential3D_Circulation_btest ............................................   Passed    0.36 sec
        Start 619: LinearizedIncompressiblePotential3D_Trefftz_btest
619/907 Test #619: LinearizedIncompressiblePotential3D_Trefftz_btest ................................................   Passed    0.39 sec
        Start 620: OutputLIP3D_btest
620/907 Test #620: OutputLIP3D_btest ................................................................................   Passed    0.06 sec
        Start 621: PDEFullPotential3D_btest
621/907 Test #621: PDEFullPotential3D_btest .........................................................................   Passed    0.07 sec
        Start 622: PDEIncompressiblePotentialTwoField2D_btest
622/907 Test #622: PDEIncompressiblePotentialTwoField2D_btest .......................................................   Passed    0.06 sec
        Start 623: PDELinearizedIncompressiblePotential2D_btest
623/907 Test #623: PDELinearizedIncompressiblePotential2D_btest .....................................................   Passed    0.07 sec
        Start 624: PDELinearizedIncompressiblePotential3D_btest
624/907 Test #624: PDELinearizedIncompressiblePotential3D_btest .....................................................   Passed    0.06 sec
        Start 625: SolutionFunction2D_LIP_btest
625/907 Test #625: SolutionFunction2D_LIP_btest .....................................................................   Passed    0.07 sec
        Start 626: SolutionFunction3D_LIP_btest
626/907 Test #626: SolutionFunction3D_LIP_btest .....................................................................   Passed    0.06 sec
        Start 627: SolutionFunction_Potential2D_btest
627/907 Test #627: SolutionFunction_Potential2D_btest ...............................................................   Passed    0.09 sec
        Start 628: AlgebraicEquationSet_ProjectToQauxv_3D_btest
628/907 Test #628: AlgebraicEquationSet_ProjectToQauxv_3D_btest .....................................................   Passed    0.37 sec
        Start 629: AlgebraicEquationSet_ProjectToQauxv_PiecewiseConstSourcePanel_FlatPlate3D_Quad_btest
629/907 Test #629: AlgebraicEquationSet_ProjectToQauxv_PiecewiseConstSourcePanel_FlatPlate3D_Quad_btest .............   Passed    0.13 sec
        Start 630: AlgebraicEquationSet_ProjectToQauxv_PiecewiseConstSourcePanel_FlatPlate3D_Triangle_btest
630/907 Test #630: AlgebraicEquationSet_ProjectToQauxv_PiecewiseConstSourcePanel_FlatPlate3D_Triangle_btest .........   Passed    0.13 sec
        Start 631: BCIBL2D_btest
631/907 Test #631: BCIBL2D_btest ....................................................................................   Passed    0.09 sec
        Start 632: BCIBLUniField2D_btest
632/907 Test #632: BCIBLUniField2D_btest ............................................................................   Passed    0.08 sec
        Start 633: ElementProjectionIBLoutput_L2_btest
633/907 Test #633: ElementProjectionIBLoutput_L2_btest ..............................................................   Passed    0.11 sec
        Start 634: FluidModels_btest
634/907 Test #634: FluidModels_btest ................................................................................   Passed    0.09 sec
        Start 635: GetSolnDofCell_IBL_btest
635/907 Test #635: GetSolnDofCell_IBL_btest .........................................................................   Passed    0.10 sec
        Start 636: IBLMiscClosures_btest
636/907 Test #636: IBLMiscClosures_btest ............................................................................   Passed    0.06 sec
        Start 637: PDEIBL2D_btest
637/907 Test #637: PDEIBL2D_btest ...................................................................................   Passed    0.09 sec
        Start 638: PDEIBL2D_continued_btest
638/907 Test #638: PDEIBL2D_continued_btest .........................................................................   Passed    0.08 sec
        Start 639: PDEIBL3D_btest
639/907 Test #639: PDEIBL3D_btest ...................................................................................   Passed    0.07 sec
        Start 640: PDEIBLFourEqn3D_btest
640/907 Test #640: PDEIBLFourEqn3D_btest ............................................................................   Passed    0.08 sec
        Start 641: PDEIBLSplitAmpLag2D_btest
641/907 Test #641: PDEIBLSplitAmpLag2D_btest ........................................................................   Passed    0.10 sec
        Start 642: PDEIBLUniField2D_btest
642/907 Test #642: PDEIBLUniField2D_btest ...........................................................................   Passed    0.08 sec
        Start 643: ProjectToQauxi2D_btest
643/907 Test #643: ProjectToQauxi2D_btest ...........................................................................   Passed    0.08 sec
        Start 644: ProjectToQauxi3D_btest
644/907 Test #644: ProjectToQauxi3D_btest ...........................................................................   Passed    0.11 sec
        Start 645: QauxvInterpret2D_btest
645/907 Test #645: QauxvInterpret2D_btest ...........................................................................   Passed    0.06 sec
        Start 646: SecondaryVar2D_btest
646/907 Test #646: SecondaryVar2D_btest .............................................................................   Passed    0.10 sec
        Start 647: SetIBLoutputCellGroup_btest
647/907 Test #647: SetIBLoutputCellGroup_btest ......................................................................   Passed    0.11 sec
        Start 648: SetSolnDofCell_IBL_btest
648/907 Test #648: SetSolnDofCell_IBL_btest .........................................................................   Passed    0.11 sec
        Start 649: SetVelDofCell_IBL_btest
649/907 Test #649: SetVelDofCell_IBL_btest ..........................................................................   Passed    0.09 sec
        Start 650: SpaldingLawModified_btest
650/907 Test #650: SpaldingLawModified_btest ........................................................................   Passed    0.07 sec
        Start 651: ThicknessesCoefficients2D_CorrelationClosure_btest
651/907 Test #651: ThicknessesCoefficients2D_CorrelationClosure_btest ...............................................   Passed    0.08 sec
        Start 652: ThicknessesCoefficients2D_ProfileClosure_btest
652/907 Test #652: ThicknessesCoefficients2D_ProfileClosure_btest ...................................................   Passed    0.11 sec
        Start 653: VarInterpret2D_btest
653/907 Test #653: VarInterpret2D_btest .............................................................................   Passed    0.06 sec
        Start 654: VelocityProfile2D_btest
654/907 Test #654: VelocityProfile2D_btest ..........................................................................   Passed    0.07 sec
        Start 655: BCIncompressibleNavierStokes1DChannel_btest
655/907 Test #655: BCIncompressibleNavierStokes1DChannel_btest ......................................................   Passed    0.08 sec
        Start 656: BCIncompressibleRANSSA1DChannel_btest
656/907 Test #656: BCIncompressibleRANSSA1DChannel_btest ............................................................   Passed    0.10 sec
        Start 657: PDEIncompressibleNavierStokes1DChannel_btest
657/907 Test #657: PDEIncompressibleNavierStokes1DChannel_btest .....................................................   Passed    0.06 sec
        Start 658: PDEIncompressibleRANSSA1DChannel_btest
658/907 Test #658: PDEIncompressibleRANSSA1DChannel_btest ...........................................................   Passed    0.07 sec
        Start 659: SolutionFunction_IncompressibleRANSSA1DChannel_btest
659/907 Test #659: SolutionFunction_IncompressibleRANSSA1DChannel_btest .............................................   Passed    0.06 sec
        Start 660: BCLorenz_btest
660/907 Test #660: BCLorenz_btest ...................................................................................   Passed    0.09 sec
        Start 661: PDELorenz_btest
661/907 Test #661: PDELorenz_btest ..................................................................................   Passed    0.08 sec
        Start 662: BCEuler1D_btest
662/907 Test #662: BCEuler1D_btest ..................................................................................   Passed    0.10 sec
        Start 663: BCEuler2D_btest
663/907 Test #663: BCEuler2D_btest ..................................................................................   Passed    0.10 sec
        Start 664: BCEuler3D_mitLagrange_btest
664/907 Test #664: BCEuler3D_mitLagrange_btest ......................................................................   Passed    0.07 sec
        Start 665: BCEuler3D_mitState_btest
665/907 Test #665: BCEuler3D_mitState_btest .........................................................................   Passed    0.08 sec
        Start 666: BCEulermitAVSensor1D_btest
666/907 Test #666: BCEulermitAVSensor1D_btest .......................................................................   Passed    0.10 sec
        Start 667: BCEulermitAVSensor2D_btest
667/907 Test #667: BCEulermitAVSensor2D_btest .......................................................................   Passed    0.10 sec
        Start 668: BCEulermitAVSensor3D_btest
668/907 Test #668: BCEulermitAVSensor3D_btest .......................................................................   Passed    0.08 sec
        Start 669: BCNavierStokes2D_Robin_sansLG_btest
669/907 Test #669: BCNavierStokes2D_Robin_sansLG_btest ..............................................................   Passed    0.10 sec
        Start 670: BCNavierStokes2D_btest
670/907 Test #670: BCNavierStokes2D_btest ...........................................................................   Passed    0.08 sec
        Start 671: BCNavierStokes3D_Robin_sansLG_btest
671/907 Test #671: BCNavierStokes3D_Robin_sansLG_btest ..............................................................   Passed    0.08 sec
        Start 672: BCNavierStokes3D_mitState_btest
672/907 Test #672: BCNavierStokes3D_mitState_btest ..................................................................   Passed    0.10 sec
        Start 673: BCRANSSA2D_btest
673/907 Test #673: BCRANSSA2D_btest .................................................................................   Passed    0.09 sec
        Start 674: BCRANSSA3D_mitState_btest
674/907 Test #674: BCRANSSA3D_mitState_btest ........................................................................   Passed    0.11 sec
        Start 675: EulerSolutionFunction1D_btest
675/907 Test #675: EulerSolutionFunction1D_btest ....................................................................   Passed    0.09 sec
        Start 676: EulerSolutionFunction2D_btest
676/907 Test #676: EulerSolutionFunction2D_btest ....................................................................   Passed    0.07 sec
        Start 677: Fluids1D_Sensor_btest
677/907 Test #677: Fluids1D_Sensor_btest ............................................................................   Passed    0.07 sec
        Start 678: Fluids2D_Sensor_btest
678/907 Test #678: Fluids2D_Sensor_btest ............................................................................   Passed    0.06 sec
        Start 679: GasModel_SurrealS1_btest
679/907 Test #679: GasModel_SurrealS1_btest .........................................................................   Passed    0.07 sec
        Start 680: GasModel_btest
680/907 Test #680: GasModel_btest ...................................................................................   Passed    0.10 sec
        Start 681: HLLC2D_btest
681/907 Test #681: HLLC2D_btest .....................................................................................   Passed    0.06 sec
        Start 682: IsmailRoe_btest
682/907 Test #682: IsmailRoe_btest ..................................................................................   Passed    1.26 sec
        Start 683: NSVariable1D_btest
683/907 Test #683: NSVariable1D_btest ...............................................................................   Passed    0.10 sec
        Start 684: NSVariable2D_btest
684/907 Test #684: NSVariable2D_btest ...............................................................................   Passed    0.09 sec
        Start 685: NSVariable3D_btest
685/907 Test #685: NSVariable3D_btest ...............................................................................   Passed    0.08 sec
        Start 686: NavierStokesForcingFunction2D_btest
686/907 Test #686: NavierStokesForcingFunction2D_btest ..............................................................   Passed    0.07 sec
        Start 687: NavierStokesSolutionFunction2D_btest
687/907 Test #687: NavierStokesSolutionFunction2D_btest .............................................................   Passed    0.09 sec
        Start 688: OutputEuler2D_btest
688/907 Test #688: OutputEuler2D_btest ..............................................................................   Passed    0.06 sec
        Start 689: OutputNavierStokes2D_btest
689/907 Test #689: OutputNavierStokes2D_btest .......................................................................   Passed    0.07 sec
        Start 690: PDEEuler1D_btest
690/907 Test #690: PDEEuler1D_btest .................................................................................   Passed    0.09 sec
        Start 691: PDEEuler2D_btest
691/907 Test #691: PDEEuler2D_btest .................................................................................   Passed    0.11 sec
        Start 692: PDEEuler3D_RotorSource_btest
692/907 Test #692: PDEEuler3D_RotorSource_btest .....................................................................   Passed    0.06 sec
        Start 693: PDEEuler3D_btest
693/907 Test #693: PDEEuler3D_btest .................................................................................   Passed    0.11 sec
        Start 694: PDEEulermitAVDiffusion1D_btest
694/907 Test #694: PDEEulermitAVDiffusion1D_btest ...................................................................   Passed    0.07 sec
        Start 695: PDEEulermitAVDiffusion2D_RANSSA_btest
695/907 Test #695: PDEEulermitAVDiffusion2D_RANSSA_btest ............................................................   Passed    0.10 sec
        Start 696: PDEEulermitAVDiffusion2D_btest
696/907 Test #696: PDEEulermitAVDiffusion2D_btest ...................................................................   Passed    0.11 sec
        Start 697: PDEEulermitAVDiffusion3D_RANSSA_btest
697/907 Test #697: PDEEulermitAVDiffusion3D_RANSSA_btest ............................................................   Passed    0.09 sec
        Start 698: PDEEulermitAVDiffusion3D_RotorSource_btest
698/907 Test #698: PDEEulermitAVDiffusion3D_RotorSource_btest .......................................................   Passed    0.08 sec
        Start 699: PDEEulermitAVDiffusion3D_btest
699/907 Test #699: PDEEulermitAVDiffusion3D_btest ...................................................................   Passed    0.11 sec
        Start 700: PDENavierStokes1D_btest
700/907 Test #700: PDENavierStokes1D_btest ..........................................................................   Passed    0.06 sec
        Start 701: PDENavierStokes2D_btest
701/907 Test #701: PDENavierStokes2D_btest ..........................................................................   Passed    0.08 sec
        Start 702: PDENavierStokes3D_btest
702/907 Test #702: PDENavierStokes3D_btest ..........................................................................   Passed    0.07 sec
        Start 703: PDERANSSA2D_btest
703/907 Test #703: PDERANSSA2D_btest ................................................................................   Passed    0.12 sec
        Start 704: PDERANSSA3D_btest
704/907 Test #704: PDERANSSA3D_btest ................................................................................   Passed    0.10 sec
        Start 705: Q1DConservative_btest
705/907 Test #705: Q1DConservative_btest ............................................................................   Passed    0.08 sec
        Start 706: Q1DEntropy_btest
706/907 Test #706: Q1DEntropy_btest .................................................................................   Passed    0.06 sec
        Start 707: Q1DPrimitiveRhoPressure_btest
707/907 Test #707: Q1DPrimitiveRhoPressure_btest ....................................................................   Passed    0.07 sec
        Start 708: Q1DPrimitiveSurrogate_btest
708/907 Test #708: Q1DPrimitiveSurrogate_btest ......................................................................   Passed    0.06 sec
        Start 709: Q2DConservative_btest
709/907 Test #709: Q2DConservative_btest ............................................................................   Passed    0.07 sec
        Start 710: Q2DEntropy_btest
710/907 Test #710: Q2DEntropy_btest .................................................................................   Passed    0.06 sec
        Start 711: Q2DPrimitiveRhoPressure_btest
711/907 Test #711: Q2DPrimitiveRhoPressure_btest ....................................................................   Passed    0.08 sec
        Start 712: Q2DPrimitiveRhoTemperature_btest
712/907 Test #712: Q2DPrimitiveRhoTemperature_btest .................................................................   Passed    0.06 sec
        Start 713: Q2DPrimitiveSurrogate_btest
713/907 Test #713: Q2DPrimitiveSurrogate_btest ......................................................................   Passed    0.07 sec
        Start 714: Q3DConservative_btest
714/907 Test #714: Q3DConservative_btest ............................................................................   Passed    0.07 sec
        Start 715: Q3DEntropy_btest
715/907 Test #715: Q3DEntropy_btest .................................................................................   Passed    0.06 sec
        Start 716: Q3DPrimitiveRhoPressure_btest
716/907 Test #716: Q3DPrimitiveRhoPressure_btest ....................................................................   Passed    0.07 sec
        Start 717: Q3DPrimitiveRhoTemperature_btest
717/907 Test #717: Q3DPrimitiveRhoTemperature_btest .................................................................   Passed    0.06 sec
        Start 718: Q3DPrimitiveSurrogate_btest
718/907 Test #718: Q3DPrimitiveSurrogate_btest ......................................................................   Passed    0.07 sec
        Start 719: QRANSSA2D_btest
719/907 Test #719: QRANSSA2D_btest ..................................................................................   Passed    0.06 sec
        Start 720: QRANSSA3D_btest
720/907 Test #720: QRANSSA3D_btest ..................................................................................   Passed    0.07 sec
        Start 721: Roe_btest
721/907 Test #721: Roe_btest ........................................................................................   Passed    0.07 sec
        Start 722: BCNDConvert_btest
722/907 Test #722: BCNDConvert_btest ................................................................................   Passed    0.09 sec
        Start 723: OutputNDConvert_btest
723/907 Test #723: OutputNDConvert_btest ............................................................................   Passed    0.07 sec
        Start 724: PDENDConvert1D_AD_ST_btest
724/907 Test #724: PDENDConvert1D_AD_ST_btest .......................................................................   Passed    0.07 sec
        Start 725: PDENDConvert1D_AD_btest
725/907 Test #725: PDENDConvert1D_AD_btest ..........................................................................   Passed    0.06 sec
        Start 726: PDENDConvert2D_AD_btest
726/907 Test #726: PDENDConvert2D_AD_btest ..........................................................................   Passed    0.07 sec
        Start 727: PDENDConvert3D_AD_btest
727/907 Test #727: PDENDConvert3D_AD_btest ..........................................................................   Passed    0.07 sec
        Start 728: SolnNDConvert1D_AD_btest
728/907 Test #728: SolnNDConvert1D_AD_btest .........................................................................   Passed    0.07 sec
        Start 729: SolnNDConvert2D_AD_btest
729/907 Test #729: SolnNDConvert2D_AD_btest .........................................................................   Passed    0.06 sec
        Start 730: SolnNDConvert3D_AD_btest
730/907 Test #730: SolnNDConvert3D_AD_btest .........................................................................   Passed    0.07 sec
        Start 731: BCHSM2D_btest
731/907 Test #731: BCHSM2D_btest ....................................................................................   Passed    0.09 sec
        Start 732: HSMVariable_btest
732/907 Test #732: HSMVariable_btest ................................................................................   Passed    0.06 sec
        Start 733: PDEHSM2D_btest
733/907 Test #733: PDEHSM2D_btest ...................................................................................   Passed    0.08 sec
        Start 734: PDEHSMKL_btest
734/907 Test #734: PDEHSMKL_btest ...................................................................................   Passed    0.06 sec
        Start 735: VarLambda_btest
735/907 Test #735: VarLambda_btest ..................................................................................   Passed    0.07 sec
        Start 736: BCBuckleyLeverett1D_btest
736/907 Test #736: BCBuckleyLeverett1D_btest ........................................................................   Passed    0.08 sec
        Start 737: BCBuckleyLeverett_ArtificialViscosity1D_btest
737/907 Test #737: BCBuckleyLeverett_ArtificialViscosity1D_btest ....................................................   Passed    0.10 sec
        Start 738: BCTwoPhase1D_btest
738/907 Test #738: BCTwoPhase1D_btest ...............................................................................   Passed    0.10 sec
        Start 739: BCTwoPhase2D_btest
739/907 Test #739: BCTwoPhase2D_btest ...............................................................................   Passed    0.08 sec
        Start 740: BCTwoPhaseArtificialViscosity1D_btest
740/907 Test #740: BCTwoPhaseArtificialViscosity1D_btest ............................................................   Passed    0.07 sec
        Start 741: BCTwoPhaseArtificialViscosity2D_btest
741/907 Test #741: BCTwoPhaseArtificialViscosity2D_btest ............................................................   Passed    0.10 sec
        Start 742: BCTwoPhaseLinearized1D_btest
742/907 Test #742: BCTwoPhaseLinearized1D_btest .....................................................................   Passed    0.08 sec
        Start 743: CapillaryModel_btest
743/907 Test #743: CapillaryModel_btest .............................................................................   Passed    0.10 sec
        Start 744: CartTable_btest
744/907 Test #744: CartTable_btest ..................................................................................   Passed    0.06 sec
        Start 745: DensityModel_btest
745/907 Test #745: DensityModel_btest ...............................................................................   Passed    0.09 sec
        Start 746: OutputTwoPhase_btest
746/907 Test #746: OutputTwoPhase_btest .............................................................................   Passed    0.08 sec
        Start 747: PDEBuckleyLeverett1D_btest
747/907 Test #747: PDEBuckleyLeverett1D_btest .......................................................................   Passed    0.07 sec
        Start 748: PDEBuckleyLeverett_ArtificialViscosity1D_btest
748/907 Test #748: PDEBuckleyLeverett_ArtificialViscosity1D_btest ...................................................   Passed    0.06 sec
        Start 749: PDETwoPhase1D_btest
749/907 Test #749: PDETwoPhase1D_btest ..............................................................................   Passed    0.08 sec
        Start 750: PDETwoPhase2D_btest
750/907 Test #750: PDETwoPhase2D_btest ..............................................................................   Passed    0.08 sec
        Start 751: PDETwoPhaseLinearized1D_btest
751/907 Test #751: PDETwoPhaseLinearized1D_btest ....................................................................   Passed    0.08 sec
        Start 752: PDETwoPhase_ArtificialViscosity1D_btest
752/907 Test #752: PDETwoPhase_ArtificialViscosity1D_btest ..........................................................   Passed    0.06 sec
        Start 753: PDETwoPhase_ArtificialViscosity2D_btest
753/907 Test #753: PDETwoPhase_ArtificialViscosity2D_btest ..........................................................   Passed    0.10 sec
        Start 754: PermeabilityModel2D_btest
754/907 Test #754: PermeabilityModel2D_btest ........................................................................   Passed    0.08 sec
        Start 755: PorosityModel_btest
755/907 Test #755: PorosityModel_btest ..............................................................................   Passed    0.07 sec
        Start 756: Q1DPrimitive_Surrogate_pnSw_btest
756/907 Test #756: Q1DPrimitive_Surrogate_pnSw_btest ................................................................   Passed    0.05 sec
        Start 757: Q1DPrimitive_Sw_btest
757/907 Test #757: Q1DPrimitive_Sw_btest ............................................................................   Passed    0.05 sec
        Start 758: Q1DPrimitive_pnSw_btest
758/907 Test #758: Q1DPrimitive_pnSw_btest ..........................................................................   Passed    0.07 sec
        Start 759: Q2DPrimitive_LogpnSw_btest
759/907 Test #759: Q2DPrimitive_LogpnSw_btest .......................................................................   Passed    0.07 sec
        Start 760: Q2DPrimitive_Surrogate_pnSw_btest
760/907 Test #760: Q2DPrimitive_Surrogate_pnSw_btest ................................................................   Passed    0.06 sec
        Start 761: Q2DPrimitive_pnSw_btest
761/907 Test #761: Q2DPrimitive_pnSw_btest ..........................................................................   Passed    0.05 sec
        Start 762: RelativePermeabilityModel_SurrealS1_btest
762/907 Test #762: RelativePermeabilityModel_SurrealS1_btest ........................................................   Passed    0.07 sec
        Start 763: RelativePermeabilityModel_btest
763/907 Test #763: RelativePermeabilityModel_btest ..................................................................   Passed    0.07 sec
        Start 764: Sensor_BuckleyLeverett1D_btest
764/907 Test #764: Sensor_BuckleyLeverett1D_btest ...................................................................   Passed    0.07 sec
        Start 765: Sensor_TwoPhase_btest
765/907 Test #765: Sensor_TwoPhase_btest ............................................................................   Passed    0.06 sec
        Start 766: SolutionFunction_BuckleyLeverett1D_btest
766/907 Test #766: SolutionFunction_BuckleyLeverett1D_btest .........................................................   Passed    0.07 sec
        Start 767: SolutionFunction_TwoPhase2D_btest
767/907 Test #767: SolutionFunction_TwoPhase2D_btest ................................................................   Passed    0.07 sec
        Start 768: SourceTwoPhase1D_btest
768/907 Test #768: SourceTwoPhase1D_btest ...........................................................................   Passed    0.09 sec
        Start 769: SourceTwoPhase2D_btest
769/907 Test #769: SourceTwoPhase2D_btest ...........................................................................   Passed    0.08 sec
        Start 770: ViscosityModel_btest
770/907 Test #770: ViscosityModel_btest .............................................................................   Passed    0.09 sec
        Start 771: AtmosphereStandard_btest
771/907 Test #771: AtmosphereStandard_btest .........................................................................   Passed    0.06 sec
        Start 772: BCsansBOOM_btest
772/907 Test #772: BCsansBOOM_btest .................................................................................   Passed    0.09 sec
        Start 773: ICsansBOOM_btest
773/907 Test #773: ICsansBOOM_btest .................................................................................   Passed    0.06 sec
        Start 774: OutputsansBOOM_btest
774/907 Test #774: OutputsansBOOM_btest .............................................................................   Passed    0.05 sec
        Start 775: PDEsansBOOM_btest
775/907 Test #775: PDEsansBOOM_btest ................................................................................   Passed    0.05 sec
        Start 776: BCSensorParameter1D_btest
776/907 Test #776: BCSensorParameter1D_btest ........................................................................   Passed    0.07 sec
        Start 777: BCSensorParameter2D_btest
777/907 Test #777: BCSensorParameter2D_btest ........................................................................   Passed    0.07 sec
        Start 778: PDESensorParameter1D_btest
778/907 Test #778: PDESensorParameter1D_btest .......................................................................   Passed    0.07 sec
        Start 779: PDESensorParameter2D_btest
779/907 Test #779: PDESensorParameter2D_btest .......................................................................   Passed    0.06 sec
        Start 780: Sensor_AdvectiveFlux1D_btest
780/907 Test #780: Sensor_AdvectiveFlux1D_btest .....................................................................   Passed    0.05 sec
        Start 781: Sensor_AdvectiveFlux2D_btest
781/907 Test #781: Sensor_AdvectiveFlux2D_btest .....................................................................   Passed    0.05 sec
        Start 782: Sensor_DiffusionMatrix1D_btest
782/907 Test #782: Sensor_DiffusionMatrix1D_btest ...................................................................   Passed    0.07 sec
        Start 783: Sensor_DiffusionMatrix2D_btest
783/907 Test #783: Sensor_DiffusionMatrix2D_btest ...................................................................   Passed    0.06 sec
        Start 784: Source1D_JumpSensor_btest
784/907 Test #784: Source1D_JumpSensor_btest ........................................................................   Passed    0.07 sec
        Start 785: Source2D_JumpSensor_btest
785/907 Test #785: Source2D_JumpSensor_btest ........................................................................   Passed    0.06 sec
        Start 786: BCShallowWater1D_btest
786/907 Test #786: BCShallowWater1D_btest ...........................................................................   Passed    0.09 sec
        Start 787: BCShallowWater2D_btest
787/907 Test #787: BCShallowWater2D_btest ...........................................................................   Passed    0.08 sec
        Start 788: BCShallowWater2D_manifold_btest
788/907 Test #788: BCShallowWater2D_manifold_btest ..................................................................   Passed    0.09 sec
        Start 789: OutputShallowWater1D_btest
789/907 Test #789: OutputShallowWater1D_btest .......................................................................   Passed    0.08 sec
        Start 790: OutputShallowWater2D_btest
790/907 Test #790: OutputShallowWater2D_btest .......................................................................   Passed    0.07 sec
        Start 791: PDEShallowWater1D_btest
791/907 Test #791: PDEShallowWater1D_btest ..........................................................................   Passed    0.07 sec
        Start 792: PDEShallowWater2D_btest
792/907 Test #792: PDEShallowWater2D_btest ..........................................................................   Passed    0.07 sec
        Start 793: PDEShallowWater2D_manifold_btest
793/907 Test #793: PDEShallowWater2D_manifold_btest .................................................................   Passed    0.09 sec
        Start 794: ShallowWaterSolution1D_btest
794/907 Test #794: ShallowWaterSolution1D_btest .....................................................................   Passed    0.08 sec
        Start 795: ShallowWaterSolution2D_btest
795/907 Test #795: ShallowWaterSolution2D_btest .....................................................................   Passed    0.10 sec
        Start 796: ShallowWaterSolution2D_manifold_btest
796/907 Test #796: ShallowWaterSolution2D_manifold_btest ............................................................   Passed    0.08 sec
        Start 797: ShallowWaterVarInterp1D_btest
797/907 Test #797: ShallowWaterVarInterp1D_btest ....................................................................   Passed    0.07 sec
        Start 798: ShallowWaterVarInterp2D_btest
798/907 Test #798: ShallowWaterVarInterp2D_btest ....................................................................   Passed    0.06 sec
        Start 799: ShallowWaterVarInterp2D_manifold_btest
799/907 Test #799: ShallowWaterVarInterp2D_manifold_btest ...........................................................   Passed    0.07 sec
        Start 800: PDEStokes2D_btest
800/907 Test #800: PDEStokes2D_btest ................................................................................   Passed    0.06 sec
        Start 801: BCTCNEEuler1D_btest
801/907 Test #801: BCTCNEEuler1D_btest ..............................................................................   Passed    0.07 sec
        Start 802: PDETCNEEuler1D_btest
802/907 Test #802: PDETCNEEuler1D_btest .............................................................................   Passed    0.10 sec
        Start 803: Q1DTCNEConservative_btest
803/907 Test #803: Q1DTCNEConservative_btest ........................................................................   Passed    0.08 sec
        Start 804: TCNEChemistryDataImport_btest
804/907 Test #804: TCNEChemistryDataImport_btest ....................................................................   Passed    0.09 sec
        Start 805: TCNEChemistryModels_btest
805/907 Test #805: TCNEChemistryModels_btest ........................................................................   Passed    0.08 sec
        Start 806: TCNEGasModel_StatMech_btest
806/907 Test #806: TCNEGasModel_StatMech_btest ......................................................................   Passed    0.09 sec
        Start 807: TCNEVariable1D_btest
807/907 Test #807: TCNEVariable1D_btest .............................................................................   Passed    0.08 sec
        Start 808: Parameters_btest
808/907 Test #808: Parameters_btest .................................................................................   Passed    0.07 sec
        Start 809: PyDict_btest
809/907 Test #809: PyDict_btest .....................................................................................   Passed    0.08 sec
        Start 810: QuadratureArea_Quad_btest
810/907 Test #810: QuadratureArea_Quad_btest ........................................................................   Passed    0.08 sec
        Start 811: QuadratureArea_Triangle_btest
811/907 Test #811: QuadratureArea_Triangle_btest ....................................................................   Passed    0.07 sec
        Start 812: QuadratureLine_btest
812/907 Test #812: QuadratureLine_btest .............................................................................   Passed    0.06 sec
        Start 813: QuadratureSpacetime_Pentatope_Stroud_btest
813/907 Test #813: QuadratureSpacetime_Pentatope_Stroud_btest .......................................................   Passed    0.06 sec
        Start 814: QuadratureSpacetime_Pentatope_btest
814/907 Test #814: QuadratureSpacetime_Pentatope_btest ..............................................................   Passed    0.08 sec
        Start 815: QuadratureVolume_Hexahedron_btest
815/907 Test #815: QuadratureVolume_Hexahedron_btest ................................................................   Passed    0.16 sec
        Start 816: QuadratureVolume_Tetrahedron_btest
816/907 Test #816: QuadratureVolume_Tetrahedron_btest ...............................................................   Passed    0.13 sec
        Start 817: Quaternion_btest
817/907 Test #817: Quaternion_btest .................................................................................   Passed    0.07 sec
        Start 818: DissipationBased_btest
818/907 Test #818: DissipationBased_btest ...........................................................................   Passed    0.21 sec
        Start 819: Homotopy_Euler_btest
819/907 Test #819: Homotopy_Euler_btest .............................................................................   Passed    0.56 sec
        Start 820: Homotopy_btest
820/907 Test #820: Homotopy_btest ...................................................................................   Passed    0.19 sec
        Start 821: ImplicitResidualSmoothing_btest
821/907 Test #821: ImplicitResidualSmoothing_btest ..................................................................   Passed    0.13 sec
        Start 822: PDEHomotopy_btest
822/907 Test #822: PDEHomotopy_btest ................................................................................   Passed    0.06 sec
        Start 823: PDESourceOnly_btest
823/907 Test #823: PDESourceOnly_btest ..............................................................................   Passed    0.06 sec
        Start 824: PseudoTime_btest
824/907 Test #824: PseudoTime_btest .................................................................................   Passed    0.12 sec
        Start 825: HarmonicBalance_btest
825/907 Test #825: HarmonicBalance_btest ............................................................................   Passed    0.21 sec
        Start 826: BDF_btest
826/907 Test #826: BDF_btest ........................................................................................   Passed    0.12 sec
        Start 827: RK_btest
827/907 Test #827: RK_btest .........................................................................................   Passed    0.65 sec
        Start 828: SurrealD1_btest
828/907 Test #828: SurrealD1_btest ..................................................................................   Passed    0.06 sec
        Start 829: SurrealD4_btest
829/907 Test #829: SurrealD4_btest ..................................................................................   Passed    0.06 sec
        Start 830: SurrealS1_btest
830/907 Test #830: SurrealS1_btest ..................................................................................   Passed    0.07 sec
        Start 831: SurrealS4_btest
831/907 Test #831: SurrealS4_btest ..................................................................................   Passed    0.06 sec
        Start 832: KahanSum_btest
832/907 Test #832: KahanSum_btest ...................................................................................   Passed    0.59 sec
        Start 833: PointerArray_btest
833/907 Test #833: PointerArray_btest ...............................................................................   Passed    0.06 sec
        Start 834: PointerSequence_btest
834/907 Test #834: PointerSequence_btest ............................................................................   Passed    0.05 sec
        Start 835: Tuple_btest
835/907 Test #835: Tuple_btest ......................................................................................   Passed    0.05 sec
        Start 836: add_decorator_btest
836/907 Test #836: add_decorator_btest ..............................................................................   Passed    0.05 sec
        Start 837: call_derived_functor_btest
837/907 Test #837: call_derived_functor_btest .......................................................................   Passed    0.06 sec
        Start 838: call_with_derived_btest
838/907 Test #838: call_with_derived_btest ..........................................................................   Passed    0.05 sec
        Start 839: file_extension_btest
839/907 Test #839: file_extension_btest .............................................................................   Passed    0.06 sec
        Start 840: linspace_btest
840/907 Test #840: linspace_btest ...................................................................................   Passed    0.05 sec
        Start 841: output_std_vector_btest
841/907 Test #841: output_std_vector_btest ..........................................................................   Passed    0.06 sec
        Start 842: plus_std_vector_btest
842/907 Test #842: plus_std_vector_btest ............................................................................   Passed    0.05 sec
        Start 843: pyrite_fstream_btest
843/907 Test #843: pyrite_fstream_btest .............................................................................   Passed    0.05 sec
        Start 844: smoothmath_btest
844/907 Test #844: smoothmath_btest .................................................................................   Passed    0.05 sec
        Start 845: split_cat_std_vector_btest
845/907 Test #845: split_cat_std_vector_btest .......................................................................   Passed    0.06 sec
        Start 846: tools_btest
846/907 Test #846: tools_btest ......................................................................................   Passed    0.05 sec
        Start 847: LIPSolver_btest
847/907 Test #847: LIPSolver_btest ..................................................................................   Passed    8.97 sec
        Start 848: XField1D_1Group_Periodic_btest
848/907 Test #848: XField1D_1Group_Periodic_btest ...................................................................   Passed    0.07 sec
        Start 849: XField1D_1Line_X1_1Group_btest
849/907 Test #849: XField1D_1Line_X1_1Group_btest ...................................................................   Passed    0.07 sec
        Start 850: XField1D_2Line_X1_1Group_btest
850/907 Test #850: XField1D_2Line_X1_1Group_btest ...................................................................   Passed    0.07 sec
        Start 851: XField1D_4Line_X1_2Group_btest
851/907 Test #851: XField1D_4Line_X1_2Group_btest ...................................................................   Passed    0.06 sec
        Start 852: XField2D_1Line_X1_1Group_btest
852/907 Test #852: XField2D_1Line_X1_1Group_btest ...................................................................   Passed    0.07 sec
        Start 853: XField2D_1Quad_X1_1Group_btest
853/907 Test #853: XField2D_1Quad_X1_1Group_btest ...................................................................   Passed    0.10 sec
        Start 854: XField2D_1Triangle_X1_1Group_btest
854/907 Test #854: XField2D_1Triangle_X1_1Group_btest ...............................................................   Passed    0.08 sec
        Start 855: XField2D_2Quad_X1_1Group_btest
855/907 Test #855: XField2D_2Quad_X1_1Group_btest ...................................................................   Passed    0.09 sec
        Start 856: XField2D_2Triangle_X1_1Group_btest
856/907 Test #856: XField2D_2Triangle_X1_1Group_btest ...............................................................   Passed    0.09 sec
        Start 857: XField2D_4Quad_X1_1Group_btest
857/907 Test #857: XField2D_4Quad_X1_1Group_btest ...................................................................   Passed    0.08 sec
        Start 858: XField2D_4Triangle_X1_1Group_btest
858/907 Test #858: XField2D_4Triangle_X1_1Group_btest ...............................................................   Passed    0.09 sec
        Start 859: XField2D_4Triangle_X1_4Group_btest
859/907 Test #859: XField2D_4Triangle_X1_4Group_btest ...............................................................   Passed    0.08 sec
        Start 860: XField2D_Annulus_Quad_X1_btest
860/907 Test #860: XField2D_Annulus_Quad_X1_btest ...................................................................   Passed    0.09 sec
        Start 861: XField2D_Annulus_Triangle_X1_btest
861/907 Test #861: XField2D_Annulus_Triangle_X1_btest ...............................................................   Passed    0.09 sec
        Start 862: XField2D_BackwardsStep_X1_btest
862/907 Test #862: XField2D_BackwardsStep_X1_btest ..................................................................   Passed    0.09 sec
        Start 863: XField2D_BoxPeriodic_Triangle_X1_btest
863/907 Test #863: XField2D_BoxPeriodic_Triangle_X1_btest ...........................................................   Passed    0.09 sec
        Start 864: XField2D_Box_Mixed_X1_btest
864/907 Test #864: XField2D_Box_Mixed_X1_btest ......................................................................   Passed    0.09 sec
        Start 865: XField2D_Box_Quad_Lagrange_X1_btest
865/907 Test #865: XField2D_Box_Quad_Lagrange_X1_btest ..............................................................   Passed    0.10 sec
        Start 866: XField2D_Box_Quad_X1_btest
866/907 Test #866: XField2D_Box_Quad_X1_btest .......................................................................   Passed    0.09 sec
        Start 867: XField2D_Box_Triangle_Ghost_X1_btest
867/907 Test #867: XField2D_Box_Triangle_Ghost_X1_btest .............................................................   Passed    0.08 sec
        Start 868: XField2D_Box_Triangle_Lagrange_X1_btest
868/907 Test #868: XField2D_Box_Triangle_Lagrange_X1_btest ..........................................................   Passed    0.12 sec
        Start 869: XField2D_Box_Triangle_X1_btest
869/907 Test #869: XField2D_Box_Triangle_X1_btest ...................................................................   Passed    0.08 sec
        Start 870: XField2D_Box_UnionJack_LocalRefine_Triangle_X1_btest
870/907 Test #870: XField2D_Box_UnionJack_LocalRefine_Triangle_X1_btest .............................................   Passed    0.07 sec
        Start 871: XField2D_Box_UnionJack_Triangle_X1_btest
871/907 Test #871: XField2D_Box_UnionJack_Triangle_X1_btest .........................................................   Passed    0.07 sec
        Start 872: XField2D_Circle_Line_X1_1Group_btest
872/907 Test #872: XField2D_Circle_Line_X1_1Group_btest .............................................................   Passed    0.09 sec
        Start 873: XField2D_CubicSourceBump_Xq_btest
873/907 Test #873: XField2D_CubicSourceBump_Xq_btest ................................................................   Passed    0.41 sec
        Start 874: XField2D_Duct_Triangle_Lagrange_Xq_btest
874/907 Test #874: XField2D_Duct_Triangle_Lagrange_Xq_btest .........................................................   Passed    0.08 sec
        Start 875: XField2D_FlatPlate_X1_btest
875/907 Test #875: XField2D_FlatPlate_X1_btest ......................................................................   Passed    0.08 sec
        Start 876: XField2D_GilesPierceNozzle_HACK_btest
876/907 Test #876: XField2D_GilesPierceNozzle_HACK_btest ............................................................   Passed    0.36 sec
        Start 877: XField2D_Line_X1_1Group_btest
877/907 Test #877: XField2D_Line_X1_1Group_btest ....................................................................   Passed    0.10 sec
        Start 878: XField2D_Line_X1_2Group_AirfoilWithWake_btest
878/907 Test #878: XField2D_Line_X1_2Group_AirfoilWithWake_btest ....................................................   Passed    0.08 sec
        Start 879: XField2D_Line_Xq_1Group_btest
879/907 Test #879: XField2D_Line_Xq_1Group_btest ....................................................................   Passed    0.10 sec
        Start 880: XField2D_SymAirfoil_X1_btest
880/907 Test #880: XField2D_SymAirfoil_X1_btest .....................................................................   Passed    0.09 sec
        Start 881: XField2D_WakeSymAirfoil_X1_btest
881/907 Test #881: XField2D_WakeSymAirfoil_X1_btest .................................................................   Passed    0.10 sec
        Start 882: XField3D_1Hex_X1_1Group_btest
882/907 Test #882: XField3D_1Hex_X1_1Group_btest ....................................................................   Passed    0.10 sec
        Start 883: XField3D_1Tet_X1_1Group_btest
883/907 Test #883: XField3D_1Tet_X1_1Group_btest ....................................................................   Passed    0.12 sec
        Start 884: XField3D_2Hex_X1_1Group_btest
884/907 Test #884: XField3D_2Hex_X1_1Group_btest ....................................................................   Passed    0.10 sec
        Start 885: XField3D_2Tet_X1_1Group_WakeCut_btest
885/907 Test #885: XField3D_2Tet_X1_1Group_WakeCut_btest ............................................................   Passed    0.11 sec
        Start 886: XField3D_2Tet_X1_1Group_btest
886/907 Test #886: XField3D_2Tet_X1_1Group_btest ....................................................................   Passed    0.09 sec
        Start 887: XField3D_5Tet_X1_1Group_AllOrientations_btest
887/907 Test #887: XField3D_5Tet_X1_1Group_AllOrientations_btest ....................................................   Passed    0.09 sec
        Start 888: XField3D_6Tet_X1_1Group_btest
888/907 Test #888: XField3D_6Tet_X1_1Group_btest ....................................................................   Passed    0.09 sec
        Start 889: XField3D_8Tet_X1_1Group_btest
889/907 Test #889: XField3D_8Tet_X1_1Group_btest ....................................................................   Passed    0.11 sec
        Start 890: XField3D_BoxBoundaries_Quad_X1_btest
890/907 Test #890: XField3D_BoxBoundaries_Quad_X1_btest .............................................................   Passed    0.23 sec
        Start 891: XField3D_BoxBoundary_Quad_X1_btest
891/907 Test #891: XField3D_BoxBoundary_Quad_X1_btest ...............................................................   Passed    0.16 sec
        Start 892: XField3D_Box_Hex_X1_WakeCut_btest
892/907 Test #892: XField3D_Box_Hex_X1_WakeCut_btest ................................................................   Passed    0.11 sec
        Start 893: XField3D_Box_Hex_X1_btest
893/907 Test #893: XField3D_Box_Hex_X1_btest ........................................................................   Passed    0.44 sec
        Start 894: XField3D_Box_Tet_X1_WakeCut_btest
894/907 Test #894: XField3D_Box_Tet_X1_WakeCut_btest ................................................................   Passed    0.12 sec
        Start 895: XField3D_Box_Tet_X1_btest
895/907 Test #895: XField3D_Box_Tet_X1_btest ........................................................................   Passed    1.29 sec
        Start 896: XField3D_CornerFlatPlate_X1_btest
896/907 Test #896: XField3D_CornerFlatPlate_X1_btest ................................................................   Passed    0.34 sec
        Start 897: XField3D_FlatPlate_X1_btest
897/907 Test #897: XField3D_FlatPlate_X1_btest ......................................................................   Passed    0.59 sec
        Start 898: XField3D_ForwardStep_Hex_X1_btest
898/907 Test #898: XField3D_ForwardStep_Hex_X1_btest ................................................................   Passed    0.10 sec
        Start 899: XField3D_GaussianBump_Xq_btest
899/907 Test #899: XField3D_GaussianBump_Xq_btest ...................................................................   Passed    3.75 sec
        Start 900: XField3D_Sheet_Quad_X1_btest
900/907 Test #900: XField3D_Sheet_Quad_X1_btest .....................................................................   Passed    0.13 sec
        Start 901: XField3D_Sheet_Triangle_X1_btest
901/907 Test #901: XField3D_Sheet_Triangle_X1_btest .................................................................   Passed    0.11 sec
        Start 902: XField3D_Sphere_Triangle_X1_btest
902/907 Test #902: XField3D_Sphere_Triangle_X1_btest ................................................................   Passed    0.10 sec
        Start 903: XField4D_1Pentatope_X1_1Group_btest
903/907 Test #903: XField4D_1Pentatope_X1_1Group_btest ..............................................................   Passed    0.17 sec
        Start 904: XField4D_24Pentatope_X1_1Group_btest
904/907 Test #904: XField4D_24Pentatope_X1_1Group_btest .............................................................   Passed    0.17 sec
        Start 905: XField4D_2Pentatope_X1_1Group_btest
905/907 Test #905: XField4D_2Pentatope_X1_1Group_btest ..............................................................   Passed    0.17 sec
        Start 906: XField4D_6Pentatope_X1_1Group_NegativeTraceOrientation_btest
906/907 Test #906: XField4D_6Pentatope_X1_1Group_NegativeTraceOrientation_btest .....................................   Passed    0.17 sec
        Start 907: XField4D_Box_Pentatope_X1_btest
907/907 Test #907: XField4D_Box_Pentatope_X1_btest ..................................................................   Passed    0.23 sec

100% tests passed, 0 tests failed out of 907

Label Time Summary:
SANSCheck_unit    = 1448.12 sec*proc (907 tests)

Total Test time (real) = 1448.77 sec
[100%] Built target check_unit

real	749m39.991s
user	708m0.589s
sys	25m12.506s
+ status=0
++ find /jenkins/workspace/SANS_Nightly/builddir/undefined_gnu9/buildnode/reynolds/build/undefined_gnu9 -name Test.xml
+ mv /jenkins/workspace/SANS_Nightly/builddir/undefined_gnu9/buildnode/reynolds/build/undefined_gnu9/Testing/20220401-1434/Test.xml /jenkins/workspace/SANS_Nightly/builddir/undefined_gnu9/buildnode/reynolds/build/Test_unit_memcheck.xml
+ '[' 0 -eq 1 ']'
+ [[ undefined_gnu9 == *\r\e\l\e\a\s\e* ]]
+ [[ undefined_gnu9 == *\m\e\m\c\h\e\c\k* ]]
+ [[ undefined_gnu9 == *\u\n\d\e\f\i\n\e\d* ]]
+ make check_system 'CTESTARGS=-T Test'
[  0%] Checking style of test/system/CodeConsistency/VMSDBR2_BubbleModes_btest.cpp
[  0%] Built target VMSDBR2_BubbleModes_btest_build_vera
[  0%] Built target libtetgen
[  0%] Built target libtriangle
[  2%] Built target BasisFunctionLib_vera
Consolidate compiler generated dependencies of target BasisFunctionLib
[  5%] Built target BasisFunctionLib
[ 18%] Built target Discretization_vera
[ 18%] Built target Discretization
Consolidate compiler generated dependencies of target GalerkinLib
[ 18%] Built target GalerkinLib
[ 21%] Built target ErrorEstimateLib_vera
Consolidate compiler generated dependencies of target ErrorEstimateLib
[ 21%] Built target ErrorEstimateLib
[ 37%] Built target FieldLib_vera
Consolidate compiler generated dependencies of target FieldLib
[ 43%] Built target FieldLib
[ 48%] Built target DenseLinAlgLib_vera
[ 48%] Built target LinearAlgebraLib_vera
[ 48%] Built target LinearAlgebraLib
Consolidate compiler generated dependencies of target DenseLinAlgLib
[ 48%] Built target DenseLinAlgLib
[ 51%] Built target SparseLinAlgLib_vera
Consolidate compiler generated dependencies of target SparseLinAlgLib
[ 54%] Built target SparseLinAlgLib
[ 54%] Built target AFLRLib_vera
Consolidate compiler generated dependencies of target AFLRLib
[ 54%] Built target AFLRLib
[ 54%] Built target EGADSLib_vera
Consolidate compiler generated dependencies of target EGADSLib
[ 56%] Built target EGADSLib
[ 56%] Built target EGTessLib_vera
Consolidate compiler generated dependencies of target EGTessLib
[ 56%] Built target EGTessLib
[ 59%] Built target EPICLib_vera
Consolidate compiler generated dependencies of target EPICLib
[ 59%] Built target EPICLib
[ 59%] Built target NonLinearSolverLib_vera
Consolidate compiler generated dependencies of target NonLinearSolverLib
[ 59%] Built target NonLinearSolverLib
[ 59%] Built target pdeLib_vera
Consolidate compiler generated dependencies of target pdeLib
[ 59%] Built target pdeLib
[ 59%] Built target AdvectionDiffusionLib_vera
Consolidate compiler generated dependencies of target AdvectionDiffusionLib
[ 62%] Built target AdvectionDiffusionLib
[ 62%] Built target AnalyticFunctionLib_vera
Consolidate compiler generated dependencies of target AnalyticFunctionLib
[ 62%] Built target AnalyticFunctionLib
[ 62%] Built target IBL_Lib_vera
Consolidate compiler generated dependencies of target IBL_Lib
[ 64%] Built target IBL_Lib
[ 67%] Built target NSLib_vera
Consolidate compiler generated dependencies of target NSLib
[ 70%] Built target NSLib
[ 70%] Built target PythonLib_vera
Consolidate compiler generated dependencies of target PythonLib
[ 70%] Built target PythonLib
[ 70%] Built target QuadratureLib_vera
Consolidate compiler generated dependencies of target QuadratureLib
[ 70%] Built target QuadratureLib
[ 70%] Built target ContinuationLib_vera
Consolidate compiler generated dependencies of target ContinuationLib
[ 70%] Built target ContinuationLib
[ 70%] Built target SurrealLib_vera
Consolidate compiler generated dependencies of target SurrealLib
[ 70%] Built target SurrealLib
[ 70%] Built target TopologyLib_vera
Consolidate compiler generated dependencies of target TopologyLib
[ 70%] Built target TopologyLib
[ 70%] Built target toolsLib_vera
Consolidate compiler generated dependencies of target toolsLib
[ 70%] Built target toolsLib
Consolidate compiler generated dependencies of target BOOST_TEST_MAIN_OBJECT
[ 70%] Built target BOOST_TEST_MAIN_OBJECT
Consolidate compiler generated dependencies of target PETSC_FIXTURE_OBJECT
[ 70%] Built target PETSC_FIXTURE_OBJECT
Consolidate compiler generated dependencies of target UnitGridsLib
[ 72%] Built target UnitGridsLib
[ 72%] Built target SANS_PREFIX_BTEST_pch
[ 72%] Building CXX object test/system/CodeConsistency/CMakeFiles/VMSDBR2_BubbleModes_btest_OBJECT.dir/VMSDBR2_BubbleModes_btest.cpp.o
[ 72%] Built target VMSDBR2_BubbleModes_btest_OBJECT
[ 72%] Linking CXX executable VMSDBR2_BubbleModes_btest
[ 72%] Built target VMSDBR2_BubbleModes_btest_build
[ 72%] Built target HeaderCompileCheck
[ 72%] Checking style of test/system/Adaptation/SolverInterface_DGAdvective_btest.cpp
[ 72%] Built target SolverInterface_DGAdvective_btest_build_vera
[ 72%] Built target libmeshb
[ 75%] Built target AdaptationLib_vera
Consolidate compiler generated dependencies of target AdaptationLib
[ 75%] Built target AdaptationLib
Consolidate compiler generated dependencies of target DGBR2Lib
[ 75%] Built target DGBR2Lib
Consolidate compiler generated dependencies of target DGBR2ADLib
[ 75%] Built target DGBR2ADLib
Consolidate compiler generated dependencies of target DGAdvectiveLib
[ 75%] Built target DGAdvectiveLib
Consolidate compiler generated dependencies of target HDGLib
[ 75%] Built target HDGLib
[ 75%] Built target EmbeddingLib_vera
Consolidate compiler generated dependencies of target EmbeddingLib
[ 75%] Built target EmbeddingLib
[ 75%] Built target TetGenLib_vera
Consolidate compiler generated dependencies of target TetGenLib
[ 75%] Built target TetGenLib
[ 75%] Built target PointwiseLib_vera
Consolidate compiler generated dependencies of target PointwiseLib
[ 75%] Built target PointwiseLib
[ 75%] Built target refineLib_vera
Consolidate compiler generated dependencies of target refineLib
[ 75%] Built target refineLib
[ 75%] Built target libMeshbLib_vera
Consolidate compiler generated dependencies of target libMeshbLib
[ 78%] Built target libMeshbLib
[ 81%] Built target FeFloaLib_vera
Consolidate compiler generated dependencies of target FeFloaLib
[ 81%] Built target FeFloaLib
[ 81%] Built target gmshLib_vera
Consolidate compiler generated dependencies of target gmshLib
[ 81%] Built target gmshLib
[ 81%] Built target XField1DLib_vera
Consolidate compiler generated dependencies of target XField1DLib
[ 81%] Built target XField1DLib
[ 81%] Built target MPILib_vera
Consolidate compiler generated dependencies of target MPILib
[ 81%] Built target MPILib
[ 81%] Building CXX object test/system/Adaptation/CMakeFiles/SolverInterface_DGAdvective_btest_OBJECT.dir/SolverInterface_DGAdvective_btest.cpp.o
[ 81%] Built target SolverInterface_DGAdvective_btest_OBJECT
[ 81%] Linking CXX executable SolverInterface_DGAdvective_btest
[ 81%] Built target SolverInterface_DGAdvective_btest_build
[ 81%] Checking style of test/system/Adaptation/SolverInterface_DGBR2_btest.cpp
[ 81%] Built target SolverInterface_DGBR2_btest_build_vera
[ 81%] Building CXX object test/system/Adaptation/CMakeFiles/SolverInterface_DGBR2_btest_OBJECT.dir/SolverInterface_DGBR2_btest.cpp.o
[ 81%] Built target SolverInterface_DGBR2_btest_OBJECT
[ 81%] Linking CXX executable SolverInterface_DGBR2_btest
[ 81%] Built target SolverInterface_DGBR2_btest_build
[ 81%] Checking style of test/system/Adaptation/SolverInterface_Galerkin_Stabilized_btest.cpp
[ 81%] Built target SolverInterface_Galerkin_Stabilized_btest_build_vera
[ 81%] Building CXX object test/system/Adaptation/CMakeFiles/SolverInterface_Galerkin_Stabilized_btest_OBJECT.dir/SolverInterface_Galerkin_Stabilized_btest.cpp.o
[ 81%] Built target SolverInterface_Galerkin_Stabilized_btest_OBJECT
[ 81%] Linking CXX executable SolverInterface_Galerkin_Stabilized_btest
[ 81%] Built target SolverInterface_Galerkin_Stabilized_btest_build
[ 81%] Checking style of test/system/Asymptotic/Adjoint1D_DGBR2_BuckleyLeverett_ST_btest.cpp
[ 81%] Built target Adjoint1D_DGBR2_BuckleyLeverett_ST_btest_build_vera
Consolidate compiler generated dependencies of target DGBR2PorousMediaLib
[ 83%] Built target DGBR2PorousMediaLib
Consolidate compiler generated dependencies of target DGBR2RANSSALib
[ 83%] Built target DGBR2RANSSALib
[ 86%] Built target PorousMediaLib_vera
Consolidate compiler generated dependencies of target PorousMediaLib
[ 86%] Built target PorousMediaLib
[ 86%] Built target ShallowWaterLib_vera
Consolidate compiler generated dependencies of target ShallowWaterLib
[ 86%] Built target ShallowWaterLib
[ 86%] Building CXX object test/system/Asymptotic/CMakeFiles/Adjoint1D_DGBR2_BuckleyLeverett_ST_btest_OBJECT.dir/Adjoint1D_DGBR2_BuckleyLeverett_ST_btest.cpp.o
[ 86%] Built target Adjoint1D_DGBR2_BuckleyLeverett_ST_btest_OBJECT
[ 86%] Linking CXX executable Adjoint1D_DGBR2_BuckleyLeverett_ST_btest
[ 86%] Built target Adjoint1D_DGBR2_BuckleyLeverett_ST_btest_build
[ 86%] Checking style of test/system/Asymptotic/Adjoint2D_CG_Triangle_AD_Bernstein_btest.cpp
[ 86%] Built target Adjoint2D_CG_Triangle_AD_Bernstein_btest_build_vera
[ 86%] Building CXX object test/system/Asymptotic/CMakeFiles/Adjoint2D_CG_Triangle_AD_Bernstein_btest_OBJECT.dir/Adjoint2D_CG_Triangle_AD_Bernstein_btest.cpp.o
[ 86%] Built target Adjoint2D_CG_Triangle_AD_Bernstein_btest_OBJECT
[ 86%] Linking CXX executable Adjoint2D_CG_Triangle_AD_Bernstein_btest
[ 86%] Built target Adjoint2D_CG_Triangle_AD_Bernstein_btest_build
[ 86%] Checking style of test/system/Asymptotic/Adjoint2D_CG_Triangle_AD_btest.cpp
[ 86%] Built target Adjoint2D_CG_Triangle_AD_btest_build_vera
[ 86%] Building CXX object test/system/Asymptotic/CMakeFiles/Adjoint2D_CG_Triangle_AD_btest_OBJECT.dir/Adjoint2D_CG_Triangle_AD_btest.cpp.o
[ 86%] Built target Adjoint2D_CG_Triangle_AD_btest_OBJECT
[ 86%] Linking CXX executable Adjoint2D_CG_Triangle_AD_btest
[ 86%] Built target Adjoint2D_CG_Triangle_AD_btest_build
[ 86%] Checking style of test/system/Asymptotic/Adjoint2D_DGAdvective_Triangle_AD_btest.cpp
[ 86%] Built target Adjoint2D_DGAdvective_Triangle_AD_btest_build_vera
[ 86%] Building CXX object test/system/Asymptotic/CMakeFiles/Adjoint2D_DGAdvective_Triangle_AD_btest_OBJECT.dir/Adjoint2D_DGAdvective_Triangle_AD_btest.cpp.o
[ 86%] Built target Adjoint2D_DGAdvective_Triangle_AD_btest_OBJECT
[ 86%] Linking CXX executable Adjoint2D_DGAdvective_Triangle_AD_btest
[ 86%] Built target Adjoint2D_DGAdvective_Triangle_AD_btest_build
[ 86%] Checking style of test/system/Asymptotic/Adjoint2D_DGBR2_Triangle_AD_btest.cpp
[ 86%] Built target Adjoint2D_DGBR2_Triangle_AD_btest_build_vera
[ 86%] Building CXX object test/system/Asymptotic/CMakeFiles/Adjoint2D_DGBR2_Triangle_AD_btest_OBJECT.dir/Adjoint2D_DGBR2_Triangle_AD_btest.cpp.o
[ 86%] Built target Adjoint2D_DGBR2_Triangle_AD_btest_OBJECT
[ 86%] Linking CXX executable Adjoint2D_DGBR2_Triangle_AD_btest
[ 86%] Built target Adjoint2D_DGBR2_Triangle_AD_btest_build
[ 86%] Checking style of test/system/Asymptotic/Adjoint2D_HDG_Triangle_AD_mitState_btest.cpp
[ 86%] Built target Adjoint2D_HDG_Triangle_AD_mitState_btest_build_vera
[ 86%] Building CXX object test/system/Asymptotic/CMakeFiles/Adjoint2D_HDG_Triangle_AD_mitState_btest_OBJECT.dir/Adjoint2D_HDG_Triangle_AD_mitState_btest.cpp.o
[ 86%] Built target Adjoint2D_HDG_Triangle_AD_mitState_btest_OBJECT
[ 86%] Linking CXX executable Adjoint2D_HDG_Triangle_AD_mitState_btest
[ 86%] Built target Adjoint2D_HDG_Triangle_AD_mitState_btest_build
[ 86%] Checking style of test/system/Asymptotic/Adjoint2D_HDG_Triangle_AD_sansLG_btest.cpp
[ 86%] Built target Adjoint2D_HDG_Triangle_AD_sansLG_btest_build_vera
[ 86%] Building CXX object test/system/Asymptotic/CMakeFiles/Adjoint2D_HDG_Triangle_AD_sansLG_btest_OBJECT.dir/Adjoint2D_HDG_Triangle_AD_sansLG_btest.cpp.o
[ 86%] Built target Adjoint2D_HDG_Triangle_AD_sansLG_btest_OBJECT
[ 86%] Linking CXX executable Adjoint2D_HDG_Triangle_AD_sansLG_btest
[ 86%] Built target Adjoint2D_HDG_Triangle_AD_sansLG_btest_build
[ 86%] Checking style of test/system/Asymptotic/ErrorEstimateOrder_1D_CG_Line_AD_btest.cpp
[ 86%] Built target ErrorEstimateOrder_1D_CG_Line_AD_btest_build_vera
[ 86%] Building CXX object test/system/Asymptotic/CMakeFiles/ErrorEstimateOrder_1D_CG_Line_AD_btest_OBJECT.dir/ErrorEstimateOrder_1D_CG_Line_AD_btest.cpp.o
[ 86%] Built target ErrorEstimateOrder_1D_CG_Line_AD_btest_OBJECT
[ 86%] Linking CXX executable ErrorEstimateOrder_1D_CG_Line_AD_btest
[ 86%] Built target ErrorEstimateOrder_1D_CG_Line_AD_btest_build
[ 86%] Checking style of test/system/Asymptotic/ErrorEstimateOrder_1D_DGBR2_Line_AD_btest.cpp
[ 86%] Built target ErrorEstimateOrder_1D_DGBR2_Line_AD_btest_build_vera
[ 86%] Building CXX object test/system/Asymptotic/CMakeFiles/ErrorEstimateOrder_1D_DGBR2_Line_AD_btest_OBJECT.dir/ErrorEstimateOrder_1D_DGBR2_Line_AD_btest.cpp.o
[ 86%] Built target ErrorEstimateOrder_1D_DGBR2_Line_AD_btest_OBJECT
[ 86%] Linking CXX executable ErrorEstimateOrder_1D_DGBR2_Line_AD_btest
[ 86%] Built target ErrorEstimateOrder_1D_DGBR2_Line_AD_btest_build
[ 86%] Checking style of test/system/Asymptotic/ErrorEstimateOrder_2D_CG_Nodal_Triangle_AD_Bernstein_btest.cpp
[ 86%] Built target ErrorEstimateOrder_2D_CG_Nodal_Triangle_AD_Bernstein_btest_build_vera
[ 86%] Building CXX object test/system/Asymptotic/CMakeFiles/ErrorEstimateOrder_2D_CG_Nodal_Triangle_AD_Bernstein_btest_OBJECT.dir/ErrorEstimateOrder_2D_CG_Nodal_Triangle_AD_Bernstein_btest.cpp.o
[ 86%] Built target ErrorEstimateOrder_2D_CG_Nodal_Triangle_AD_Bernstein_btest_OBJECT
[ 86%] Linking CXX executable ErrorEstimateOrder_2D_CG_Nodal_Triangle_AD_Bernstein_btest
[ 86%] Built target ErrorEstimateOrder_2D_CG_Nodal_Triangle_AD_Bernstein_btest_build
[ 86%] Checking style of test/system/Asymptotic/ErrorEstimateOrder_2D_CG_Nodal_Triangle_AD_btest.cpp
[ 86%] Built target ErrorEstimateOrder_2D_CG_Nodal_Triangle_AD_btest_build_vera
[ 86%] Building CXX object test/system/Asymptotic/CMakeFiles/ErrorEstimateOrder_2D_CG_Nodal_Triangle_AD_btest_OBJECT.dir/ErrorEstimateOrder_2D_CG_Nodal_Triangle_AD_btest.cpp.o
[ 86%] Built target ErrorEstimateOrder_2D_CG_Nodal_Triangle_AD_btest_OBJECT
[ 86%] Linking CXX executable ErrorEstimateOrder_2D_CG_Nodal_Triangle_AD_btest
[ 86%] Built target ErrorEstimateOrder_2D_CG_Nodal_Triangle_AD_btest_build
[ 86%] Checking style of test/system/Asymptotic/ErrorEstimateOrder_2D_CG_Triangle_AD_btest.cpp
[ 86%] Built target ErrorEstimateOrder_2D_CG_Triangle_AD_btest_build_vera
[ 86%] Building CXX object test/system/Asymptotic/CMakeFiles/ErrorEstimateOrder_2D_CG_Triangle_AD_btest_OBJECT.dir/ErrorEstimateOrder_2D_CG_Triangle_AD_btest.cpp.o
[ 86%] Built target ErrorEstimateOrder_2D_CG_Triangle_AD_btest_OBJECT
[ 86%] Linking CXX executable ErrorEstimateOrder_2D_CG_Triangle_AD_btest
[ 86%] Built target ErrorEstimateOrder_2D_CG_Triangle_AD_btest_build
[ 86%] Checking style of test/system/Asymptotic/ErrorEstimateOrder_2D_CG_Triangle_RD_btest.cpp
[ 86%] Built target ErrorEstimateOrder_2D_CG_Triangle_RD_btest_build_vera
[ 86%] Building CXX object test/system/Asymptotic/CMakeFiles/ErrorEstimateOrder_2D_CG_Triangle_RD_btest_OBJECT.dir/ErrorEstimateOrder_2D_CG_Triangle_RD_btest.cpp.o
[ 86%] Built target ErrorEstimateOrder_2D_CG_Triangle_RD_btest_OBJECT
[ 86%] Linking CXX executable ErrorEstimateOrder_2D_CG_Triangle_RD_btest
[ 86%] Built target ErrorEstimateOrder_2D_CG_Triangle_RD_btest_build
[ 86%] Checking style of test/system/Asymptotic/ErrorEstimateOrder_2D_DGAdvective_Triangle_AD_btest.cpp
[ 86%] Built target ErrorEstimateOrder_2D_DGAdvective_Triangle_AD_btest_build_vera
[ 86%] Building CXX object test/system/Asymptotic/CMakeFiles/ErrorEstimateOrder_2D_DGAdvective_Triangle_AD_btest_OBJECT.dir/ErrorEstimateOrder_2D_DGAdvective_Triangle_AD_btest.cpp.o
[ 86%] Built target ErrorEstimateOrder_2D_DGAdvective_Triangle_AD_btest_OBJECT
[ 86%] Linking CXX executable ErrorEstimateOrder_2D_DGAdvective_Triangle_AD_btest
[ 86%] Built target ErrorEstimateOrder_2D_DGAdvective_Triangle_AD_btest_build
[ 86%] Checking style of test/system/Asymptotic/ErrorEstimateOrder_2D_DGBR2_Triangle_AD_btest.cpp
[ 86%] Built target ErrorEstimateOrder_2D_DGBR2_Triangle_AD_btest_build_vera
[ 86%] Building CXX object test/system/Asymptotic/CMakeFiles/ErrorEstimateOrder_2D_DGBR2_Triangle_AD_btest_OBJECT.dir/ErrorEstimateOrder_2D_DGBR2_Triangle_AD_btest.cpp.o
[ 86%] Built target ErrorEstimateOrder_2D_DGBR2_Triangle_AD_btest_OBJECT
[ 86%] Linking CXX executable ErrorEstimateOrder_2D_DGBR2_Triangle_AD_btest
[ 86%] Built target ErrorEstimateOrder_2D_DGBR2_Triangle_AD_btest_build
[ 86%] Checking style of test/system/Asymptotic/ErrorEstimateOrder_2D_HDG_Triangle_AD_btest.cpp
[ 86%] Built target ErrorEstimateOrder_2D_HDG_Triangle_AD_btest_build_vera
[ 86%] Building CXX object test/system/Asymptotic/CMakeFiles/ErrorEstimateOrder_2D_HDG_Triangle_AD_btest_OBJECT.dir/ErrorEstimateOrder_2D_HDG_Triangle_AD_btest.cpp.o
[ 86%] Built target ErrorEstimateOrder_2D_HDG_Triangle_AD_btest_OBJECT
[ 86%] Linking CXX executable ErrorEstimateOrder_2D_HDG_Triangle_AD_btest
[ 86%] Built target ErrorEstimateOrder_2D_HDG_Triangle_AD_btest_build
[ 86%] Checking style of test/system/Asymptotic/ErrorEstimateOrder_3D_CG_Tet_AD_btest.cpp
[ 86%] Built target ErrorEstimateOrder_3D_CG_Tet_AD_btest_build_vera
[ 86%] Building CXX object test/system/Asymptotic/CMakeFiles/ErrorEstimateOrder_3D_CG_Tet_AD_btest_OBJECT.dir/ErrorEstimateOrder_3D_CG_Tet_AD_btest.cpp.o
[ 86%] Built target ErrorEstimateOrder_3D_CG_Tet_AD_btest_OBJECT
[ 86%] Linking CXX executable ErrorEstimateOrder_3D_CG_Tet_AD_btest
[ 86%] Built target ErrorEstimateOrder_3D_CG_Tet_AD_btest_build
[ 86%] Checking style of test/system/Asymptotic/ErrorOrder_1D_CG_AD_BDF_btest.cpp
[ 86%] Built target ErrorOrder_1D_CG_AD_BDF_btest_build_vera
[ 86%] Building CXX object test/system/Asymptotic/CMakeFiles/ErrorOrder_1D_CG_AD_BDF_btest_OBJECT.dir/ErrorOrder_1D_CG_AD_BDF_btest.cpp.o
[ 86%] Built target ErrorOrder_1D_CG_AD_BDF_btest_OBJECT
[ 86%] Linking CXX executable ErrorOrder_1D_CG_AD_BDF_btest
[ 86%] Built target ErrorOrder_1D_CG_AD_BDF_btest_build
[ 86%] Checking style of test/system/Asymptotic/ErrorOrder_1D_CG_AD_Bernstein_btest.cpp
[ 86%] Built target ErrorOrder_1D_CG_AD_Bernstein_btest_build_vera
[ 86%] Building CXX object test/system/Asymptotic/CMakeFiles/ErrorOrder_1D_CG_AD_Bernstein_btest_OBJECT.dir/ErrorOrder_1D_CG_AD_Bernstein_btest.cpp.o
[ 86%] Built target ErrorOrder_1D_CG_AD_Bernstein_btest_OBJECT
[ 86%] Linking CXX executable ErrorOrder_1D_CG_AD_Bernstein_btest
[ 86%] Built target ErrorOrder_1D_CG_AD_Bernstein_btest_build
[ 86%] Checking style of test/system/Asymptotic/ErrorOrder_1D_CG_AD_btest.cpp
[ 86%] Built target ErrorOrder_1D_CG_AD_btest_build_vera
[ 86%] Building CXX object test/system/Asymptotic/CMakeFiles/ErrorOrder_1D_CG_AD_btest_OBJECT.dir/ErrorOrder_1D_CG_AD_btest.cpp.o
[ 86%] Built target ErrorOrder_1D_CG_AD_btest_OBJECT
[ 86%] Linking CXX executable ErrorOrder_1D_CG_AD_btest
[ 86%] Built target ErrorOrder_1D_CG_AD_btest_build
[ 86%] Checking style of test/system/Asymptotic/ErrorOrder_1D_DGAdvective_ShallowWater_btest.cpp
[ 86%] Built target ErrorOrder_1D_DGAdvective_ShallowWater_btest_build_vera
[ 86%] Building CXX object test/system/Asymptotic/CMakeFiles/ErrorOrder_1D_DGAdvective_ShallowWater_btest_OBJECT.dir/ErrorOrder_1D_DGAdvective_ShallowWater_btest.cpp.o
[ 86%] Built target ErrorOrder_1D_DGAdvective_ShallowWater_btest_OBJECT
[ 86%] Linking CXX executable ErrorOrder_1D_DGAdvective_ShallowWater_btest
[ 86%] Built target ErrorOrder_1D_DGAdvective_ShallowWater_btest_build
[ 86%] Checking style of test/system/Asymptotic/ErrorOrder_1D_DGBR2_AD_BDF_btest.cpp
[ 86%] Built target ErrorOrder_1D_DGBR2_AD_BDF_btest_build_vera
[ 86%] Building CXX object test/system/Asymptotic/CMakeFiles/ErrorOrder_1D_DGBR2_AD_BDF_btest_OBJECT.dir/ErrorOrder_1D_DGBR2_AD_BDF_btest.cpp.o
[ 86%] Built target ErrorOrder_1D_DGBR2_AD_BDF_btest_OBJECT
[ 86%] Linking CXX executable ErrorOrder_1D_DGBR2_AD_BDF_btest
[ 86%] Built target ErrorOrder_1D_DGBR2_AD_BDF_btest_build
[ 86%] Checking style of test/system/Asymptotic/ErrorOrder_1D_DGBR2_AD_Bernstein_btest.cpp
[ 86%] Built target ErrorOrder_1D_DGBR2_AD_Bernstein_btest_build_vera
[ 86%] Building CXX object test/system/Asymptotic/CMakeFiles/ErrorOrder_1D_DGBR2_AD_Bernstein_btest_OBJECT.dir/ErrorOrder_1D_DGBR2_AD_Bernstein_btest.cpp.o
[ 86%] Built target ErrorOrder_1D_DGBR2_AD_Bernstein_btest_OBJECT
[ 86%] Linking CXX executable ErrorOrder_1D_DGBR2_AD_Bernstein_btest
[ 86%] Built target ErrorOrder_1D_DGBR2_AD_Bernstein_btest_build
[ 86%] Checking style of test/system/Asymptotic/ErrorOrder_1D_DGBR2_AD_HB_btest.cpp
[ 86%] Built target ErrorOrder_1D_DGBR2_AD_HB_btest_build_vera
[ 86%] Building CXX object test/system/Asymptotic/CMakeFiles/ErrorOrder_1D_DGBR2_AD_HB_btest_OBJECT.dir/ErrorOrder_1D_DGBR2_AD_HB_btest.cpp.o
[ 86%] Built target ErrorOrder_1D_DGBR2_AD_HB_btest_OBJECT
[ 86%] Linking CXX executable ErrorOrder_1D_DGBR2_AD_HB_btest
[ 86%] Built target ErrorOrder_1D_DGBR2_AD_HB_btest_build
[ 86%] Checking style of test/system/Asymptotic/ErrorOrder_1D_DGBR2_AD_btest.cpp
[ 86%] Built target ErrorOrder_1D_DGBR2_AD_btest_build_vera
[ 86%] Building CXX object test/system/Asymptotic/CMakeFiles/ErrorOrder_1D_DGBR2_AD_btest_OBJECT.dir/ErrorOrder_1D_DGBR2_AD_btest.cpp.o
[ 86%] Built target ErrorOrder_1D_DGBR2_AD_btest_OBJECT
[ 86%] Linking CXX executable ErrorOrder_1D_DGBR2_AD_btest
[ 86%] Built target ErrorOrder_1D_DGBR2_AD_btest_build
[ 86%] Checking style of test/system/Asymptotic/ErrorOrder_1D_DGBR2_BuckleyLeverett_ST_btest.cpp
[ 86%] Built target ErrorOrder_1D_DGBR2_BuckleyLeverett_ST_btest_build_vera
[ 86%] Building CXX object test/system/Asymptotic/CMakeFiles/ErrorOrder_1D_DGBR2_BuckleyLeverett_ST_btest_OBJECT.dir/ErrorOrder_1D_DGBR2_BuckleyLeverett_ST_btest.cpp.o
[ 86%] Built target ErrorOrder_1D_DGBR2_BuckleyLeverett_ST_btest_OBJECT
[ 86%] Linking CXX executable ErrorOrder_1D_DGBR2_BuckleyLeverett_ST_btest
[ 86%] Built target ErrorOrder_1D_DGBR2_BuckleyLeverett_ST_btest_build
[ 86%] Checking style of test/system/Asymptotic/ErrorOrder_1D_DGBR2_TwoPhase_ST_btest.cpp
[ 86%] Built target ErrorOrder_1D_DGBR2_TwoPhase_ST_btest_build_vera
[ 89%] Building CXX object test/system/Asymptotic/CMakeFiles/ErrorOrder_1D_DGBR2_TwoPhase_ST_btest_OBJECT.dir/ErrorOrder_1D_DGBR2_TwoPhase_ST_btest.cpp.o
[ 89%] Built target ErrorOrder_1D_DGBR2_TwoPhase_ST_btest_OBJECT
[ 89%] Linking CXX executable ErrorOrder_1D_DGBR2_TwoPhase_ST_btest
[ 89%] Built target ErrorOrder_1D_DGBR2_TwoPhase_ST_btest_build
[ 89%] Checking style of test/system/Asymptotic/ErrorOrder_1D_HDGAdvective_Advection_btest.cpp
[ 89%] Built target ErrorOrder_1D_HDGAdvective_Advection_btest_build_vera
[ 89%] Building CXX object test/system/Asymptotic/CMakeFiles/ErrorOrder_1D_HDGAdvective_Advection_btest_OBJECT.dir/ErrorOrder_1D_HDGAdvective_Advection_btest.cpp.o
[ 89%] Built target ErrorOrder_1D_HDGAdvective_Advection_btest_OBJECT
[ 89%] Linking CXX executable ErrorOrder_1D_HDGAdvective_Advection_btest
[ 89%] Built target ErrorOrder_1D_HDGAdvective_Advection_btest_build
[ 89%] Checking style of test/system/Asymptotic/ErrorOrder_1D_HDG_AD_BDF_btest.cpp
[ 89%] Built target ErrorOrder_1D_HDG_AD_BDF_btest_build_vera
[ 89%] Building CXX object test/system/Asymptotic/CMakeFiles/ErrorOrder_1D_HDG_AD_BDF_btest_OBJECT.dir/ErrorOrder_1D_HDG_AD_BDF_btest.cpp.o
[ 89%] Built target ErrorOrder_1D_HDG_AD_BDF_btest_OBJECT
[ 89%] Linking CXX executable ErrorOrder_1D_HDG_AD_BDF_btest
[ 89%] Built target ErrorOrder_1D_HDG_AD_BDF_btest_build
[ 89%] Checking style of test/system/Asymptotic/ErrorOrder_1D_HDG_AD_btest.cpp
[ 89%] Built target ErrorOrder_1D_HDG_AD_btest_build_vera
[ 89%] Building CXX object test/system/Asymptotic/CMakeFiles/ErrorOrder_1D_HDG_AD_btest_OBJECT.dir/ErrorOrder_1D_HDG_AD_btest.cpp.o
[ 89%] Built target ErrorOrder_1D_HDG_AD_btest_OBJECT
[ 89%] Linking CXX executable ErrorOrder_1D_HDG_AD_btest
[ 89%] Built target ErrorOrder_1D_HDG_AD_btest_build
[ 89%] Checking style of test/system/Asymptotic/ErrorOrder_2D_CGStabilized_RANS_MMS_btest.cpp
[ 89%] Built target ErrorOrder_2D_CGStabilized_RANS_MMS_btest_build_vera
[ 89%] Building CXX object test/system/Asymptotic/CMakeFiles/ErrorOrder_2D_CGStabilized_RANS_MMS_btest_OBJECT.dir/ErrorOrder_2D_CGStabilized_RANS_MMS_btest.cpp.o
In file included from /jenkins/workspace/SANS_Nightly/builddir/undefined_gnu9/buildnode/reynolds/test/system/Asymptotic/ErrorOrder_2D_CGStabilized_RANS_MMS_btest.cpp:25:
/jenkins/workspace/SANS_Nightly/builddir/undefined_gnu9/buildnode/reynolds/src/pde/NS/PDERANSSA2D.h: In member function ‘void SANS::PDERANSSA2D<PDETraitsSize, PDETraitsModel>::diffusionViscousGradient(const Real&, const Real&, const Real&, const Real&, SANS::PDERANSSA2D<PDETraitsSize, PDETraitsModel>::ArrayQ<T>&, SANS::PDERANSSA2D<PDETraitsSize, PDETraitsModel>::ArrayQ<Tg>&, SANS::PDERANSSA2D<PDETraitsSize, PDETraitsModel>::ArrayQ<Tg>&, SANS::PDERANSSA2D<PDETraitsSize, PDETraitsModel>::ArrayQ<Tf>&, SANS::PDERANSSA2D<PDETraitsSize, PDETraitsModel>::ArrayQ<Tf>&, SANS::PDERANSSA2D<PDETraitsSize, PDETraitsModel>::ArrayQ<Tf>&, SANS::PDERANSSA2D<PDETraitsSize, PDETraitsModel>::MatrixQ<Tk>&, SANS::PDERANSSA2D<PDETraitsSize, PDETraitsModel>::MatrixQ<Tk>&, SANS::PDERANSSA2D<PDETraitsSize, PDETraitsModel>::MatrixQ<Tk>&, SANS::PDERANSSA2D<PDETraitsSize, PDETraitsModel>::MatrixQ<Tk>&, SANS::PDERANSSA2D<PDETraitsSize, PDETraitsModel>::MatrixQ<Tk>&, SANS::PDERANSSA2D<PDETraitsSize, PDETraitsModel>::MatrixQ<Tk>&) const [with Tq = SANS::SurrealS<5, double>; Tg = double; Th = double; Tk = SANS::SurrealS<5, double>; PDETraitsSize = SANS::TraitsSizeRANSSA; PDETraitsModel = SANS::TraitsModelRANSSA<SANS::QTypePrimitiveRhoPressure, SANS::GasModel, SANS::ViscosityModel_Const, SANS::ThermalConductivityModel>]’:
/jenkins/workspace/SANS_Nightly/builddir/undefined_gnu9/buildnode/reynolds/src/pde/NS/PDERANSSA2D.h:2029:1: note: variable tracking size limit exceeded with ‘-fvar-tracking-assignments’, retrying without
 2029 | PDERANSSA2D<PDETraitsSize, PDETraitsModel>::diffusionViscousGradient(
      | ^~~~~~~~~~~~~~~~~~~~~~~~~~~~~~~~~~~~~~~~~~
/jenkins/workspace/SANS_Nightly/builddir/undefined_gnu9/buildnode/reynolds/src/pde/NS/PDERANSSA2D.h: In member function ‘void SANS::PDERANSSA2D<PDETraitsSize, PDETraitsModel>::jacobianGradientSourceGradient(const Real&, const Real&, const Real&, const Real&, SANS::PDERANSSA2D<PDETraitsSize, PDETraitsModel>::ArrayQ<T>&, SANS::PDERANSSA2D<PDETraitsSize, PDETraitsModel>::ArrayQ<Tg>&, SANS::PDERANSSA2D<PDETraitsSize, PDETraitsModel>::ArrayQ<Tg>&, SANS::PDERANSSA2D<PDETraitsSize, PDETraitsModel>::ArrayQ<Tf>&, SANS::PDERANSSA2D<PDETraitsSize, PDETraitsModel>::ArrayQ<Tf>&, SANS::PDERANSSA2D<PDETraitsSize, PDETraitsModel>::ArrayQ<Tf>&, SANS::PDERANSSA2D<PDETraitsSize, PDETraitsModel>::MatrixQ<Tk>&) const [with Tq = SANS::SurrealS<5, double>; Tg = double; Th = double; Ts = SANS::SurrealS<5, double>; PDETraitsSize = SANS::TraitsSizeRANSSA; PDETraitsModel = SANS::TraitsModelRANSSA<SANS::QTypePrimitiveRhoPressure, SANS::GasModel, SANS::ViscosityModel_Const, SANS::ThermalConductivityModel>]’:
/jenkins/workspace/SANS_Nightly/builddir/undefined_gnu9/buildnode/reynolds/src/pde/NS/PDERANSSA2D.h:4242:1: note: variable tracking size limit exceeded with ‘-fvar-tracking-assignments’, retrying without
 4242 | PDERANSSA2D<PDETraitsSize, PDETraitsModel>::jacobianGradientSourceGradient(
      | ^~~~~~~~~~~~~~~~~~~~~~~~~~~~~~~~~~~~~~~~~~
/jenkins/workspace/SANS_Nightly/builddir/undefined_gnu9/buildnode/reynolds/src/pde/NS/PDERANSSA2D.h: In member function ‘void SANS::PDERANSSA2D<PDETraitsSize, PDETraitsModel>::diffusionViscousGradient(const Real&, const Real&, const Real&, const Real&, SANS::PDERANSSA2D<PDETraitsSize, PDETraitsModel>::ArrayQ<T>&, SANS::PDERANSSA2D<PDETraitsSize, PDETraitsModel>::ArrayQ<Tg>&, SANS::PDERANSSA2D<PDETraitsSize, PDETraitsModel>::ArrayQ<Tg>&, SANS::PDERANSSA2D<PDETraitsSize, PDETraitsModel>::ArrayQ<Tf>&, SANS::PDERANSSA2D<PDETraitsSize, PDETraitsModel>::ArrayQ<Tf>&, SANS::PDERANSSA2D<PDETraitsSize, PDETraitsModel>::ArrayQ<Tf>&, SANS::PDERANSSA2D<PDETraitsSize, PDETraitsModel>::MatrixQ<Tk>&, SANS::PDERANSSA2D<PDETraitsSize, PDETraitsModel>::MatrixQ<Tk>&, SANS::PDERANSSA2D<PDETraitsSize, PDETraitsModel>::MatrixQ<Tk>&, SANS::PDERANSSA2D<PDETraitsSize, PDETraitsModel>::MatrixQ<Tk>&, SANS::PDERANSSA2D<PDETraitsSize, PDETraitsModel>::MatrixQ<Tk>&, SANS::PDERANSSA2D<PDETraitsSize, PDETraitsModel>::MatrixQ<Tk>&) const [with Tq = double; Tg = SANS::SurrealS<5, double>; Th = double; Tk = SANS::SurrealS<5, double>; PDETraitsSize = SANS::TraitsSizeRANSSA; PDETraitsModel = SANS::TraitsModelRANSSA<SANS::QTypePrimitiveRhoPressure, SANS::GasModel, SANS::ViscosityModel_Const, SANS::ThermalConductivityModel>]’:
/jenkins/workspace/SANS_Nightly/builddir/undefined_gnu9/buildnode/reynolds/src/pde/NS/PDERANSSA2D.h:2029:1: note: variable tracking size limit exceeded with ‘-fvar-tracking-assignments’, retrying without
 2029 | PDERANSSA2D<PDETraitsSize, PDETraitsModel>::diffusionViscousGradient(
      | ^~~~~~~~~~~~~~~~~~~~~~~~~~~~~~~~~~~~~~~~~~
[ 89%] Built target ErrorOrder_2D_CGStabilized_RANS_MMS_btest_OBJECT
[ 89%] Linking CXX executable ErrorOrder_2D_CGStabilized_RANS_MMS_btest
[ 89%] Built target ErrorOrder_2D_CGStabilized_RANS_MMS_btest_build
[ 89%] Checking style of test/system/Asymptotic/ErrorOrder_2D_CG_Quad_AD_btest.cpp
[ 89%] Built target ErrorOrder_2D_CG_Quad_AD_btest_build_vera
[ 89%] Building CXX object test/system/Asymptotic/CMakeFiles/ErrorOrder_2D_CG_Quad_AD_btest_OBJECT.dir/ErrorOrder_2D_CG_Quad_AD_btest.cpp.o
[ 89%] Built target ErrorOrder_2D_CG_Quad_AD_btest_OBJECT
[ 89%] Linking CXX executable ErrorOrder_2D_CG_Quad_AD_btest
[ 89%] Built target ErrorOrder_2D_CG_Quad_AD_btest_build
[ 89%] Checking style of test/system/Asymptotic/ErrorOrder_2D_CG_Triangle_AD_Bernstein_btest.cpp
[ 89%] Built target ErrorOrder_2D_CG_Triangle_AD_Bernstein_btest_build_vera
[ 89%] Building CXX object test/system/Asymptotic/CMakeFiles/ErrorOrder_2D_CG_Triangle_AD_Bernstein_btest_OBJECT.dir/ErrorOrder_2D_CG_Triangle_AD_Bernstein_btest.cpp.o
[ 89%] Built target ErrorOrder_2D_CG_Triangle_AD_Bernstein_btest_OBJECT
[ 89%] Linking CXX executable ErrorOrder_2D_CG_Triangle_AD_Bernstein_btest
[ 89%] Built target ErrorOrder_2D_CG_Triangle_AD_Bernstein_btest_build
[ 89%] Checking style of test/system/Asymptotic/ErrorOrder_2D_CG_Triangle_AD_btest.cpp
[ 89%] Built target ErrorOrder_2D_CG_Triangle_AD_btest_build_vera
[ 89%] Building CXX object test/system/Asymptotic/CMakeFiles/ErrorOrder_2D_CG_Triangle_AD_btest_OBJECT.dir/ErrorOrder_2D_CG_Triangle_AD_btest.cpp.o
[ 89%] Built target ErrorOrder_2D_CG_Triangle_AD_btest_OBJECT
[ 89%] Linking CXX executable ErrorOrder_2D_CG_Triangle_AD_btest
[ 89%] Built target ErrorOrder_2D_CG_Triangle_AD_btest_build
[ 89%] Checking style of test/system/Asymptotic/ErrorOrder_2D_DGAdvective_Annulus_Quad_btest.cpp
[ 89%] Built target ErrorOrder_2D_DGAdvective_Annulus_Quad_btest_build_vera
[ 89%] Building CXX object test/system/Asymptotic/CMakeFiles/ErrorOrder_2D_DGAdvective_Annulus_Quad_btest_OBJECT.dir/ErrorOrder_2D_DGAdvective_Annulus_Quad_btest.cpp.o
[ 89%] Built target ErrorOrder_2D_DGAdvective_Annulus_Quad_btest_OBJECT
[ 89%] Linking CXX executable ErrorOrder_2D_DGAdvective_Annulus_Quad_btest
[ 89%] Built target ErrorOrder_2D_DGAdvective_Annulus_Quad_btest_build
[ 89%] Checking style of test/system/Asymptotic/ErrorOrder_2D_DGAdvective_Annulus_Triangle_btest.cpp
[ 89%] Built target ErrorOrder_2D_DGAdvective_Annulus_Triangle_btest_build_vera
[ 89%] Building CXX object test/system/Asymptotic/CMakeFiles/ErrorOrder_2D_DGAdvective_Annulus_Triangle_btest_OBJECT.dir/ErrorOrder_2D_DGAdvective_Annulus_Triangle_btest.cpp.o
[ 89%] Built target ErrorOrder_2D_DGAdvective_Annulus_Triangle_btest_OBJECT
[ 89%] Linking CXX executable ErrorOrder_2D_DGAdvective_Annulus_Triangle_btest
[ 89%] Built target ErrorOrder_2D_DGAdvective_Annulus_Triangle_btest_build
[ 89%] Checking style of test/system/Asymptotic/ErrorOrder_2D_DGAdvective_Circle_Line_AD_btest.cpp
[ 89%] Built target ErrorOrder_2D_DGAdvective_Circle_Line_AD_btest_build_vera
[ 89%] Building CXX object test/system/Asymptotic/CMakeFiles/ErrorOrder_2D_DGAdvective_Circle_Line_AD_btest_OBJECT.dir/ErrorOrder_2D_DGAdvective_Circle_Line_AD_btest.cpp.o
[ 89%] Built target ErrorOrder_2D_DGAdvective_Circle_Line_AD_btest_OBJECT
[ 89%] Linking CXX executable ErrorOrder_2D_DGAdvective_Circle_Line_AD_btest
[ 89%] Built target ErrorOrder_2D_DGAdvective_Circle_Line_AD_btest_build
[ 89%] Checking style of test/system/Asymptotic/ErrorOrder_2D_DGAdvective_Circle_Line_ShallowWater_btest.cpp
[ 89%] Built target ErrorOrder_2D_DGAdvective_Circle_Line_ShallowWater_btest_build_vera
[ 89%] Building CXX object test/system/Asymptotic/CMakeFiles/ErrorOrder_2D_DGAdvective_Circle_Line_ShallowWater_btest_OBJECT.dir/ErrorOrder_2D_DGAdvective_Circle_Line_ShallowWater_btest.cpp.o
[ 89%] Built target ErrorOrder_2D_DGAdvective_Circle_Line_ShallowWater_btest_OBJECT
[ 89%] Linking CXX executable ErrorOrder_2D_DGAdvective_Circle_Line_ShallowWater_btest
[ 89%] Built target ErrorOrder_2D_DGAdvective_Circle_Line_ShallowWater_btest_build
[ 89%] Checking style of test/system/Asymptotic/ErrorOrder_2D_DGAdvective_Flat_Line_AD_btest.cpp
[ 89%] Built target ErrorOrder_2D_DGAdvective_Flat_Line_AD_btest_build_vera
[ 89%] Building CXX object test/system/Asymptotic/CMakeFiles/ErrorOrder_2D_DGAdvective_Flat_Line_AD_btest_OBJECT.dir/ErrorOrder_2D_DGAdvective_Flat_Line_AD_btest.cpp.o
[ 89%] Built target ErrorOrder_2D_DGAdvective_Flat_Line_AD_btest_OBJECT
[ 89%] Linking CXX executable ErrorOrder_2D_DGAdvective_Flat_Line_AD_btest
[ 89%] Built target ErrorOrder_2D_DGAdvective_Flat_Line_AD_btest_build
[ 89%] Checking style of test/system/Asymptotic/ErrorOrder_2D_DGBR2_RANS_MMS_btest.cpp
[ 89%] Built target ErrorOrder_2D_DGBR2_RANS_MMS_btest_build_vera
[ 89%] Building CXX object test/system/Asymptotic/CMakeFiles/ErrorOrder_2D_DGBR2_RANS_MMS_btest_OBJECT.dir/ErrorOrder_2D_DGBR2_RANS_MMS_btest.cpp.o
[ 89%] Built target ErrorOrder_2D_DGBR2_RANS_MMS_btest_OBJECT
[ 89%] Linking CXX executable ErrorOrder_2D_DGBR2_RANS_MMS_btest
[ 89%] Built target ErrorOrder_2D_DGBR2_RANS_MMS_btest_build
[ 89%] Checking style of test/system/Asymptotic/ErrorOrder_2D_DGBR2_Triangle_AD_Bernstein_btest.cpp
[ 89%] Built target ErrorOrder_2D_DGBR2_Triangle_AD_Bernstein_btest_build_vera
[ 89%] Building CXX object test/system/Asymptotic/CMakeFiles/ErrorOrder_2D_DGBR2_Triangle_AD_Bernstein_btest_OBJECT.dir/ErrorOrder_2D_DGBR2_Triangle_AD_Bernstein_btest.cpp.o
[ 89%] Built target ErrorOrder_2D_DGBR2_Triangle_AD_Bernstein_btest_OBJECT
[ 89%] Linking CXX executable ErrorOrder_2D_DGBR2_Triangle_AD_Bernstein_btest
[ 89%] Built target ErrorOrder_2D_DGBR2_Triangle_AD_Bernstein_btest_build
[ 89%] Checking style of test/system/Asymptotic/ErrorOrder_2D_DGBR2_Triangle_AD_btest.cpp
[ 89%] Built target ErrorOrder_2D_DGBR2_Triangle_AD_btest_build_vera
[ 89%] Building CXX object test/system/Asymptotic/CMakeFiles/ErrorOrder_2D_DGBR2_Triangle_AD_btest_OBJECT.dir/ErrorOrder_2D_DGBR2_Triangle_AD_btest.cpp.o
[ 89%] Built target ErrorOrder_2D_DGBR2_Triangle_AD_btest_OBJECT
[ 89%] Linking CXX executable ErrorOrder_2D_DGBR2_Triangle_AD_btest
[ 89%] Built target ErrorOrder_2D_DGBR2_Triangle_AD_btest_build
[ 89%] Checking style of test/system/Asymptotic/ErrorOrder_2D_EDG_Triangle_AD_btest.cpp
[ 89%] Built target ErrorOrder_2D_EDG_Triangle_AD_btest_build_vera
[ 89%] Building CXX object test/system/Asymptotic/CMakeFiles/ErrorOrder_2D_EDG_Triangle_AD_btest_OBJECT.dir/ErrorOrder_2D_EDG_Triangle_AD_btest.cpp.o
[ 89%] Built target ErrorOrder_2D_EDG_Triangle_AD_btest_OBJECT
[ 89%] Linking CXX executable ErrorOrder_2D_EDG_Triangle_AD_btest
[ 89%] Built target ErrorOrder_2D_EDG_Triangle_AD_btest_build
[ 89%] Checking style of test/system/Asymptotic/ErrorOrder_2D_HDG_Triangle_AD_btest.cpp
[ 89%] Built target ErrorOrder_2D_HDG_Triangle_AD_btest_build_vera
[ 89%] Building CXX object test/system/Asymptotic/CMakeFiles/ErrorOrder_2D_HDG_Triangle_AD_btest_OBJECT.dir/ErrorOrder_2D_HDG_Triangle_AD_btest.cpp.o
[ 89%] Built target ErrorOrder_2D_HDG_Triangle_AD_btest_OBJECT
[ 89%] Linking CXX executable ErrorOrder_2D_HDG_Triangle_AD_btest
[ 89%] Built target ErrorOrder_2D_HDG_Triangle_AD_btest_build
[ 89%] Checking style of test/system/Asymptotic/ErrorOrder_2D_L2Project_Bernstein_btest.cpp
[ 89%] Built target ErrorOrder_2D_L2Project_Bernstein_btest_build_vera
[ 89%] Building CXX object test/system/Asymptotic/CMakeFiles/ErrorOrder_2D_L2Project_Bernstein_btest_OBJECT.dir/ErrorOrder_2D_L2Project_Bernstein_btest.cpp.o
[ 89%] Built target ErrorOrder_2D_L2Project_Bernstein_btest_OBJECT
[ 89%] Linking CXX executable ErrorOrder_2D_L2Project_Bernstein_btest
[ 89%] Built target ErrorOrder_2D_L2Project_Bernstein_btest_build
[ 89%] Checking style of test/system/Asymptotic/ErrorOrder_3D_CG_Hex_AD_btest.cpp
[ 89%] Built target ErrorOrder_3D_CG_Hex_AD_btest_build_vera
[ 89%] Building CXX object test/system/Asymptotic/CMakeFiles/ErrorOrder_3D_CG_Hex_AD_btest_OBJECT.dir/ErrorOrder_3D_CG_Hex_AD_btest.cpp.o
[ 89%] Built target ErrorOrder_3D_CG_Hex_AD_btest_OBJECT
[ 89%] Linking CXX executable ErrorOrder_3D_CG_Hex_AD_btest
[ 89%] Built target ErrorOrder_3D_CG_Hex_AD_btest_build
[ 89%] Checking style of test/system/Asymptotic/ErrorOrder_3D_CG_Sphere_Triangle_AD_btest.cpp
[ 89%] Built target ErrorOrder_3D_CG_Sphere_Triangle_AD_btest_build_vera
[ 89%] Building CXX object test/system/Asymptotic/CMakeFiles/ErrorOrder_3D_CG_Sphere_Triangle_AD_btest_OBJECT.dir/ErrorOrder_3D_CG_Sphere_Triangle_AD_btest.cpp.o
[ 89%] Built target ErrorOrder_3D_CG_Sphere_Triangle_AD_btest_OBJECT
[ 89%] Linking CXX executable ErrorOrder_3D_CG_Sphere_Triangle_AD_btest
[ 89%] Built target ErrorOrder_3D_CG_Sphere_Triangle_AD_btest_build
[ 89%] Checking style of test/system/Asymptotic/ErrorOrder_3D_CG_Tet_AD_btest.cpp
[ 89%] Built target ErrorOrder_3D_CG_Tet_AD_btest_build_vera
[ 89%] Building CXX object test/system/Asymptotic/CMakeFiles/ErrorOrder_3D_CG_Tet_AD_btest_OBJECT.dir/ErrorOrder_3D_CG_Tet_AD_btest.cpp.o
[ 89%] Built target ErrorOrder_3D_CG_Tet_AD_btest_OBJECT
[ 89%] Linking CXX executable ErrorOrder_3D_CG_Tet_AD_btest
[ 89%] Built target ErrorOrder_3D_CG_Tet_AD_btest_build
[ 89%] Checking style of test/system/Asymptotic/ErrorOrder_3D_DGBR2_Periodic_Hex_AD_btest.cpp
[ 89%] Built target ErrorOrder_3D_DGBR2_Periodic_Hex_AD_btest_build_vera
[ 89%] Building CXX object test/system/Asymptotic/CMakeFiles/ErrorOrder_3D_DGBR2_Periodic_Hex_AD_btest_OBJECT.dir/ErrorOrder_3D_DGBR2_Periodic_Hex_AD_btest.cpp.o
[ 89%] Built target ErrorOrder_3D_DGBR2_Periodic_Hex_AD_btest_OBJECT
[ 89%] Linking CXX executable ErrorOrder_3D_DGBR2_Periodic_Hex_AD_btest
[ 89%] Built target ErrorOrder_3D_DGBR2_Periodic_Hex_AD_btest_build
[ 89%] Checking style of test/system/Asymptotic/ErrorOrder_3D_DGBR2_Sphere_Triangle_AD_btest.cpp
[ 89%] Built target ErrorOrder_3D_DGBR2_Sphere_Triangle_AD_btest_build_vera
[ 89%] Building CXX object test/system/Asymptotic/CMakeFiles/ErrorOrder_3D_DGBR2_Sphere_Triangle_AD_btest_OBJECT.dir/ErrorOrder_3D_DGBR2_Sphere_Triangle_AD_btest.cpp.o
[ 89%] Built target ErrorOrder_3D_DGBR2_Sphere_Triangle_AD_btest_OBJECT
[ 89%] Linking CXX executable ErrorOrder_3D_DGBR2_Sphere_Triangle_AD_btest
[ 89%] Built target ErrorOrder_3D_DGBR2_Sphere_Triangle_AD_btest_build
[ 89%] Checking style of test/system/Asymptotic/ErrorOrder_3D_DGBR2_Tet_AD_btest.cpp
[ 89%] Built target ErrorOrder_3D_DGBR2_Tet_AD_btest_build_vera
[ 89%] Building CXX object test/system/Asymptotic/CMakeFiles/ErrorOrder_3D_DGBR2_Tet_AD_btest_OBJECT.dir/ErrorOrder_3D_DGBR2_Tet_AD_btest.cpp.o
[ 89%] Built target ErrorOrder_3D_DGBR2_Tet_AD_btest_OBJECT
[ 89%] Linking CXX executable ErrorOrder_3D_DGBR2_Tet_AD_btest
[ 89%] Built target ErrorOrder_3D_DGBR2_Tet_AD_btest_build
[ 89%] Checking style of test/system/Asymptotic/ErrorOrder_4D_DG_Pentatope_btest.cpp
[ 89%] Built target ErrorOrder_4D_DG_Pentatope_btest_build_vera
[ 89%] Building CXX object test/system/Asymptotic/CMakeFiles/ErrorOrder_4D_DG_Pentatope_btest_OBJECT.dir/ErrorOrder_4D_DG_Pentatope_btest.cpp.o
[ 89%] Built target ErrorOrder_4D_DG_Pentatope_btest_OBJECT
[ 89%] Linking CXX executable ErrorOrder_4D_DG_Pentatope_btest
[ 89%] Built target ErrorOrder_4D_DG_Pentatope_btest_build
[ 91%] Checking style of test/system/Asymptotic/Solve2D_DGAdvective_LinearRobin_mitLG_sansLG_Consistency_AD_btest.cpp
[ 91%] Built target Solve2D_DGAdvective_LinearRobin_mitLG_sansLG_Consistency_AD_btest_build_vera
[ 91%] Building CXX object test/system/Asymptotic/CMakeFiles/Solve2D_DGAdvective_LinearRobin_mitLG_sansLG_Consistency_AD_btest_OBJECT.dir/Solve2D_DGAdvective_LinearRobin_mitLG_sansLG_Consistency_AD_btest.cpp.o
[ 91%] Built target Solve2D_DGAdvective_LinearRobin_mitLG_sansLG_Consistency_AD_btest_OBJECT
[ 91%] Linking CXX executable Solve2D_DGAdvective_LinearRobin_mitLG_sansLG_Consistency_AD_btest
[ 91%] Built target Solve2D_DGAdvective_LinearRobin_mitLG_sansLG_Consistency_AD_btest_build
[ 91%] Checking style of test/system/LocalSolve/AlgebraicEquationSet_Local_VMSDBR2_Triangle_AD_btest.cpp
[ 91%] Built target AlgebraicEquationSet_Local_VMSDBR2_Triangle_AD_btest_build_vera
Consolidate compiler generated dependencies of target BlockLib
[ 91%] Built target BlockLib
[ 91%] Built target BlockLinAlgLib_vera
Consolidate compiler generated dependencies of target BlockLinAlgLib
[ 91%] Built target BlockLinAlgLib
[ 94%] Built target pdeSensorLib_vera
Consolidate compiler generated dependencies of target pdeSensorLib
[ 94%] Built target pdeSensorLib
[ 94%] Building CXX object test/system/LocalSolve/CMakeFiles/AlgebraicEquationSet_Local_VMSDBR2_Triangle_AD_btest_OBJECT.dir/AlgebraicEquationSet_Local_VMSDBR2_Triangle_AD_btest.cpp.o
[ 94%] Built target AlgebraicEquationSet_Local_VMSDBR2_Triangle_AD_btest_OBJECT
[ 94%] Linking CXX executable AlgebraicEquationSet_Local_VMSDBR2_Triangle_AD_btest
[ 94%] Built target AlgebraicEquationSet_Local_VMSDBR2_Triangle_AD_btest_build
[ 94%] Checking style of test/system/LocalSolve/AlgebraicEquationSet_Local_VMSD_Triangle_AD_btest.cpp
[ 94%] Built target AlgebraicEquationSet_Local_VMSD_Triangle_AD_btest_build_vera
[ 94%] Building CXX object test/system/LocalSolve/CMakeFiles/AlgebraicEquationSet_Local_VMSD_Triangle_AD_btest_OBJECT.dir/AlgebraicEquationSet_Local_VMSD_Triangle_AD_btest.cpp.o
Build was aborted
[GNU C Compiler (gcc)ClangIntel Compiler (C, Fortran)Vera++] Skipping execution of recorder since overall result is 'ABORTED'
g++-9: fatal error: Terminated signal terminated program cc1plus
compilation terminated.
make[3]: *** [test/system/LocalSolve/CMakeFiles/AlgebraicEquationSet_Local_VMSD_Triangle_AD_btest_OBJECT.dir/build.make:77: test/system/LocalSolve/CMakeFiles/AlgebraicEquationSet_Local_VMSD_Triangle_AD_btest_OBJECT.dir/AlgebraicEquationSet_Local_VMSD_Triangle_AD_btest.cpp.o] Error 1
make[2]: *** [CMakeFiles/Makefile2:142364: test/system/LocalSolve/CMakeFiles/AlgebraicEquationSet_Local_VMSD_Triangle_AD_btest_OBJECT.dir/all] Error 2
make[1]: *** [CMakeFiles/Makefile2:133799: test/system/CMakeFiles/check_system.dir/rule] Error 2
make: *** [Makefile:53167: check_system] Error 2

real	50m2.760s
user	47m54.474s
sys	1m59.298s
+ status=1
++ find /jenkins/workspace/SANS_Nightly/builddir/undefined_gnu9/buildnode/reynolds/build/undefined_gnu9 -name Test.xml
+ mv /jenkins/workspace/SANS_Nightly/builddir/undefined_gnu9/buildnode/reynolds/build/Test_system_fulltest.xml
mv: missing destination file operand after '/jenkins/workspace/SANS_Nightly/builddir/undefined_gnu9/buildnode/reynolds/build/Test_system_fulltest.xml'
Try 'mv --help' for more information.
[Valgrind] Files to copy:
[Valgrind] Analysing valgrind results
[Valgrind] Ending the valgrind analysis.
INFO: Processing BoostTest-1.x (default)
INFO: [BoostTest-1.x (default)] - No test report file(s) were found with the pattern 'build/boosttest/*.xml' relative to '/jenkins/workspace/SANS_Nightly/builddir/undefined_gnu9/buildnode/reynolds' for the testing framework 'BoostTest-1.x (default)'.
Did you enter a pattern relative to (and within) the workspace directory?
Did you generate the result report(s) for 'BoostTest-1.x (default)'?"
WARNING: All test reports are empty.
INFO: Check 'Failed Tests' threshold.
INFO: Check 'Skipped Tests' threshold.
INFO: Setting the build status to SUCCESS
[PostBuildScript] - [INFO] Executing post build scripts.
[PostBuildScript] - [INFO] Node does not have the role MASTER. Did not execute build step #0.
[PostBuildScript] - [INFO] Node does not have the role MASTER. Did not execute build step #1.
[WS-CLEANUP] Deleting project workspace...
[WS-CLEANUP] Deferred wipeout is used...
[WS-CLEANUP] done
Finished: ABORTED