Console Output

Skipping 450 KB.. Full Log
[ 60%] Built target AlgebraicEquationSet_Block4x4_FP_Auxv_Auxi_IBL3_Quad_btest_build_vera
[ 60%] Linking CXX executable AlgebraicEquationSet_Block4x4_FP_Auxv_Auxi_IBL3_Quad_btest
[ 60%] Built target AlgebraicEquationSet_Block4x4_FP_Auxv_Auxi_IBL3_Quad_btest_build
[ 60%] Building CXX object test/unit/Discretization/Block/CMakeFiles/AlgebraicEquationSet_Block4x4_Heat1D_btest_OBJECT.dir/AlgebraicEquationSet_Block4x4_Heat1D_btest.cpp.o
In file included from /usr/include/boost/config/header_deprecated.hpp:18,
                 from /usr/include/boost/test/output_test_stream.hpp:13,
                 from /jenkins/workspace/SANS_Nightly/builddir/undefined_gnu9/buildnode/reynolds/test/SANS_prefix_btest.h:51,
                 from /jenkins/workspace/SANS_Nightly/builddir/undefined_gnu9/buildnode/reynolds/build/undefined_gnu9/test/cotire/SANS_PREFIX_BTEST_CXX_prefix.cxx:4,
                 from /jenkins/workspace/SANS_Nightly/builddir/undefined_gnu9/buildnode/reynolds/build/undefined_gnu9/test/cotire/SANS_PREFIX_BTEST_CXX_prefix.hxx:4:
/usr/include/boost/test/output_test_stream.hpp:14:1: note: #pragma message: This header is deprecated. Use This header is deprecated. Please use <boost/test/tools/output_test_stream.hpp> instead. instead.
   14 | BOOST_HEADER_DEPRECATED( "This header is deprecated. Please use <boost/test/tools/output_test_stream.hpp> instead." )
      | ^~~~~~~~~~~~~~~~~~~~~~~
[ 60%] Built target AlgebraicEquationSet_Block4x4_Heat1D_btest_OBJECT
[ 60%] Checking style of test/unit/Discretization/Block/AlgebraicEquationSet_Block4x4_Heat1D_btest.cpp
[ 60%] Built target AlgebraicEquationSet_Block4x4_Heat1D_btest_build_vera
[ 60%] Linking CXX executable AlgebraicEquationSet_Block4x4_Heat1D_btest
[ 60%] Built target AlgebraicEquationSet_Block4x4_Heat1D_btest_build
[ 60%] Checking style of src/pde/HSM/BCHSM2D.cpp
[ 60%] Checking style of src/pde/HSM/BCHSM2D.h
[ 60%] Checking style of src/pde/HSM/ComplianceMatrix.h
[ 60%] Checking style of src/pde/HSM/HSMVariable2D.h
[ 60%] Checking style of src/pde/HSM/HSMVariable3D.h
[ 60%] Checking style of src/pde/HSM/OutputHSM2D.h
[ 60%] Checking style of src/pde/HSM/PDEHSM2D.h
[ 60%] Checking style of src/pde/HSM/PDEHSMKL.h
[ 60%] Checking style of src/pde/HSM/SolutionFunctionHSM2D.h
[ 60%] Checking style of src/pde/HSM/Var2DLambda.h
[ 60%] Checking style of src/pde/HSM/Var3DLambda.h
[ 60%] Checking style of src/pde/HSM/WeightingFunctionHSM2D.h
[ 60%] Checking style of src/pde/HSM/ComplianceMatrix.cpp
[ 60%] Checking style of src/pde/HSM/PDEHSM2D.cpp
[ 60%] Checking style of src/pde/HSM/PDEHSMKL.cpp
[ 60%] Checking style of src/pde/HSM/SolutionFunctionHSM2D.cpp
[ 60%] Checking style of src/pde/HSM/Var2DLambda.cpp
[ 60%] Checking style of src/pde/HSM/Var3DLambda.cpp
[ 60%] Checking style of src/pde/HSM/WeightingFunctionHSM2D.cpp
[ 60%] Built target HSMLib_vera
[ 60%] Generating CXX unity source src/pde/HSM/cotire/HSMLib_CXX_unity.cxx
[ 60%] Generating CXX prefix source src/pde/HSM/cotire/HSMLib_CXX_prefix.cxx
[ 60%] Generating CXX prefix header src/pde/HSM/cotire/HSMLib_CXX_prefix.hxx
[ 60%] Building CXX precompiled header src/pde/HSM/cotire/HSMLib_CXX_prefix.hxx.gch
Scanning dependencies of target HSMLib
[ 60%] Building CXX object src/pde/HSM/CMakeFiles/HSMLib.dir/ComplianceMatrix.cpp.o
[ 60%] Building CXX object src/pde/HSM/CMakeFiles/HSMLib.dir/PDEHSM2D.cpp.o
[ 60%] Building CXX object src/pde/HSM/CMakeFiles/HSMLib.dir/BCHSM2D.cpp.o
[ 60%] Building CXX object src/pde/HSM/CMakeFiles/HSMLib.dir/Var2DLambda.cpp.o
[ 60%] Building CXX object src/pde/HSM/CMakeFiles/HSMLib.dir/PDEHSMKL.cpp.o
[ 60%] Building CXX object src/pde/HSM/CMakeFiles/HSMLib.dir/Var3DLambda.cpp.o
[ 60%] Linking CXX static library libHSMLib.a
[ 60%] Built target HSMLib
[ 60%] Building CXX object test/unit/Discretization/CG/CMakeFiles/ResidualParamSensitivity_CG_Triangle_AD_btest_OBJECT.dir/ResidualParamSensitivity_CG_Triangle_AD_btest.cpp.o
[ 60%] Built target ResidualParamSensitivity_CG_Triangle_AD_btest_OBJECT
[ 60%] Checking style of test/unit/Discretization/CG/ResidualParamSensitivity_CG_Triangle_AD_btest.cpp
[ 60%] Built target ResidualParamSensitivity_CG_Triangle_AD_btest_build_vera
[ 60%] Linking CXX executable ResidualParamSensitivity_CG_Triangle_AD_btest
[ 60%] Built target ResidualParamSensitivity_CG_Triangle_AD_btest_build
[ 60%] Generating CXX unity source src/Discretization/cotire/DGBR2ADLib_CXX_unity.cxx
[ 60%] Generating CXX prefix source src/Discretization/cotire/DGBR2ADLib_CXX_prefix.cxx
[ 60%] Generating CXX prefix header src/Discretization/cotire/DGBR2ADLib_CXX_prefix.hxx
[ 60%] Building CXX precompiled header src/Discretization/cotire/DGBR2ADLib_CXX_prefix.hxx.gch
Scanning dependencies of target DGBR2ADLib
[ 60%] Building CXX object src/Discretization/CMakeFiles/DGBR2ADLib.dir/DG/DGBR2_Instantiate/AlgebraicEquationSet_DGBR2_AdvectionDiffusion1D_ALBDUSUG.cpp.o
[ 60%] Building CXX object src/Discretization/CMakeFiles/DGBR2ADLib.dir/DG/DGBR2_Instantiate/AlgebraicEquationSet_DGBR2_AdvectionDiffusion1D_AUDUSUG.cpp.o
[ 60%] Building CXX object src/Discretization/CMakeFiles/DGBR2ADLib.dir/DG/DGBR2_Instantiate/AlgebraicEquationSet_DGBR2_AdvectionDiffusion1D_AUDUSN.cpp.o
[ 60%] Building CXX object src/Discretization/CMakeFiles/DGBR2ADLib.dir/DG/DGBR2_Instantiate/AlgebraicEquationSet_DGBR2_AdvectionDiffusion2D_AUDUSN.cpp.o
[ 60%] Building CXX object src/Discretization/CMakeFiles/DGBR2ADLib.dir/DG/DGBR2_Instantiate/AlgebraicEquationSet_DGBR2_AdvectionDiffusion2D_AUDUSUG.cpp.o
[ 60%] Building CXX object src/Discretization/CMakeFiles/DGBR2ADLib.dir/DG/DGBR2_Instantiate/AlgebraicEquationSet_DGBR2_AdvectionDiffusion3D_AUDUSUG.cpp.o
[ 60%] Building CXX object src/Discretization/CMakeFiles/DGBR2ADLib.dir/DG/DGBR2_Instantiate/AlgebraicEquationSet_DGBR2_AdvectionDiffusion3D_manifold_AUDUSN.cpp.o
[ 60%] Building CXX object src/Discretization/CMakeFiles/DGBR2ADLib.dir/DG/DGBR2_Instantiate/AlgebraicEquationSet_DGBR2_AD_AV2D_AUDUSUG.cpp.o
In file included from /jenkins/workspace/SANS_Nightly/builddir/undefined_gnu9/buildnode/reynolds/src/Discretization/DG/DGBR2_Instantiate/AlgebraicEquationSet_DGBR2_AD_AV2D_AUDUSUG.cpp:16:
/jenkins/workspace/SANS_Nightly/builddir/undefined_gnu9/buildnode/reynolds/src/pde/AdvectionDiffusion/PDEAdvectionDiffusion_ArtificialViscosity2D.h:34:46: note: #pragma message: #undef USE_GRID_LAPLACIAN
   34 | #pragma message( "#undef USE_GRID_LAPLACIAN" )
      |                                              ^
[ 60%] Building CXX object src/Discretization/CMakeFiles/DGBR2ADLib.dir/DG/DGBR2_Instantiate/AlgebraicEquationSet_DGBR2_Sensor1D_AUSJump_AD.cpp.o
In file included from /jenkins/workspace/SANS_Nightly/builddir/undefined_gnu9/buildnode/reynolds/src/pde/Sensor/PDESensorParameter1D.h:18,
                 from /jenkins/workspace/SANS_Nightly/builddir/undefined_gnu9/buildnode/reynolds/src/Discretization/DG/DGBR2_Instantiate/AlgebraicEquationSet_DGBR2_Sensor1D_AUSJump_AD.cpp:20:
/jenkins/workspace/SANS_Nightly/builddir/undefined_gnu9/buildnode/reynolds/src/pde/Sensor/Sensor_ViscousFlux1D.h:25:46: note: #pragma message: #undef USE_GRID_LAPLACIAN
   25 | #pragma message( "#undef USE_GRID_LAPLACIAN" )
      |                                              ^
[ 60%] Building CXX object src/Discretization/CMakeFiles/DGBR2ADLib.dir/DG/DGBR2_Instantiate/AlgebraicEquationSet_DGBR2_Sensor2D_AUSJump_AD.cpp.o
In file included from /jenkins/workspace/SANS_Nightly/builddir/undefined_gnu9/buildnode/reynolds/src/pde/Sensor/PDESensorParameter2D.h:18,
                 from /jenkins/workspace/SANS_Nightly/builddir/undefined_gnu9/buildnode/reynolds/src/Discretization/DG/DGBR2_Instantiate/AlgebraicEquationSet_DGBR2_Sensor2D_AUSJump_AD.cpp:20:
/jenkins/workspace/SANS_Nightly/builddir/undefined_gnu9/buildnode/reynolds/src/pde/Sensor/Sensor_ViscousFlux2D.h:26:46: note: #pragma message: #undef USE_GRID_LAPLACIAN
   26 | #pragma message( "#undef USE_GRID_LAPLACIAN" )
      |                                              ^
[ 60%] Linking CXX static library libDGBR2ADLib.a
[ 60%] Built target DGBR2ADLib
[ 60%] Generating CXX unity source src/Discretization/cotire/DGBR2RANSSALib_CXX_unity.cxx
[ 60%] Generating CXX prefix source src/Discretization/cotire/DGBR2RANSSALib_CXX_prefix.cxx
[ 60%] Generating CXX prefix header src/Discretization/cotire/DGBR2RANSSALib_CXX_prefix.hxx
[ 60%] Building CXX precompiled header src/Discretization/cotire/DGBR2RANSSALib_CXX_prefix.hxx.gch
Scanning dependencies of target DGBR2RANSSALib
[ 60%] Building CXX object src/Discretization/CMakeFiles/DGBR2RANSSALib.dir/DG/DGBR2_Instantiate/AlgebraicEquationSet_DGBR2_RANSSA2D_PrimitiveConstVisc.cpp.o
[ 60%] Building CXX object src/Discretization/CMakeFiles/DGBR2RANSSALib.dir/DG/DGBR2_Instantiate/AlgebraicEquationSet_DGBR2_RANSSA_Source2D_PrimitiveConstVisc.cpp.o
[ 60%] Building CXX object src/Discretization/CMakeFiles/DGBR2RANSSALib.dir/DG/DGBR2_Instantiate/AlgebraicEquationSet_DGBR2_RANSSA_Source3D_PrimitiveConstVisc.cpp.o
[ 60%] Building CXX object src/Discretization/CMakeFiles/DGBR2RANSSALib.dir/DG/DGBR2_Instantiate/AlgebraicEquationSet_DGBR2_RANSSA2D_PrimitiveSutherland.cpp.o
[ 60%] Building CXX object src/Discretization/CMakeFiles/DGBR2RANSSALib.dir/DG/DGBR2_Instantiate/AlgebraicEquationSet_DGBR2_RANSSA3D_PrimitiveConstVisc.cpp.o
[ 60%] Building CXX object src/Discretization/CMakeFiles/DGBR2RANSSALib.dir/DG/DGBR2_Instantiate/AlgebraicEquationSet_DGBR2_RANSSA3D_PrimitiveSutherland.cpp.o
[ 60%] Building CXX object src/Discretization/CMakeFiles/DGBR2RANSSALib.dir/DG/DGBR2_Instantiate/AlgebraicEquationSet_DGBR2_RANSSA3D_SurrogateSutherland.cpp.o
[ 60%] Building CXX object src/Discretization/CMakeFiles/DGBR2RANSSALib.dir/DG/DGBR2_Instantiate/AlgebraicEquationSet_DGBR2_ArtificialViscosity_RANSSA2D_PrimitiveConstVisc.cpp.o
In file included from /jenkins/workspace/SANS_Nightly/builddir/undefined_gnu9/buildnode/reynolds/src/Discretization/DG/DGBR2_Instantiate/AlgebraicEquationSet_DGBR2_ArtificialViscosity_RANSSA2D_PrimitiveConstVisc.cpp:16:
/jenkins/workspace/SANS_Nightly/builddir/undefined_gnu9/buildnode/reynolds/src/pde/NS/PDEEulermitAVDiffusion2D.h:43:46: note: #pragma message: #undef USE_GRID_LAPLACIAN
   43 | #pragma message( "#undef USE_GRID_LAPLACIAN" )
      |                                              ^
In file included from /jenkins/workspace/SANS_Nightly/builddir/undefined_gnu9/buildnode/reynolds/src/pde/NS/BCEulermitAVSensor2D.h:15,
                 from /jenkins/workspace/SANS_Nightly/builddir/undefined_gnu9/buildnode/reynolds/src/Discretization/DG/DGBR2_Instantiate/AlgebraicEquationSet_DGBR2_ArtificialViscosity_RANSSA2D_PrimitiveConstVisc.cpp:17:
/jenkins/workspace/SANS_Nightly/builddir/undefined_gnu9/buildnode/reynolds/src/pde/NS/PDEmitAVDiffusionOuter2D.h:43:46: note: #pragma message: #undef USE_GRID_LAPLACIAN
   43 | #pragma message( "#undef USE_GRID_LAPLACIAN" )
      |                                              ^
In file included from /jenkins/workspace/SANS_Nightly/builddir/undefined_gnu9/buildnode/reynolds/src/pde/NS/BCEulermitAVSensor2D.h:18,
                 from /jenkins/workspace/SANS_Nightly/builddir/undefined_gnu9/buildnode/reynolds/src/Discretization/DG/DGBR2_Instantiate/AlgebraicEquationSet_DGBR2_ArtificialViscosity_RANSSA2D_PrimitiveConstVisc.cpp:17:
/jenkins/workspace/SANS_Nightly/builddir/undefined_gnu9/buildnode/reynolds/src/pde/ArtificialViscosity/BCmitAVSensor2D.h:32:46: note: #pragma message: #undef USE_GRID_LAPLACIAN
   32 | #pragma message( "#undef USE_GRID_LAPLACIAN" )
      |                                              ^
In file included from /jenkins/workspace/SANS_Nightly/builddir/undefined_gnu9/buildnode/reynolds/src/Discretization/DG/DGBR2_Instantiate/AlgebraicEquationSet_DGBR2_ArtificialViscosity_RANSSA2D_PrimitiveConstVisc.cpp:21:
/jenkins/workspace/SANS_Nightly/builddir/undefined_gnu9/buildnode/reynolds/src/pde/ArtificialViscosity/AVSensor_ViscousFlux2D.h:30:46: note: #pragma message: #undef USE_GRID_LAPLACIAN
   30 | #pragma message( "#undef USE_GRID_LAPLACIAN" )
      |                                              ^
In file included from /jenkins/workspace/SANS_Nightly/builddir/undefined_gnu9/buildnode/reynolds/src/pde/ArtificialViscosity/AVSensor_Source2D.h:26,
                 from /jenkins/workspace/SANS_Nightly/builddir/undefined_gnu9/buildnode/reynolds/src/Discretization/DG/DGBR2_Instantiate/AlgebraicEquationSet_DGBR2_ArtificialViscosity_RANSSA2D_PrimitiveConstVisc.cpp:22:
/jenkins/workspace/SANS_Nightly/builddir/undefined_gnu9/buildnode/reynolds/src/pde/ArtificialViscosity/PDEmitAVSensor2D.h:38:46: note: #pragma message: #undef USE_GRID_LAPLACIAN
   38 | #pragma message( "#undef USE_GRID_LAPLACIAN" )
      |                                              ^
In file included from /jenkins/workspace/SANS_Nightly/builddir/undefined_gnu9/buildnode/reynolds/src/Discretization/DG/DGBR2_Instantiate/AlgebraicEquationSet_DGBR2_ArtificialViscosity_RANSSA2D_PrimitiveConstVisc.cpp:22:
/jenkins/workspace/SANS_Nightly/builddir/undefined_gnu9/buildnode/reynolds/src/pde/ArtificialViscosity/AVSensor_Source2D.h:38:46: note: #pragma message: #undef USE_GRID_LAPLACIAN
   38 | #pragma message( "#undef USE_GRID_LAPLACIAN" )
      |                                              ^
[ 60%] Building CXX object src/Discretization/CMakeFiles/DGBR2RANSSALib.dir/DG/DGBR2_Instantiate/AlgebraicEquationSet_DGBR2_ArtificialViscosity_RANSSA2D_PrimitiveSutherland.cpp.o
In file included from /jenkins/workspace/SANS_Nightly/builddir/undefined_gnu9/buildnode/reynolds/src/Discretization/DG/DGBR2_Instantiate/AlgebraicEquationSet_DGBR2_ArtificialViscosity_RANSSA2D_PrimitiveSutherland.cpp:16:
/jenkins/workspace/SANS_Nightly/builddir/undefined_gnu9/buildnode/reynolds/src/pde/NS/PDEEulermitAVDiffusion2D.h:43:46: note: #pragma message: #undef USE_GRID_LAPLACIAN
   43 | #pragma message( "#undef USE_GRID_LAPLACIAN" )
      |                                              ^
In file included from /jenkins/workspace/SANS_Nightly/builddir/undefined_gnu9/buildnode/reynolds/src/pde/NS/BCEulermitAVSensor2D.h:15,
                 from /jenkins/workspace/SANS_Nightly/builddir/undefined_gnu9/buildnode/reynolds/src/Discretization/DG/DGBR2_Instantiate/AlgebraicEquationSet_DGBR2_ArtificialViscosity_RANSSA2D_PrimitiveSutherland.cpp:17:
/jenkins/workspace/SANS_Nightly/builddir/undefined_gnu9/buildnode/reynolds/src/pde/NS/PDEmitAVDiffusionOuter2D.h:43:46: note: #pragma message: #undef USE_GRID_LAPLACIAN
   43 | #pragma message( "#undef USE_GRID_LAPLACIAN" )
      |                                              ^
In file included from /jenkins/workspace/SANS_Nightly/builddir/undefined_gnu9/buildnode/reynolds/src/pde/NS/BCEulermitAVSensor2D.h:18,
                 from /jenkins/workspace/SANS_Nightly/builddir/undefined_gnu9/buildnode/reynolds/src/Discretization/DG/DGBR2_Instantiate/AlgebraicEquationSet_DGBR2_ArtificialViscosity_RANSSA2D_PrimitiveSutherland.cpp:17:
/jenkins/workspace/SANS_Nightly/builddir/undefined_gnu9/buildnode/reynolds/src/pde/ArtificialViscosity/BCmitAVSensor2D.h:32:46: note: #pragma message: #undef USE_GRID_LAPLACIAN
   32 | #pragma message( "#undef USE_GRID_LAPLACIAN" )
      |                                              ^
In file included from /jenkins/workspace/SANS_Nightly/builddir/undefined_gnu9/buildnode/reynolds/src/Discretization/DG/DGBR2_Instantiate/AlgebraicEquationSet_DGBR2_ArtificialViscosity_RANSSA2D_PrimitiveSutherland.cpp:21:
/jenkins/workspace/SANS_Nightly/builddir/undefined_gnu9/buildnode/reynolds/src/pde/ArtificialViscosity/AVSensor_ViscousFlux2D.h:30:46: note: #pragma message: #undef USE_GRID_LAPLACIAN
   30 | #pragma message( "#undef USE_GRID_LAPLACIAN" )
      |                                              ^
In file included from /jenkins/workspace/SANS_Nightly/builddir/undefined_gnu9/buildnode/reynolds/src/pde/ArtificialViscosity/AVSensor_Source2D.h:26,
                 from /jenkins/workspace/SANS_Nightly/builddir/undefined_gnu9/buildnode/reynolds/src/Discretization/DG/DGBR2_Instantiate/AlgebraicEquationSet_DGBR2_ArtificialViscosity_RANSSA2D_PrimitiveSutherland.cpp:22:
/jenkins/workspace/SANS_Nightly/builddir/undefined_gnu9/buildnode/reynolds/src/pde/ArtificialViscosity/PDEmitAVSensor2D.h:38:46: note: #pragma message: #undef USE_GRID_LAPLACIAN
   38 | #pragma message( "#undef USE_GRID_LAPLACIAN" )
      |                                              ^
In file included from /jenkins/workspace/SANS_Nightly/builddir/undefined_gnu9/buildnode/reynolds/src/Discretization/DG/DGBR2_Instantiate/AlgebraicEquationSet_DGBR2_ArtificialViscosity_RANSSA2D_PrimitiveSutherland.cpp:22:
/jenkins/workspace/SANS_Nightly/builddir/undefined_gnu9/buildnode/reynolds/src/pde/ArtificialViscosity/AVSensor_Source2D.h:38:46: note: #pragma message: #undef USE_GRID_LAPLACIAN
   38 | #pragma message( "#undef USE_GRID_LAPLACIAN" )
      |                                              ^
[ 60%] Building CXX object src/Discretization/CMakeFiles/DGBR2RANSSALib.dir/DG/DGBR2_Instantiate/AlgebraicEquationSet_DGBR2_ArtificialViscosity_RANSSA3D_PrimitiveSutherland.cpp.o
In file included from /jenkins/workspace/SANS_Nightly/builddir/undefined_gnu9/buildnode/reynolds/src/Discretization/DG/DGBR2_Instantiate/AlgebraicEquationSet_DGBR2_ArtificialViscosity_RANSSA3D_PrimitiveSutherland.cpp:16:
/jenkins/workspace/SANS_Nightly/builddir/undefined_gnu9/buildnode/reynolds/src/pde/NS/PDEEulermitAVDiffusion3D.h:43:46: note: #pragma message: #undef USE_GRID_LAPLACIAN
   43 | #pragma message( "#undef USE_GRID_LAPLACIAN" )
      |                                              ^
In file included from /jenkins/workspace/SANS_Nightly/builddir/undefined_gnu9/buildnode/reynolds/src/pde/NS/BCEulermitAVSensor3D.h:17,
                 from /jenkins/workspace/SANS_Nightly/builddir/undefined_gnu9/buildnode/reynolds/src/Discretization/DG/DGBR2_Instantiate/AlgebraicEquationSet_DGBR2_ArtificialViscosity_RANSSA3D_PrimitiveSutherland.cpp:17:
/jenkins/workspace/SANS_Nightly/builddir/undefined_gnu9/buildnode/reynolds/src/pde/ArtificialViscosity/BCmitAVSensor3D.h:30:46: note: #pragma message: #undef USE_GRID_LAPLACIAN
   30 | #pragma message( "#undef USE_GRID_LAPLACIAN" )
      |                                              ^
In file included from /jenkins/workspace/SANS_Nightly/builddir/undefined_gnu9/buildnode/reynolds/src/Discretization/DG/DGBR2_Instantiate/AlgebraicEquationSet_DGBR2_ArtificialViscosity_RANSSA3D_PrimitiveSutherland.cpp:21:
/jenkins/workspace/SANS_Nightly/builddir/undefined_gnu9/buildnode/reynolds/src/pde/ArtificialViscosity/AVSensor_ViscousFlux3D.h:30:46: note: #pragma message: #undef USE_GRID_LAPLACIAN
   30 | #pragma message( "#undef USE_GRID_LAPLACIAN" )
      |                                              ^
In file included from /jenkins/workspace/SANS_Nightly/builddir/undefined_gnu9/buildnode/reynolds/src/Discretization/DG/DGBR2_Instantiate/AlgebraicEquationSet_DGBR2_ArtificialViscosity_RANSSA3D_PrimitiveSutherland.cpp:22:
/jenkins/workspace/SANS_Nightly/builddir/undefined_gnu9/buildnode/reynolds/src/pde/ArtificialViscosity/AVSensor_Source3D.h:37:46: note: #pragma message: #undef USE_GRID_LAPLACIAN
   37 | #pragma message( "#undef USE_GRID_LAPLACIAN" )
      |                                              ^
In file included from /jenkins/workspace/SANS_Nightly/builddir/undefined_gnu9/buildnode/reynolds/src/Discretization/DG/DGBR2_Instantiate/AlgebraicEquationSet_DGBR2_ArtificialViscosity_RANSSA3D_PrimitiveSutherland.cpp:23:
/jenkins/workspace/SANS_Nightly/builddir/undefined_gnu9/buildnode/reynolds/src/pde/ArtificialViscosity/PDEmitAVSensor3D.h:38:46: note: #pragma message: #undef USE_GRID_LAPLACIAN
   38 | #pragma message( "#undef USE_GRID_LAPLACIAN" )
      |                                              ^
[ 60%] Linking CXX static library libDGBR2RANSSALib.a
[ 60%] Built target DGBR2RANSSALib
[ 60%] Checking style of src/pde/CauchyRiemann/BCCauchyRiemann2D.cpp
[ 60%] Checking style of src/pde/CauchyRiemann/BCCauchyRiemann2D.h
[ 60%] Checking style of src/pde/CauchyRiemann/PDECauchyRiemann2D.h
[ 60%] Built target CauchyRiemannLib_vera
[ 60%] Building CXX object src/pde/CauchyRiemann/CMakeFiles/CauchyRiemannLib.dir/BCCauchyRiemann2D.cpp.o
[ 60%] Linking CXX static library libCauchyRiemannLib.a
[ 60%] Built target CauchyRiemannLib
[ 60%] Checking style of src/pde/ShallowWater/BCShallowWater1D.cpp
[ 60%] Checking style of src/pde/ShallowWater/BCShallowWater1D.h
[ 60%] Checking style of src/pde/ShallowWater/BCShallowWater2D.cpp
[ 60%] Checking style of src/pde/ShallowWater/BCShallowWater2D.h
[ 60%] Checking style of src/pde/ShallowWater/BCShallowWater2D_manifold.cpp
[ 60%] Checking style of src/pde/ShallowWater/BCShallowWater2D_manifold.h
[ 60%] Checking style of src/pde/ShallowWater/OutputShallowWater1D.h
[ 60%] Checking style of src/pde/ShallowWater/OutputShallowWater2D.h
[ 60%] Checking style of src/pde/ShallowWater/OutputShallowWater2D_manifold.h
[ 60%] Checking style of src/pde/ShallowWater/PDEShallowWater1D.h
[ 60%] Checking style of src/pde/ShallowWater/PDEShallowWater2D.h
[ 60%] Checking style of src/pde/ShallowWater/PDEShallowWater2D_manifold.h
[ 60%] Checking style of src/pde/ShallowWater/ShallowWaterSolution1D.h
[ 60%] Checking style of src/pde/ShallowWater/ShallowWaterSolution2D.h
[ 60%] Checking style of src/pde/ShallowWater/ShallowWaterSolution2D_manifold.h
[ 60%] Checking style of src/pde/ShallowWater/ShallowWaterVariable1D.h
[ 60%] Checking style of src/pde/ShallowWater/ShallowWaterVariable2D.h
[ 60%] Checking style of src/pde/ShallowWater/ShallowWaterVariable2D_manifold.h
[ 60%] Checking style of src/pde/ShallowWater/ShallowWater_Traits.h
[ 60%] Checking style of src/pde/ShallowWater/ShallowWater_Traits_manifold.h
[ 60%] Checking style of src/pde/ShallowWater/VarInterp1D.h
[ 60%] Checking style of src/pde/ShallowWater/VarInterp2D.h
[ 60%] Checking style of src/pde/ShallowWater/VarInterp2D_manifold.h
[ 60%] Checking style of src/pde/ShallowWater/PDEShallowWater1D.cpp
[ 60%] Checking style of src/pde/ShallowWater/PDEShallowWater2D.cpp
[ 60%] Checking style of src/pde/ShallowWater/PDEShallowWater2D_manifold.cpp
[ 60%] Checking style of src/pde/ShallowWater/ShallowWaterSolution1D.cpp
[ 60%] Checking style of src/pde/ShallowWater/ShallowWaterSolution2D.cpp
[ 60%] Checking style of src/pde/ShallowWater/ShallowWaterSolution2D_manifold.cpp
[ 60%] Built target ShallowWaterLib_vera
[ 60%] Generating CXX unity source src/pde/ShallowWater/cotire/ShallowWaterLib_CXX_unity.cxx
[ 60%] Generating CXX prefix source src/pde/ShallowWater/cotire/ShallowWaterLib_CXX_prefix.cxx
[ 60%] Generating CXX prefix header src/pde/ShallowWater/cotire/ShallowWaterLib_CXX_prefix.hxx
[ 60%] Building CXX precompiled header src/pde/ShallowWater/cotire/ShallowWaterLib_CXX_prefix.hxx.gch
Scanning dependencies of target ShallowWaterLib
[ 60%] Building CXX object src/pde/ShallowWater/CMakeFiles/ShallowWaterLib.dir/PDEShallowWater1D.cpp.o
[ 60%] Building CXX object src/pde/ShallowWater/CMakeFiles/ShallowWaterLib.dir/ShallowWaterSolution1D.cpp.o
[ 60%] Building CXX object src/pde/ShallowWater/CMakeFiles/ShallowWaterLib.dir/BCShallowWater1D.cpp.o
[ 60%] Building CXX object src/pde/ShallowWater/CMakeFiles/ShallowWaterLib.dir/PDEShallowWater2D.cpp.o
[ 60%] Building CXX object src/pde/ShallowWater/CMakeFiles/ShallowWaterLib.dir/ShallowWaterSolution2D.cpp.o
[ 60%] Building CXX object src/pde/ShallowWater/CMakeFiles/ShallowWaterLib.dir/BCShallowWater2D.cpp.o
[ 60%] Building CXX object src/pde/ShallowWater/CMakeFiles/ShallowWaterLib.dir/PDEShallowWater2D_manifold.cpp.o
[ 60%] Building CXX object src/pde/ShallowWater/CMakeFiles/ShallowWaterLib.dir/ShallowWaterSolution2D_manifold.cpp.o
[ 60%] Building CXX object src/pde/ShallowWater/CMakeFiles/ShallowWaterLib.dir/BCShallowWater2D_manifold.cpp.o
[ 60%] Linking CXX static library libShallowWaterLib.a
[ 60%] Built target ShallowWaterLib
[ 60%] Building CXX object test/unit/Discretization/DG/CMakeFiles/Adjoint_LiftingOperator_DGBR2_Triangle_AD_btest_OBJECT.dir/Adjoint_LiftingOperator_DGBR2_Triangle_AD_btest.cpp.o
[ 60%] Built target Adjoint_LiftingOperator_DGBR2_Triangle_AD_btest_OBJECT
[ 60%] Checking style of test/unit/Discretization/DG/Adjoint_LiftingOperator_DGBR2_Triangle_AD_btest.cpp
[ 60%] Built target Adjoint_LiftingOperator_DGBR2_Triangle_AD_btest_build_vera
[ 60%] Linking CXX executable Adjoint_LiftingOperator_DGBR2_Triangle_AD_btest
[ 60%] Built target Adjoint_LiftingOperator_DGBR2_Triangle_AD_btest_build
[ 60%] Building CXX object test/unit/Discretization/DG/CMakeFiles/Adjoint_LiftingOperator_DGBR2_Triangle_NS_btest_OBJECT.dir/Adjoint_LiftingOperator_DGBR2_Triangle_NS_btest.cpp.o
[ 60%] Built target Adjoint_LiftingOperator_DGBR2_Triangle_NS_btest_OBJECT
[ 60%] Checking style of test/unit/Discretization/DG/Adjoint_LiftingOperator_DGBR2_Triangle_NS_btest.cpp
[ 60%] Built target Adjoint_LiftingOperator_DGBR2_Triangle_NS_btest_build_vera
[ 60%] Linking CXX executable Adjoint_LiftingOperator_DGBR2_Triangle_NS_btest
[ 60%] Built target Adjoint_LiftingOperator_DGBR2_Triangle_NS_btest_build
[ 60%] Building CXX object test/unit/Discretization/DG/CMakeFiles/AlgebraicEquationSet_DGAdvective_BuckleyLeverett_ST_btest_OBJECT.dir/AlgebraicEquationSet_DGAdvective_BuckleyLeverett_ST_btest.cpp.o
In file included from /usr/include/boost/config/header_deprecated.hpp:18,
                 from /usr/include/boost/test/output_test_stream.hpp:13,
                 from /jenkins/workspace/SANS_Nightly/builddir/undefined_gnu9/buildnode/reynolds/test/SANS_prefix_btest.h:51,
                 from /jenkins/workspace/SANS_Nightly/builddir/undefined_gnu9/buildnode/reynolds/build/undefined_gnu9/test/cotire/SANS_PREFIX_BTEST_CXX_prefix.cxx:4,
                 from /jenkins/workspace/SANS_Nightly/builddir/undefined_gnu9/buildnode/reynolds/build/undefined_gnu9/test/cotire/SANS_PREFIX_BTEST_CXX_prefix.hxx:4:
/usr/include/boost/test/output_test_stream.hpp:14:1: note: #pragma message: This header is deprecated. Use This header is deprecated. Please use <boost/test/tools/output_test_stream.hpp> instead. instead.
   14 | BOOST_HEADER_DEPRECATED( "This header is deprecated. Please use <boost/test/tools/output_test_stream.hpp> instead." )
      | ^~~~~~~~~~~~~~~~~~~~~~~
[ 60%] Built target AlgebraicEquationSet_DGAdvective_BuckleyLeverett_ST_btest_OBJECT
[ 60%] Checking style of test/unit/Discretization/DG/AlgebraicEquationSet_DGAdvective_BuckleyLeverett_ST_btest.cpp
[ 60%] Built target AlgebraicEquationSet_DGAdvective_BuckleyLeverett_ST_btest_build_vera
[ 60%] Linking CXX executable AlgebraicEquationSet_DGAdvective_BuckleyLeverett_ST_btest
[ 60%] Built target AlgebraicEquationSet_DGAdvective_BuckleyLeverett_ST_btest_build
[ 60%] Generating CXX unity source src/Discretization/cotire/HDGLib_CXX_unity.cxx
[ 60%] Generating CXX prefix source src/Discretization/cotire/HDGLib_CXX_prefix.cxx
[ 60%] Generating CXX prefix header src/Discretization/cotire/HDGLib_CXX_prefix.hxx
[ 60%] Building CXX precompiled header src/Discretization/cotire/HDGLib_CXX_prefix.hxx.gch
Scanning dependencies of target HDGLib
[ 60%] Building CXX object src/Discretization/CMakeFiles/HDGLib.dir/HDG/Instantiate/AlgebraicEquationSet_HDG_AdvectionDiffusion1D_ALaxDUSU.cpp.o
[ 60%] Building CXX object src/Discretization/CMakeFiles/HDGLib.dir/HDG/Instantiate/AlgebraicEquationSet_HDG_AdvectionDiffusion1D_AUDUSUG.cpp.o
[ 60%] Building CXX object src/Discretization/CMakeFiles/HDGLib.dir/HDG/Instantiate/AlgebraicEquationSet_HDG_AdvectionDiffusion2D_AUDUSUG.cpp.o
[ 60%] Building CXX object src/Discretization/CMakeFiles/HDGLib.dir/HDG/Instantiate/AlgebraicEquationSet_HDG_AdvectionDiffusion3D_AUDUSUG.cpp.o
[ 60%] Building CXX object src/Discretization/CMakeFiles/HDGLib.dir/HDG/Instantiate/AlgebraicEquationSet_HDG_BuckleyLeverett1D.cpp.o
[ 60%] Building CXX object src/Discretization/CMakeFiles/HDGLib.dir/HDG/Instantiate/AlgebraicEquationSet_HDG_Euler1D_Conservative.cpp.o
In file included from /jenkins/workspace/SANS_Nightly/builddir/undefined_gnu9/buildnode/reynolds/src/pde/NS/PDEEuler1D_Source.h:9,
                 from /jenkins/workspace/SANS_Nightly/builddir/undefined_gnu9/buildnode/reynolds/src/pde/NS/BCEuler1D.h:23,
                 from /jenkins/workspace/SANS_Nightly/builddir/undefined_gnu9/buildnode/reynolds/src/Discretization/HDG/Instantiate/AlgebraicEquationSet_HDG_Euler1D_Conservative.cpp:16:
/jenkins/workspace/SANS_Nightly/builddir/undefined_gnu9/buildnode/reynolds/src/pde/NS/PDEEulermitAVDiffusion1D.h:41:46: note: #pragma message: #undef USE_GRID_LAPLACIAN
   41 | #pragma message( "#undef USE_GRID_LAPLACIAN" )
      |                                              ^
[ 60%] Building CXX object src/Discretization/CMakeFiles/HDGLib.dir/HDG/Instantiate/AlgebraicEquationSet_HDG_Euler1D_Entropy.cpp.o
In file included from /jenkins/workspace/SANS_Nightly/builddir/undefined_gnu9/buildnode/reynolds/src/pde/NS/PDEEuler1D_Source.h:9,
                 from /jenkins/workspace/SANS_Nightly/builddir/undefined_gnu9/buildnode/reynolds/src/pde/NS/BCEuler1D.h:23,
                 from /jenkins/workspace/SANS_Nightly/builddir/undefined_gnu9/buildnode/reynolds/src/Discretization/HDG/Instantiate/AlgebraicEquationSet_HDG_Euler1D_Entropy.cpp:16:
/jenkins/workspace/SANS_Nightly/builddir/undefined_gnu9/buildnode/reynolds/src/pde/NS/PDEEulermitAVDiffusion1D.h:41:46: note: #pragma message: #undef USE_GRID_LAPLACIAN
   41 | #pragma message( "#undef USE_GRID_LAPLACIAN" )
      |                                              ^
[ 60%] Building CXX object src/Discretization/CMakeFiles/HDGLib.dir/HDG/Instantiate/AlgebraicEquationSet_HDG_Euler1D_PrimitiveRhoPressure.cpp.o
In file included from /jenkins/workspace/SANS_Nightly/builddir/undefined_gnu9/buildnode/reynolds/src/pde/NS/PDEEuler1D_Source.h:9,
                 from /jenkins/workspace/SANS_Nightly/builddir/undefined_gnu9/buildnode/reynolds/src/pde/NS/BCEuler1D.h:23,
                 from /jenkins/workspace/SANS_Nightly/builddir/undefined_gnu9/buildnode/reynolds/src/Discretization/HDG/Instantiate/AlgebraicEquationSet_HDG_Euler1D_PrimitiveRhoPressure.cpp:16:
/jenkins/workspace/SANS_Nightly/builddir/undefined_gnu9/buildnode/reynolds/src/pde/NS/PDEEulermitAVDiffusion1D.h:41:46: note: #pragma message: #undef USE_GRID_LAPLACIAN
   41 | #pragma message( "#undef USE_GRID_LAPLACIAN" )
      |                                              ^
[ 60%] Building CXX object src/Discretization/CMakeFiles/HDGLib.dir/HDG/Instantiate/AlgebraicEquationSet_HDG_Euler2D_PrimitiveRhoPressure.cpp.o
[ 60%] Building CXX object src/Discretization/CMakeFiles/HDGLib.dir/HDG/Instantiate/AlgebraicEquationSet_HDG_NavierStokes2D_Conservative_ConstantViscosity.cpp.o
[ 60%] Building CXX object src/Discretization/CMakeFiles/HDGLib.dir/HDG/Instantiate/AlgebraicEquationSet_HDG_NavierStokes2D_Primitive_ConstantViscosity.cpp.o
[ 60%] Building CXX object src/Discretization/CMakeFiles/HDGLib.dir/HDG/Instantiate/AlgebraicEquationSet_HDG_RANSSA2D_Primitive_ConstantViscosity.cpp.o
[ 60%] Building CXX object src/Discretization/CMakeFiles/HDGLib.dir/HDG/Instantiate/AlgebraicEquationSet_HDG_Stokes2D.cpp.o
[ 60%] Building CXX object src/Discretization/CMakeFiles/HDGLib.dir/HDG/Instantiate/AlgebraicEquationSet_HDGAdvective_Advection1D_AUSU.cpp.o
[ 60%] Linking CXX static library libHDGLib.a
[ 60%] Built target HDGLib
[ 60%] Building CXX object test/unit/Discretization/HDG/CMakeFiles/AlgebraicEquationSet_Hubtrace_HDGAdvective_IBL_btest_OBJECT.dir/AlgebraicEquationSet_Hubtrace_HDGAdvective_IBL_btest.cpp.o
[ 60%] Built target AlgebraicEquationSet_Hubtrace_HDGAdvective_IBL_btest_OBJECT
[ 60%] Checking style of test/unit/Discretization/HDG/AlgebraicEquationSet_Hubtrace_HDGAdvective_IBL_btest.cpp
[ 60%] Built target AlgebraicEquationSet_Hubtrace_HDGAdvective_IBL_btest_build_vera
[ 60%] Linking CXX executable AlgebraicEquationSet_Hubtrace_HDGAdvective_IBL_btest
[ 60%] Built target AlgebraicEquationSet_Hubtrace_HDGAdvective_IBL_btest_build
[ 60%] Building CXX object test/unit/Discretization/DG/CMakeFiles/AlgebraicEquationSet_DGAdvective_Line_IBL_airfoilOnly_btest_OBJECT.dir/AlgebraicEquationSet_DGAdvective_Line_IBL_airfoilOnly_btest.cpp.o
[ 60%] Built target AlgebraicEquationSet_DGAdvective_Line_IBL_airfoilOnly_btest_OBJECT
[ 60%] Checking style of test/unit/Discretization/DG/AlgebraicEquationSet_DGAdvective_Line_IBL_airfoilOnly_btest.cpp
[ 60%] Built target AlgebraicEquationSet_DGAdvective_Line_IBL_airfoilOnly_btest_build_vera
[ 60%] Linking CXX executable AlgebraicEquationSet_DGAdvective_Line_IBL_airfoilOnly_btest
[ 60%] Built target AlgebraicEquationSet_DGAdvective_Line_IBL_airfoilOnly_btest_build
[ 60%] Building CXX object test/unit/Discretization/DG/CMakeFiles/AlgebraicEquationSet_DGAdvective_Triangle_AD_btest_OBJECT.dir/AlgebraicEquationSet_DGAdvective_Triangle_AD_btest.cpp.o
In file included from /usr/include/boost/config/header_deprecated.hpp:18,
                 from /usr/include/boost/test/output_test_stream.hpp:13,
                 from /jenkins/workspace/SANS_Nightly/builddir/undefined_gnu9/buildnode/reynolds/test/SANS_prefix_btest.h:51,
                 from /jenkins/workspace/SANS_Nightly/builddir/undefined_gnu9/buildnode/reynolds/build/undefined_gnu9/test/cotire/SANS_PREFIX_BTEST_CXX_prefix.cxx:4,
                 from /jenkins/workspace/SANS_Nightly/builddir/undefined_gnu9/buildnode/reynolds/build/undefined_gnu9/test/cotire/SANS_PREFIX_BTEST_CXX_prefix.hxx:4:
/usr/include/boost/test/output_test_stream.hpp:14:1: note: #pragma message: This header is deprecated. Use This header is deprecated. Please use <boost/test/tools/output_test_stream.hpp> instead. instead.
   14 | BOOST_HEADER_DEPRECATED( "This header is deprecated. Please use <boost/test/tools/output_test_stream.hpp> instead." )
      | ^~~~~~~~~~~~~~~~~~~~~~~
[ 60%] Built target AlgebraicEquationSet_DGAdvective_Triangle_AD_btest_OBJECT
[ 60%] Checking style of test/unit/Discretization/DG/AlgebraicEquationSet_DGAdvective_Triangle_AD_btest.cpp
[ 60%] Built target AlgebraicEquationSet_DGAdvective_Triangle_AD_btest_build_vera
[ 60%] Linking CXX executable AlgebraicEquationSet_DGAdvective_Triangle_AD_btest
[ 60%] Built target AlgebraicEquationSet_DGAdvective_Triangle_AD_btest_build
[ 60%] Building CXX object test/unit/Discretization/DG/CMakeFiles/AlgebraicEquationSet_DGBR2_BuckleyLeverett_ST_btest_OBJECT.dir/AlgebraicEquationSet_DGBR2_BuckleyLeverett_ST_btest.cpp.o
In file included from /usr/include/boost/config/header_deprecated.hpp:18,
                 from /usr/include/boost/test/output_test_stream.hpp:13,
                 from /jenkins/workspace/SANS_Nightly/builddir/undefined_gnu9/buildnode/reynolds/test/SANS_prefix_btest.h:51,
                 from /jenkins/workspace/SANS_Nightly/builddir/undefined_gnu9/buildnode/reynolds/build/undefined_gnu9/test/cotire/SANS_PREFIX_BTEST_CXX_prefix.cxx:4,
                 from /jenkins/workspace/SANS_Nightly/builddir/undefined_gnu9/buildnode/reynolds/build/undefined_gnu9/test/cotire/SANS_PREFIX_BTEST_CXX_prefix.hxx:4:
/usr/include/boost/test/output_test_stream.hpp:14:1: note: #pragma message: This header is deprecated. Use This header is deprecated. Please use <boost/test/tools/output_test_stream.hpp> instead. instead.
   14 | BOOST_HEADER_DEPRECATED( "This header is deprecated. Please use <boost/test/tools/output_test_stream.hpp> instead." )
      | ^~~~~~~~~~~~~~~~~~~~~~~
[ 60%] Built target AlgebraicEquationSet_DGBR2_BuckleyLeverett_ST_btest_OBJECT
[ 60%] Checking style of test/unit/Discretization/DG/AlgebraicEquationSet_DGBR2_BuckleyLeverett_ST_btest.cpp
[ 60%] Built target AlgebraicEquationSet_DGBR2_BuckleyLeverett_ST_btest_build_vera
[ 60%] Linking CXX executable AlgebraicEquationSet_DGBR2_BuckleyLeverett_ST_btest
[ 60%] Built target AlgebraicEquationSet_DGBR2_BuckleyLeverett_ST_btest_build
[ 60%] Building CXX object test/unit/Discretization/DG/CMakeFiles/AlgebraicEquationSet_DGBR2_Quad_SA_btest_OBJECT.dir/AlgebraicEquationSet_DGBR2_Quad_SA_btest.cpp.o
[ 60%] Built target AlgebraicEquationSet_DGBR2_Quad_SA_btest_OBJECT
[ 60%] Checking style of test/unit/Discretization/DG/AlgebraicEquationSet_DGBR2_Quad_SA_btest.cpp
[ 60%] Built target AlgebraicEquationSet_DGBR2_Quad_SA_btest_build_vera
[ 60%] Linking CXX executable AlgebraicEquationSet_DGBR2_Quad_SA_btest
[ 60%] Built target AlgebraicEquationSet_DGBR2_Quad_SA_btest_build
[ 60%] Building CXX object test/unit/Discretization/DG/CMakeFiles/AlgebraicEquationSet_DGBR2_Triangle_AD_btest_OBJECT.dir/AlgebraicEquationSet_DGBR2_Triangle_AD_btest.cpp.o
In file included from /usr/include/boost/config/header_deprecated.hpp:18,
                 from /usr/include/boost/test/output_test_stream.hpp:13,
                 from /jenkins/workspace/SANS_Nightly/builddir/undefined_gnu9/buildnode/reynolds/test/SANS_prefix_btest.h:51,
                 from /jenkins/workspace/SANS_Nightly/builddir/undefined_gnu9/buildnode/reynolds/build/undefined_gnu9/test/cotire/SANS_PREFIX_BTEST_CXX_prefix.cxx:4,
                 from /jenkins/workspace/SANS_Nightly/builddir/undefined_gnu9/buildnode/reynolds/build/undefined_gnu9/test/cotire/SANS_PREFIX_BTEST_CXX_prefix.hxx:4:
/usr/include/boost/test/output_test_stream.hpp:14:1: note: #pragma message: This header is deprecated. Use This header is deprecated. Please use <boost/test/tools/output_test_stream.hpp> instead. instead.
   14 | BOOST_HEADER_DEPRECATED( "This header is deprecated. Please use <boost/test/tools/output_test_stream.hpp> instead." )
      | ^~~~~~~~~~~~~~~~~~~~~~~
[ 60%] Built target AlgebraicEquationSet_DGBR2_Triangle_AD_btest_OBJECT
[ 60%] Checking style of test/unit/Discretization/DG/AlgebraicEquationSet_DGBR2_Triangle_AD_btest.cpp
[ 60%] Built target AlgebraicEquationSet_DGBR2_Triangle_AD_btest_build_vera
[ 60%] Linking CXX executable AlgebraicEquationSet_DGBR2_Triangle_AD_btest
[ 60%] Built target AlgebraicEquationSet_DGBR2_Triangle_AD_btest_build
[ 60%] Building CXX object test/unit/Discretization/DG/CMakeFiles/AlgebraicEquationSet_DGBR2_Triangle_SA_btest_OBJECT.dir/AlgebraicEquationSet_DGBR2_Triangle_SA_btest.cpp.o
In file included from /usr/include/boost/config/header_deprecated.hpp:18,
                 from /usr/include/boost/test/output_test_stream.hpp:13,
                 from /jenkins/workspace/SANS_Nightly/builddir/undefined_gnu9/buildnode/reynolds/test/SANS_prefix_btest.h:51,
                 from /jenkins/workspace/SANS_Nightly/builddir/undefined_gnu9/buildnode/reynolds/build/undefined_gnu9/test/cotire/SANS_PREFIX_BTEST_CXX_prefix.cxx:4,
                 from /jenkins/workspace/SANS_Nightly/builddir/undefined_gnu9/buildnode/reynolds/build/undefined_gnu9/test/cotire/SANS_PREFIX_BTEST_CXX_prefix.hxx:4:
/usr/include/boost/test/output_test_stream.hpp:14:1: note: #pragma message: This header is deprecated. Use This header is deprecated. Please use <boost/test/tools/output_test_stream.hpp> instead. instead.
   14 | BOOST_HEADER_DEPRECATED( "This header is deprecated. Please use <boost/test/tools/output_test_stream.hpp> instead." )
      | ^~~~~~~~~~~~~~~~~~~~~~~
[ 60%] Built target AlgebraicEquationSet_DGBR2_Triangle_SA_btest_OBJECT
[ 60%] Checking style of test/unit/Discretization/DG/AlgebraicEquationSet_DGBR2_Triangle_SA_btest.cpp
[ 60%] Built target AlgebraicEquationSet_DGBR2_Triangle_SA_btest_build_vera
[ 60%] Linking CXX executable AlgebraicEquationSet_DGBR2_Triangle_SA_btest
[ 60%] Built target AlgebraicEquationSet_DGBR2_Triangle_SA_btest_build
[ 60%] Building CXX object test/unit/Discretization/DG/CMakeFiles/AlgebraicEquationSet_Local_DGBR2_Triangle_AD_btest_OBJECT.dir/AlgebraicEquationSet_Local_DGBR2_Triangle_AD_btest.cpp.o
[ 60%] Built target AlgebraicEquationSet_Local_DGBR2_Triangle_AD_btest_OBJECT
[ 60%] Checking style of test/unit/Discretization/DG/AlgebraicEquationSet_Local_DGBR2_Triangle_AD_btest.cpp
[ 60%] Built target AlgebraicEquationSet_Local_DGBR2_Triangle_AD_btest_build_vera
[ 60%] Linking CXX executable AlgebraicEquationSet_Local_DGBR2_Triangle_AD_btest
[ 60%] Built target AlgebraicEquationSet_Local_DGBR2_Triangle_AD_btest_build
[ 60%] Building CXX object test/unit/Discretization/DG/CMakeFiles/DiscretizationDGBR2_btest_OBJECT.dir/DiscretizationDGBR2_btest.cpp.o
In file included from /usr/include/boost/config/header_deprecated.hpp:18,
                 from /usr/include/boost/test/output_test_stream.hpp:13,
                 from /jenkins/workspace/SANS_Nightly/builddir/undefined_gnu9/buildnode/reynolds/test/SANS_prefix_btest.h:51,
                 from /jenkins/workspace/SANS_Nightly/builddir/undefined_gnu9/buildnode/reynolds/build/undefined_gnu9/test/cotire/SANS_PREFIX_BTEST_CXX_prefix.cxx:4,
                 from /jenkins/workspace/SANS_Nightly/builddir/undefined_gnu9/buildnode/reynolds/build/undefined_gnu9/test/cotire/SANS_PREFIX_BTEST_CXX_prefix.hxx:4:
/usr/include/boost/test/output_test_stream.hpp:14:1: note: #pragma message: This header is deprecated. Use This header is deprecated. Please use <boost/test/tools/output_test_stream.hpp> instead. instead.
   14 | BOOST_HEADER_DEPRECATED( "This header is deprecated. Please use <boost/test/tools/output_test_stream.hpp> instead." )
      | ^~~~~~~~~~~~~~~~~~~~~~~
[ 60%] Built target DiscretizationDGBR2_btest_OBJECT
[ 60%] Checking style of test/unit/Discretization/DG/DiscretizationDGBR2_btest.cpp
[ 60%] Built target DiscretizationDGBR2_btest_build_vera
[ 60%] Linking CXX executable DiscretizationDGBR2_btest
[ 60%] Built target DiscretizationDGBR2_btest_build
[ 60%] Building CXX object test/unit/Discretization/DG/CMakeFiles/ElementIntegral_DGBR2_2D_Triangle_AD_btest_OBJECT.dir/ElementIntegral_DGBR2_2D_Triangle_AD_btest.cpp.o
[ 60%] Built target ElementIntegral_DGBR2_2D_Triangle_AD_btest_OBJECT
[ 60%] Checking style of test/unit/Discretization/DG/ElementIntegral_DGBR2_2D_Triangle_AD_btest.cpp
[ 60%] Built target ElementIntegral_DGBR2_2D_Triangle_AD_btest_build_vera
[ 60%] Linking CXX executable ElementIntegral_DGBR2_2D_Triangle_AD_btest
[ 60%] Built target ElementIntegral_DGBR2_2D_Triangle_AD_btest_build
[ 60%] Building CXX object test/unit/Discretization/DG/CMakeFiles/FunctionalBoundaryTrace_DGBR2_btest_OBJECT.dir/FunctionalBoundaryTrace_DGBR2_btest.cpp.o
[ 60%] Built target FunctionalBoundaryTrace_DGBR2_btest_OBJECT
[ 60%] Checking style of test/unit/Discretization/DG/FunctionalBoundaryTrace_DGBR2_btest.cpp
[ 60%] Built target FunctionalBoundaryTrace_DGBR2_btest_build_vera
[ 60%] Linking CXX executable FunctionalBoundaryTrace_DGBR2_btest
[ 60%] Built target FunctionalBoundaryTrace_DGBR2_btest_build
[ 60%] Building CXX object test/unit/Discretization/DG/CMakeFiles/FunctionalCell_DGBR2_btest_OBJECT.dir/FunctionalCell_DGBR2_btest.cpp.o
[ 60%] Built target FunctionalCell_DGBR2_btest_OBJECT
[ 60%] Checking style of test/unit/Discretization/DG/FunctionalCell_DGBR2_btest.cpp
[ 60%] Built target FunctionalCell_DGBR2_btest_build_vera
[ 60%] Linking CXX executable FunctionalCell_DGBR2_btest
[ 60%] Built target FunctionalCell_DGBR2_btest_build
[ 60%] Building CXX object test/unit/Discretization/DG/CMakeFiles/FunctionalCellwise_DGBR2_btest_OBJECT.dir/FunctionalCellwise_DGBR2_btest.cpp.o
[ 60%] Built target FunctionalCellwise_DGBR2_btest_OBJECT
[ 60%] Checking style of test/unit/Discretization/DG/FunctionalCellwise_DGBR2_btest.cpp
[ 60%] Built target FunctionalCellwise_DGBR2_btest_build_vera
[ 60%] Linking CXX executable FunctionalCellwise_DGBR2_btest
[ 60%] Built target FunctionalCellwise_DGBR2_btest_build
[ 60%] Building CXX object test/unit/Discretization/DG/CMakeFiles/IntegrandBoundaryTrace_Dirichlet_mitState_DGBR2_AD_btest_OBJECT.dir/IntegrandBoundaryTrace_Dirichlet_mitState_DGBR2_AD_btest.cpp.o
[ 60%] Built target IntegrandBoundaryTrace_Dirichlet_mitState_DGBR2_AD_btest_OBJECT
[ 60%] Checking style of test/unit/Discretization/DG/IntegrandBoundaryTrace_Dirichlet_mitState_DGBR2_AD_btest.cpp
[ 60%] Built target IntegrandBoundaryTrace_Dirichlet_mitState_DGBR2_AD_btest_build_vera
[ 60%] Linking CXX executable IntegrandBoundaryTrace_Dirichlet_mitState_DGBR2_AD_btest
[ 60%] Built target IntegrandBoundaryTrace_Dirichlet_mitState_DGBR2_AD_btest_build
[ 60%] Building CXX object test/unit/Discretization/DG/CMakeFiles/IntegrandBoundaryTrace_Dirichlet_mitState_DGBR2_BuckleyLeverett_btest_OBJECT.dir/IntegrandBoundaryTrace_Dirichlet_mitState_DGBR2_BuckleyLeverett_btest.cpp.o
[ 60%] Built target IntegrandBoundaryTrace_Dirichlet_mitState_DGBR2_BuckleyLeverett_btest_OBJECT
[ 60%] Checking style of test/unit/Discretization/DG/IntegrandBoundaryTrace_Dirichlet_mitState_DGBR2_BuckleyLeverett_btest.cpp
[ 60%] Built target IntegrandBoundaryTrace_Dirichlet_mitState_DGBR2_BuckleyLeverett_btest_build_vera
[ 60%] Linking CXX executable IntegrandBoundaryTrace_Dirichlet_mitState_DGBR2_BuckleyLeverett_btest
[ 60%] Built target IntegrandBoundaryTrace_Dirichlet_mitState_DGBR2_BuckleyLeverett_btest_build
[ 60%] Building CXX object test/unit/Discretization/DG/CMakeFiles/IntegrandBoundaryTrace_Flux_mitState_DGBR2_AD_btest_OBJECT.dir/IntegrandBoundaryTrace_Flux_mitState_DGBR2_AD_btest.cpp.o
[ 60%] Built target IntegrandBoundaryTrace_Flux_mitState_DGBR2_AD_btest_OBJECT
[ 60%] Checking style of test/unit/Discretization/DG/IntegrandBoundaryTrace_Flux_mitState_DGBR2_AD_btest.cpp
[ 60%] Built target IntegrandBoundaryTrace_Flux_mitState_DGBR2_AD_btest_build_vera
[ 60%] Linking CXX executable IntegrandBoundaryTrace_Flux_mitState_DGBR2_AD_btest
[ 60%] Built target IntegrandBoundaryTrace_Flux_mitState_DGBR2_AD_btest_build
[ 60%] Building CXX object test/unit/Discretization/DG/CMakeFiles/IntegrandBoundaryTrace_Flux_mitState_DGBR2_NS_btest_OBJECT.dir/IntegrandBoundaryTrace_Flux_mitState_DGBR2_NS_btest.cpp.o
[ 60%] Built target IntegrandBoundaryTrace_Flux_mitState_DGBR2_NS_btest_OBJECT
[ 60%] Checking style of test/unit/Discretization/DG/IntegrandBoundaryTrace_Flux_mitState_DGBR2_NS_btest.cpp
[ 60%] Built target IntegrandBoundaryTrace_Flux_mitState_DGBR2_NS_btest_build_vera
[ 60%] Linking CXX executable IntegrandBoundaryTrace_Flux_mitState_DGBR2_NS_btest
[ 60%] Built target IntegrandBoundaryTrace_Flux_mitState_DGBR2_NS_btest_build
[ 60%] Building CXX object test/unit/Discretization/DG/CMakeFiles/IntegrandBoundaryTrace_LinearScalar_sansLG_DGBR2_AD_btest_OBJECT.dir/IntegrandBoundaryTrace_LinearScalar_sansLG_DGBR2_AD_btest.cpp.o
[ 60%] Built target IntegrandBoundaryTrace_LinearScalar_sansLG_DGBR2_AD_btest_OBJECT
[ 60%] Checking style of test/unit/Discretization/DG/IntegrandBoundaryTrace_LinearScalar_sansLG_DGBR2_AD_btest.cpp
[ 60%] Built target IntegrandBoundaryTrace_LinearScalar_sansLG_DGBR2_AD_btest_build_vera
[ 60%] Linking CXX executable IntegrandBoundaryTrace_LinearScalar_sansLG_DGBR2_AD_btest
[ 60%] Built target IntegrandBoundaryTrace_LinearScalar_sansLG_DGBR2_AD_btest_build
[ 60%] Building CXX object test/unit/Discretization/DG/CMakeFiles/IntegrandBoundaryTrace_Output_DGBR2_btest_OBJECT.dir/IntegrandBoundaryTrace_Output_DGBR2_btest.cpp.o
[ 60%] Built target IntegrandBoundaryTrace_Output_DGBR2_btest_OBJECT
[ 60%] Checking style of test/unit/Discretization/DG/IntegrandBoundaryTrace_Output_DGBR2_btest.cpp
[ 60%] Built target IntegrandBoundaryTrace_Output_DGBR2_btest_build_vera
[ 60%] Linking CXX executable IntegrandBoundaryTrace_Output_DGBR2_btest
[ 60%] Built target IntegrandBoundaryTrace_Output_DGBR2_btest_build
[ 60%] Building CXX object test/unit/Discretization/DG/CMakeFiles/IntegrandBoundaryTrace_Reflect_mitState_DGBR2_NS_btest_OBJECT.dir/IntegrandBoundaryTrace_Reflect_mitState_DGBR2_NS_btest.cpp.o
[ 60%] Built target IntegrandBoundaryTrace_Reflect_mitState_DGBR2_NS_btest_OBJECT
[ 60%] Checking style of test/unit/Discretization/DG/IntegrandBoundaryTrace_Reflect_mitState_DGBR2_NS_btest.cpp
[ 60%] Built target IntegrandBoundaryTrace_Reflect_mitState_DGBR2_NS_btest_build_vera
[ 60%] Linking CXX executable IntegrandBoundaryTrace_Reflect_mitState_DGBR2_NS_btest
[ 60%] Built target IntegrandBoundaryTrace_Reflect_mitState_DGBR2_NS_btest_build
[ 60%] Building CXX object test/unit/Discretization/DG/CMakeFiles/IntegrandCell_DGAdvective_Euler2D_btest_OBJECT.dir/IntegrandCell_DGAdvective_Euler2D_btest.cpp.o
[ 60%] Built target IntegrandCell_DGAdvective_Euler2D_btest_OBJECT
[ 62%] Checking style of test/unit/Discretization/DG/IntegrandCell_DGAdvective_Euler2D_btest.cpp
[ 62%] Built target IntegrandCell_DGAdvective_Euler2D_btest_build_vera
[ 62%] Linking CXX executable IntegrandCell_DGAdvective_Euler2D_btest
[ 62%] Built target IntegrandCell_DGAdvective_Euler2D_btest_build
[ 62%] Building CXX object test/unit/Discretization/DG/CMakeFiles/IntegrandCell_DGBR2_AD_btest_OBJECT.dir/IntegrandCell_DGBR2_AD_btest.cpp.o
[ 62%] Built target IntegrandCell_DGBR2_AD_btest_OBJECT
[ 62%] Checking style of test/unit/Discretization/DG/IntegrandCell_DGBR2_AD_btest.cpp
[ 62%] Built target IntegrandCell_DGBR2_AD_btest_build_vera
[ 62%] Linking CXX executable IntegrandCell_DGBR2_AD_btest
[ 62%] Built target IntegrandCell_DGBR2_AD_btest_build
[ 62%] Building CXX object test/unit/Discretization/DG/CMakeFiles/IntegrandCell_DGBR2_CR_btest_OBJECT.dir/IntegrandCell_DGBR2_CR_btest.cpp.o
[ 62%] Built target IntegrandCell_DGBR2_CR_btest_OBJECT
[ 62%] Checking style of test/unit/Discretization/DG/IntegrandCell_DGBR2_CR_btest.cpp
[ 62%] Built target IntegrandCell_DGBR2_CR_btest_build_vera
[ 62%] Linking CXX executable IntegrandCell_DGBR2_CR_btest
[ 62%] Built target IntegrandCell_DGBR2_CR_btest_build
[ 62%] Building CXX object test/unit/Discretization/DG/CMakeFiles/IntegrandCell_DGBR2_Output_btest_OBJECT.dir/IntegrandCell_DGBR2_Output_btest.cpp.o
[ 62%] Built target IntegrandCell_DGBR2_Output_btest_OBJECT
[ 62%] Checking style of test/unit/Discretization/DG/IntegrandCell_DGBR2_Output_btest.cpp
[ 62%] Built target IntegrandCell_DGBR2_Output_btest_build_vera
[ 62%] Linking CXX executable IntegrandCell_DGBR2_Output_btest
[ 62%] Built target IntegrandCell_DGBR2_Output_btest_build
[ 62%] Building CXX object test/unit/Discretization/DG/CMakeFiles/IntegrandInteriorTrace_DGBR2_AD_btest_OBJECT.dir/IntegrandInteriorTrace_DGBR2_AD_btest.cpp.o
[ 62%] Built target IntegrandInteriorTrace_DGBR2_AD_btest_OBJECT
[ 62%] Checking style of test/unit/Discretization/DG/IntegrandInteriorTrace_DGBR2_AD_btest.cpp
[ 62%] Built target IntegrandInteriorTrace_DGBR2_AD_btest_build_vera
[ 62%] Linking CXX executable IntegrandInteriorTrace_DGBR2_AD_btest
[ 62%] Built target IntegrandInteriorTrace_DGBR2_AD_btest_build
[ 62%] Building CXX object test/unit/Discretization/DG/CMakeFiles/IntegrandInteriorTrace_DGBR2_Sensor_btest_OBJECT.dir/IntegrandInteriorTrace_DGBR2_Sensor_btest.cpp.o
In file included from /jenkins/workspace/SANS_Nightly/builddir/undefined_gnu9/buildnode/reynolds/test/unit/Discretization/DG/IntegrandInteriorTrace_DGBR2_Sensor_btest.cpp:15:
/jenkins/workspace/SANS_Nightly/builddir/undefined_gnu9/buildnode/reynolds/src/pde/AdvectionDiffusion/PDEAdvectionDiffusion_ArtificialViscosity2D.h:34:46: note: #pragma message: #undef USE_GRID_LAPLACIAN
   34 | #pragma message( "#undef USE_GRID_LAPLACIAN" )
      |                                              ^
In file included from /jenkins/workspace/SANS_Nightly/builddir/undefined_gnu9/buildnode/reynolds/src/pde/Sensor/PDESensorParameter2D.h:18,
                 from /jenkins/workspace/SANS_Nightly/builddir/undefined_gnu9/buildnode/reynolds/test/unit/Discretization/DG/IntegrandInteriorTrace_DGBR2_Sensor_btest.cpp:18:
/jenkins/workspace/SANS_Nightly/builddir/undefined_gnu9/buildnode/reynolds/src/pde/Sensor/Sensor_ViscousFlux2D.h:26:46: note: #pragma message: #undef USE_GRID_LAPLACIAN
   26 | #pragma message( "#undef USE_GRID_LAPLACIAN" )
      |                                              ^
[ 62%] Built target IntegrandInteriorTrace_DGBR2_Sensor_btest_OBJECT
[ 62%] Checking style of test/unit/Discretization/DG/IntegrandInteriorTrace_DGBR2_Sensor_btest.cpp
[ 62%] Built target IntegrandInteriorTrace_DGBR2_Sensor_btest_build_vera
[ 62%] Linking CXX executable IntegrandInteriorTrace_DGBR2_Sensor_btest
[ 62%] Built target IntegrandInteriorTrace_DGBR2_Sensor_btest_build
[ 62%] Building CXX object test/unit/Discretization/DG/CMakeFiles/JacobianBoundaryTrace_Dirichlet_mitState_DGBR2_AD_btest_OBJECT.dir/JacobianBoundaryTrace_Dirichlet_mitState_DGBR2_AD_btest.cpp.o
[ 62%] Built target JacobianBoundaryTrace_Dirichlet_mitState_DGBR2_AD_btest_OBJECT
[ 62%] Checking style of test/unit/Discretization/DG/JacobianBoundaryTrace_Dirichlet_mitState_DGBR2_AD_btest.cpp
[ 62%] Built target JacobianBoundaryTrace_Dirichlet_mitState_DGBR2_AD_btest_build_vera
[ 62%] Linking CXX executable JacobianBoundaryTrace_Dirichlet_mitState_DGBR2_AD_btest
[ 62%] Built target JacobianBoundaryTrace_Dirichlet_mitState_DGBR2_AD_btest_build
[ 62%] Building CXX object test/unit/Discretization/DG/CMakeFiles/JacobianBoundaryTrace_Dirichlet_mitState_DGBR2_TwoPhase_btest_OBJECT.dir/JacobianBoundaryTrace_Dirichlet_mitState_DGBR2_TwoPhase_btest.cpp.o
[ 62%] Built target JacobianBoundaryTrace_Dirichlet_mitState_DGBR2_TwoPhase_btest_OBJECT
[ 62%] Checking style of test/unit/Discretization/DG/JacobianBoundaryTrace_Dirichlet_mitState_DGBR2_TwoPhase_btest.cpp
[ 62%] Built target JacobianBoundaryTrace_Dirichlet_mitState_DGBR2_TwoPhase_btest_build_vera
[ 62%] Linking CXX executable JacobianBoundaryTrace_Dirichlet_mitState_DGBR2_TwoPhase_btest
[ 62%] Built target JacobianBoundaryTrace_Dirichlet_mitState_DGBR2_TwoPhase_btest_build
[ 62%] Building CXX object test/unit/Discretization/DG/CMakeFiles/JacobianBoundaryTrace_LinearScalar_sansLG_DGBR2_AD_btest_OBJECT.dir/JacobianBoundaryTrace_LinearScalar_sansLG_DGBR2_AD_btest.cpp.o
[ 62%] Built target JacobianBoundaryTrace_LinearScalar_sansLG_DGBR2_AD_btest_OBJECT
[ 62%] Checking style of test/unit/Discretization/DG/JacobianBoundaryTrace_LinearScalar_sansLG_DGBR2_AD_btest.cpp
[ 62%] Built target JacobianBoundaryTrace_LinearScalar_sansLG_DGBR2_AD_btest_build_vera
[ 62%] Linking CXX executable JacobianBoundaryTrace_LinearScalar_sansLG_DGBR2_AD_btest
[ 62%] Built target JacobianBoundaryTrace_LinearScalar_sansLG_DGBR2_AD_btest_build
[ 62%] Building CXX object test/unit/Discretization/DG/CMakeFiles/JacobianCell_DGBR2_AD_btest_OBJECT.dir/JacobianCell_DGBR2_AD_btest.cpp.o
[ 62%] Built target JacobianCell_DGBR2_AD_btest_OBJECT
[ 62%] Checking style of test/unit/Discretization/DG/JacobianCell_DGBR2_AD_btest.cpp
[ 62%] Built target JacobianCell_DGBR2_AD_btest_build_vera
[ 62%] Linking CXX executable JacobianCell_DGBR2_AD_btest
[ 62%] Built target JacobianCell_DGBR2_AD_btest_build
[ 62%] Building CXX object test/unit/Discretization/DG/CMakeFiles/JacobianCell_DGBR2_LiftedQuantity_TwoPhaseAV_btest_OBJECT.dir/JacobianCell_DGBR2_LiftedQuantity_TwoPhaseAV_btest.cpp.o
In file included from /jenkins/workspace/SANS_Nightly/builddir/undefined_gnu9/buildnode/reynolds/test/unit/Discretization/DG/JacobianCell_DGBR2_LiftedQuantity_TwoPhaseAV_btest.cpp:19:
/jenkins/workspace/SANS_Nightly/builddir/undefined_gnu9/buildnode/reynolds/src/pde/PorousMedia/PDETwoPhase_ArtificialViscosity2D.h:32:46: note: #pragma message: #undef USE_GRID_LAPLACIAN
   32 | #pragma message( "#undef USE_GRID_LAPLACIAN" )
      |                                              ^
In file included from /jenkins/workspace/SANS_Nightly/builddir/undefined_gnu9/buildnode/reynolds/test/unit/Discretization/DG/JacobianCell_DGBR2_LiftedQuantity_TwoPhaseAV_btest.cpp:20:
/jenkins/workspace/SANS_Nightly/builddir/undefined_gnu9/buildnode/reynolds/src/pde/PorousMedia/BCTwoPhaseArtificialViscosity2D.h:32:46: note: #pragma message: #undef USE_GRID_LAPLACIAN
   32 | #pragma message( "#undef USE_GRID_LAPLACIAN" )
      |                                              ^
In file included from /jenkins/workspace/SANS_Nightly/builddir/undefined_gnu9/buildnode/reynolds/test/unit/Discretization/DG/JacobianCell_DGBR2_LiftedQuantity_TwoPhaseAV_btest.cpp:29:
/jenkins/workspace/SANS_Nightly/builddir/undefined_gnu9/buildnode/reynolds/src/pde/ArtificialViscosity/AVSensor_ViscousFlux2D.h:30:46: note: #pragma message: #undef USE_GRID_LAPLACIAN
   30 | #pragma message( "#undef USE_GRID_LAPLACIAN" )
      |                                              ^
In file included from /jenkins/workspace/SANS_Nightly/builddir/undefined_gnu9/buildnode/reynolds/src/pde/ArtificialViscosity/AVSensor_Source2D.h:26,
                 from /jenkins/workspace/SANS_Nightly/builddir/undefined_gnu9/buildnode/reynolds/test/unit/Discretization/DG/JacobianCell_DGBR2_LiftedQuantity_TwoPhaseAV_btest.cpp:30:
/jenkins/workspace/SANS_Nightly/builddir/undefined_gnu9/buildnode/reynolds/src/pde/ArtificialViscosity/PDEmitAVSensor2D.h:38:46: note: #pragma message: #undef USE_GRID_LAPLACIAN
   38 | #pragma message( "#undef USE_GRID_LAPLACIAN" )
      |                                              ^
In file included from /jenkins/workspace/SANS_Nightly/builddir/undefined_gnu9/buildnode/reynolds/test/unit/Discretization/DG/JacobianCell_DGBR2_LiftedQuantity_TwoPhaseAV_btest.cpp:30:
/jenkins/workspace/SANS_Nightly/builddir/undefined_gnu9/buildnode/reynolds/src/pde/ArtificialViscosity/AVSensor_Source2D.h:38:46: note: #pragma message: #undef USE_GRID_LAPLACIAN
   38 | #pragma message( "#undef USE_GRID_LAPLACIAN" )
      |                                              ^
[ 62%] Built target JacobianCell_DGBR2_LiftedQuantity_TwoPhaseAV_btest_OBJECT
[ 62%] Checking style of test/unit/Discretization/DG/JacobianCell_DGBR2_LiftedQuantity_TwoPhaseAV_btest.cpp
[ 62%] Built target JacobianCell_DGBR2_LiftedQuantity_TwoPhaseAV_btest_build_vera
[ 62%] Linking CXX executable JacobianCell_DGBR2_LiftedQuantity_TwoPhaseAV_btest
[ 62%] Built target JacobianCell_DGBR2_LiftedQuantity_TwoPhaseAV_btest_build
[ 62%] Building CXX object test/unit/Discretization/DG/CMakeFiles/JacobianCell_DGBR2_LiftingOperator_AD_btest_OBJECT.dir/JacobianCell_DGBR2_LiftingOperator_AD_btest.cpp.o
[ 62%] Built target JacobianCell_DGBR2_LiftingOperator_AD_btest_OBJECT
[ 62%] Checking style of test/unit/Discretization/DG/JacobianCell_DGBR2_LiftingOperator_AD_btest.cpp
[ 62%] Built target JacobianCell_DGBR2_LiftingOperator_AD_btest_build_vera
[ 62%] Linking CXX executable JacobianCell_DGBR2_LiftingOperator_AD_btest
[ 62%] Built target JacobianCell_DGBR2_LiftingOperator_AD_btest_build
[ 62%] Building CXX object test/unit/Discretization/DG/CMakeFiles/JacobianCell_DGBR2_LiftingOperator_LiftedQuantity_TwoPhaseAV_btest_OBJECT.dir/JacobianCell_DGBR2_LiftingOperator_LiftedQuantity_TwoPhaseAV_btest.cpp.o
In file included from /jenkins/workspace/SANS_Nightly/builddir/undefined_gnu9/buildnode/reynolds/test/unit/Discretization/DG/JacobianCell_DGBR2_LiftingOperator_LiftedQuantity_TwoPhaseAV_btest.cpp:19:
/jenkins/workspace/SANS_Nightly/builddir/undefined_gnu9/buildnode/reynolds/src/pde/PorousMedia/PDETwoPhase_ArtificialViscosity2D.h:32:46: note: #pragma message: #undef USE_GRID_LAPLACIAN
   32 | #pragma message( "#undef USE_GRID_LAPLACIAN" )
      |                                              ^
In file included from /jenkins/workspace/SANS_Nightly/builddir/undefined_gnu9/buildnode/reynolds/test/unit/Discretization/DG/JacobianCell_DGBR2_LiftingOperator_LiftedQuantity_TwoPhaseAV_btest.cpp:20:
/jenkins/workspace/SANS_Nightly/builddir/undefined_gnu9/buildnode/reynolds/src/pde/PorousMedia/BCTwoPhaseArtificialViscosity2D.h:32:46: note: #pragma message: #undef USE_GRID_LAPLACIAN
   32 | #pragma message( "#undef USE_GRID_LAPLACIAN" )
      |                                              ^
In file included from /jenkins/workspace/SANS_Nightly/builddir/undefined_gnu9/buildnode/reynolds/test/unit/Discretization/DG/JacobianCell_DGBR2_LiftingOperator_LiftedQuantity_TwoPhaseAV_btest.cpp:29:
/jenkins/workspace/SANS_Nightly/builddir/undefined_gnu9/buildnode/reynolds/src/pde/ArtificialViscosity/AVSensor_ViscousFlux2D.h:30:46: note: #pragma message: #undef USE_GRID_LAPLACIAN
   30 | #pragma message( "#undef USE_GRID_LAPLACIAN" )
      |                                              ^
In file included from /jenkins/workspace/SANS_Nightly/builddir/undefined_gnu9/buildnode/reynolds/src/pde/ArtificialViscosity/AVSensor_Source2D.h:26,
                 from /jenkins/workspace/SANS_Nightly/builddir/undefined_gnu9/buildnode/reynolds/test/unit/Discretization/DG/JacobianCell_DGBR2_LiftingOperator_LiftedQuantity_TwoPhaseAV_btest.cpp:30:
/jenkins/workspace/SANS_Nightly/builddir/undefined_gnu9/buildnode/reynolds/src/pde/ArtificialViscosity/PDEmitAVSensor2D.h:38:46: note: #pragma message: #undef USE_GRID_LAPLACIAN
   38 | #pragma message( "#undef USE_GRID_LAPLACIAN" )
      |                                              ^
In file included from /jenkins/workspace/SANS_Nightly/builddir/undefined_gnu9/buildnode/reynolds/test/unit/Discretization/DG/JacobianCell_DGBR2_LiftingOperator_LiftedQuantity_TwoPhaseAV_btest.cpp:30:
/jenkins/workspace/SANS_Nightly/builddir/undefined_gnu9/buildnode/reynolds/src/pde/ArtificialViscosity/AVSensor_Source2D.h:38:46: note: #pragma message: #undef USE_GRID_LAPLACIAN
   38 | #pragma message( "#undef USE_GRID_LAPLACIAN" )
      |                                              ^
[ 62%] Built target JacobianCell_DGBR2_LiftingOperator_LiftedQuantity_TwoPhaseAV_btest_OBJECT
[ 62%] Checking style of test/unit/Discretization/DG/JacobianCell_DGBR2_LiftingOperator_LiftedQuantity_TwoPhaseAV_btest.cpp
[ 62%] Built target JacobianCell_DGBR2_LiftingOperator_LiftedQuantity_TwoPhaseAV_btest_build_vera
[ 62%] Linking CXX executable JacobianCell_DGBR2_LiftingOperator_LiftedQuantity_TwoPhaseAV_btest
[ 62%] Built target JacobianCell_DGBR2_LiftingOperator_LiftedQuantity_TwoPhaseAV_btest_build
[ 62%] Building CXX object test/unit/Discretization/DG/CMakeFiles/JacobianCell_DGBR2_Param_Euler1D_btest_OBJECT.dir/JacobianCell_DGBR2_Param_Euler1D_btest.cpp.o
In file included from /jenkins/workspace/SANS_Nightly/builddir/undefined_gnu9/buildnode/reynolds/test/unit/Discretization/DG/JacobianCell_DGBR2_Param_Euler1D_btest.cpp:24:
/jenkins/workspace/SANS_Nightly/builddir/undefined_gnu9/buildnode/reynolds/src/pde/NS/PDEEulermitAVDiffusion1D.h:41:46: note: #pragma message: #undef USE_GRID_LAPLACIAN
   41 | #pragma message( "#undef USE_GRID_LAPLACIAN" )
      |                                              ^
In file included from /jenkins/workspace/SANS_Nightly/builddir/undefined_gnu9/buildnode/reynolds/src/pde/Sensor/PDESensorParameter1D.h:18,
                 from /jenkins/workspace/SANS_Nightly/builddir/undefined_gnu9/buildnode/reynolds/test/unit/Discretization/DG/JacobianCell_DGBR2_Param_Euler1D_btest.cpp:27:
/jenkins/workspace/SANS_Nightly/builddir/undefined_gnu9/buildnode/reynolds/src/pde/Sensor/Sensor_ViscousFlux1D.h:25:46: note: #pragma message: #undef USE_GRID_LAPLACIAN
   25 | #pragma message( "#undef USE_GRID_LAPLACIAN" )
      |                                              ^
[ 62%] Built target JacobianCell_DGBR2_Param_Euler1D_btest_OBJECT
[ 62%] Checking style of test/unit/Discretization/DG/JacobianCell_DGBR2_Param_Euler1D_btest.cpp
[ 62%] Built target JacobianCell_DGBR2_Param_Euler1D_btest_build_vera
[ 62%] Linking CXX executable JacobianCell_DGBR2_Param_Euler1D_btest
[ 62%] Built target JacobianCell_DGBR2_Param_Euler1D_btest_build
[ 62%] Building CXX object test/unit/Discretization/DG/CMakeFiles/JacobianCell_DGBR2_TwoPhase_btest_OBJECT.dir/JacobianCell_DGBR2_TwoPhase_btest.cpp.o
[ 62%] Built target JacobianCell_DGBR2_TwoPhase_btest_OBJECT
[ 62%] Checking style of test/unit/Discretization/DG/JacobianCell_DGBR2_TwoPhase_btest.cpp
[ 62%] Built target JacobianCell_DGBR2_TwoPhase_btest_build_vera
[ 62%] Linking CXX executable JacobianCell_DGBR2_TwoPhase_btest
[ 62%] Built target JacobianCell_DGBR2_TwoPhase_btest_build
[ 62%] Building CXX object test/unit/Discretization/DG/CMakeFiles/JacobianFunctionalBoundaryTrace_DGBR2_btest_OBJECT.dir/JacobianFunctionalBoundaryTrace_DGBR2_btest.cpp.o
[ 62%] Built target JacobianFunctionalBoundaryTrace_DGBR2_btest_OBJECT
[ 62%] Checking style of test/unit/Discretization/DG/JacobianFunctionalBoundaryTrace_DGBR2_btest.cpp
[ 62%] Built target JacobianFunctionalBoundaryTrace_DGBR2_btest_build_vera
[ 62%] Linking CXX executable JacobianFunctionalBoundaryTrace_DGBR2_btest
[ 62%] Built target JacobianFunctionalBoundaryTrace_DGBR2_btest_build
[ 62%] Building CXX object test/unit/Discretization/DG/CMakeFiles/JacobianFunctionalCell_DGBR2_btest_OBJECT.dir/JacobianFunctionalCell_DGBR2_btest.cpp.o
[ 62%] Built target JacobianFunctionalCell_DGBR2_btest_OBJECT
[ 62%] Checking style of test/unit/Discretization/DG/JacobianFunctionalCell_DGBR2_btest.cpp
[ 62%] Built target JacobianFunctionalCell_DGBR2_btest_build_vera
[ 62%] Linking CXX executable JacobianFunctionalCell_DGBR2_btest
[ 62%] Built target JacobianFunctionalCell_DGBR2_btest_build
[ 62%] Building CXX object test/unit/Discretization/DG/CMakeFiles/JacobianInteriorTrace_DGBR2_AD_btest_OBJECT.dir/JacobianInteriorTrace_DGBR2_AD_btest.cpp.o
[ 62%] Built target JacobianInteriorTrace_DGBR2_AD_btest_OBJECT
[ 62%] Checking style of test/unit/Discretization/DG/JacobianInteriorTrace_DGBR2_AD_btest.cpp
[ 62%] Built target JacobianInteriorTrace_DGBR2_AD_btest_build_vera
[ 62%] Linking CXX executable JacobianInteriorTrace_DGBR2_AD_btest
[ 62%] Built target JacobianInteriorTrace_DGBR2_AD_btest_build
[ 62%] Building CXX object test/unit/Discretization/DG/CMakeFiles/JacobianInteriorTrace_DGBR2_Param_Euler1D_btest_OBJECT.dir/JacobianInteriorTrace_DGBR2_Param_Euler1D_btest.cpp.o
In file included from /jenkins/workspace/SANS_Nightly/builddir/undefined_gnu9/buildnode/reynolds/test/unit/Discretization/DG/JacobianInteriorTrace_DGBR2_Param_Euler1D_btest.cpp:22:
/jenkins/workspace/SANS_Nightly/builddir/undefined_gnu9/buildnode/reynolds/src/pde/NS/PDEEulermitAVDiffusion1D.h:41:46: note: #pragma message: #undef USE_GRID_LAPLACIAN
   41 | #pragma message( "#undef USE_GRID_LAPLACIAN" )
      |                                              ^
In file included from /jenkins/workspace/SANS_Nightly/builddir/undefined_gnu9/buildnode/reynolds/src/pde/Sensor/PDESensorParameter1D.h:18,
                 from /jenkins/workspace/SANS_Nightly/builddir/undefined_gnu9/buildnode/reynolds/test/unit/Discretization/DG/JacobianInteriorTrace_DGBR2_Param_Euler1D_btest.cpp:25:
/jenkins/workspace/SANS_Nightly/builddir/undefined_gnu9/buildnode/reynolds/src/pde/Sensor/Sensor_ViscousFlux1D.h:25:46: note: #pragma message: #undef USE_GRID_LAPLACIAN
   25 | #pragma message( "#undef USE_GRID_LAPLACIAN" )
      |                                              ^
[ 62%] Built target JacobianInteriorTrace_DGBR2_Param_Euler1D_btest_OBJECT
[ 62%] Checking style of test/unit/Discretization/DG/JacobianInteriorTrace_DGBR2_Param_Euler1D_btest.cpp
[ 62%] Built target JacobianInteriorTrace_DGBR2_Param_Euler1D_btest_build_vera
[ 62%] Linking CXX executable JacobianInteriorTrace_DGBR2_Param_Euler1D_btest
[ 62%] Built target JacobianInteriorTrace_DGBR2_Param_Euler1D_btest_build
[ 62%] Building CXX object test/unit/Discretization/DG/CMakeFiles/JacobianInteriorTrace_DGBR2_TwoPhase_btest_OBJECT.dir/JacobianInteriorTrace_DGBR2_TwoPhase_btest.cpp.o
[ 62%] Built target JacobianInteriorTrace_DGBR2_TwoPhase_btest_OBJECT
[ 62%] Checking style of test/unit/Discretization/DG/JacobianInteriorTrace_DGBR2_TwoPhase_btest.cpp
[ 62%] Built target JacobianInteriorTrace_DGBR2_TwoPhase_btest_build_vera
[ 62%] Linking CXX executable JacobianInteriorTrace_DGBR2_TwoPhase_btest
[ 62%] Built target JacobianInteriorTrace_DGBR2_TwoPhase_btest_build
[ 62%] Building CXX object test/unit/Discretization/DG/CMakeFiles/JacobianTranspose_DGBR2_Triangle_AD_btest_OBJECT.dir/JacobianTranspose_DGBR2_Triangle_AD_btest.cpp.o
[ 62%] Built target JacobianTranspose_DGBR2_Triangle_AD_btest_OBJECT
[ 62%] Checking style of test/unit/Discretization/DG/JacobianTranspose_DGBR2_Triangle_AD_btest.cpp
[ 62%] Built target JacobianTranspose_DGBR2_Triangle_AD_btest_build_vera
[ 62%] Linking CXX executable JacobianTranspose_DGBR2_Triangle_AD_btest
[ 62%] Built target JacobianTranspose_DGBR2_Triangle_AD_btest_build
[ 62%] Building CXX object test/unit/Discretization/DG/CMakeFiles/ResidualBoundaryTrace_Dirichlet_mitState_DGBR2_AD_btest_OBJECT.dir/ResidualBoundaryTrace_Dirichlet_mitState_DGBR2_AD_btest.cpp.o
[ 62%] Built target ResidualBoundaryTrace_Dirichlet_mitState_DGBR2_AD_btest_OBJECT
[ 62%] Checking style of test/unit/Discretization/DG/ResidualBoundaryTrace_Dirichlet_mitState_DGBR2_AD_btest.cpp
[ 62%] Built target ResidualBoundaryTrace_Dirichlet_mitState_DGBR2_AD_btest_build_vera
[ 62%] Linking CXX executable ResidualBoundaryTrace_Dirichlet_mitState_DGBR2_AD_btest
[ 62%] Built target ResidualBoundaryTrace_Dirichlet_mitState_DGBR2_AD_btest_build
[ 62%] Building CXX object test/unit/Discretization/DG/CMakeFiles/ResidualBoundaryTrace_LinearScalar_sansLG_DGBR2_AD_btest_OBJECT.dir/ResidualBoundaryTrace_LinearScalar_sansLG_DGBR2_AD_btest.cpp.o
[ 62%] Built target ResidualBoundaryTrace_LinearScalar_sansLG_DGBR2_AD_btest_OBJECT
[ 62%] Checking style of test/unit/Discretization/DG/ResidualBoundaryTrace_LinearScalar_sansLG_DGBR2_AD_btest.cpp
[ 62%] Built target ResidualBoundaryTrace_LinearScalar_sansLG_DGBR2_AD_btest_build_vera
[ 62%] Linking CXX executable ResidualBoundaryTrace_LinearScalar_sansLG_DGBR2_AD_btest
[ 62%] Built target ResidualBoundaryTrace_LinearScalar_sansLG_DGBR2_AD_btest_build
[ 62%] Building CXX object test/unit/Discretization/DG/CMakeFiles/ResidualCell_DGAdvective_Euler2D_btest_OBJECT.dir/ResidualCell_DGAdvective_Euler2D_btest.cpp.o
[ 62%] Built target ResidualCell_DGAdvective_Euler2D_btest_OBJECT
[ 62%] Checking style of test/unit/Discretization/DG/ResidualCell_DGAdvective_Euler2D_btest.cpp
[ 62%] Built target ResidualCell_DGAdvective_Euler2D_btest_build_vera
[ 62%] Linking CXX executable ResidualCell_DGAdvective_Euler2D_btest
[ 62%] Built target ResidualCell_DGAdvective_Euler2D_btest_build
[ 62%] Building CXX object test/unit/Discretization/DG/CMakeFiles/ResidualCell_DGBR2_AD_btest_OBJECT.dir/ResidualCell_DGBR2_AD_btest.cpp.o
[ 62%] Built target ResidualCell_DGBR2_AD_btest_OBJECT
[ 62%] Checking style of test/unit/Discretization/DG/ResidualCell_DGBR2_AD_btest.cpp
[ 62%] Built target ResidualCell_DGBR2_AD_btest_build_vera
[ 62%] Linking CXX executable ResidualCell_DGBR2_AD_btest
[ 62%] Built target ResidualCell_DGBR2_AD_btest_build
[ 62%] Building CXX object test/unit/Discretization/DG/CMakeFiles/ResidualCell_DGBR2_LiftedQuantity_TwoPhaseAV_btest_OBJECT.dir/ResidualCell_DGBR2_LiftedQuantity_TwoPhaseAV_btest.cpp.o
In file included from /jenkins/workspace/SANS_Nightly/builddir/undefined_gnu9/buildnode/reynolds/test/unit/Discretization/DG/ResidualCell_DGBR2_LiftedQuantity_TwoPhaseAV_btest.cpp:17:
/jenkins/workspace/SANS_Nightly/builddir/undefined_gnu9/buildnode/reynolds/src/pde/PorousMedia/PDETwoPhase_ArtificialViscosity2D.h:32:46: note: #pragma message: #undef USE_GRID_LAPLACIAN
   32 | #pragma message( "#undef USE_GRID_LAPLACIAN" )
      |                                              ^
In file included from /jenkins/workspace/SANS_Nightly/builddir/undefined_gnu9/buildnode/reynolds/test/unit/Discretization/DG/ResidualCell_DGBR2_LiftedQuantity_TwoPhaseAV_btest.cpp:18:
/jenkins/workspace/SANS_Nightly/builddir/undefined_gnu9/buildnode/reynolds/src/pde/PorousMedia/BCTwoPhaseArtificialViscosity2D.h:32:46: note: #pragma message: #undef USE_GRID_LAPLACIAN
   32 | #pragma message( "#undef USE_GRID_LAPLACIAN" )
      |                                              ^
In file included from /jenkins/workspace/SANS_Nightly/builddir/undefined_gnu9/buildnode/reynolds/test/unit/Discretization/DG/ResidualCell_DGBR2_LiftedQuantity_TwoPhaseAV_btest.cpp:27:
/jenkins/workspace/SANS_Nightly/builddir/undefined_gnu9/buildnode/reynolds/src/pde/ArtificialViscosity/AVSensor_ViscousFlux2D.h:30:46: note: #pragma message: #undef USE_GRID_LAPLACIAN
   30 | #pragma message( "#undef USE_GRID_LAPLACIAN" )
      |                                              ^
In file included from /jenkins/workspace/SANS_Nightly/builddir/undefined_gnu9/buildnode/reynolds/src/pde/ArtificialViscosity/AVSensor_Source2D.h:26,
                 from /jenkins/workspace/SANS_Nightly/builddir/undefined_gnu9/buildnode/reynolds/test/unit/Discretization/DG/ResidualCell_DGBR2_LiftedQuantity_TwoPhaseAV_btest.cpp:28:
/jenkins/workspace/SANS_Nightly/builddir/undefined_gnu9/buildnode/reynolds/src/pde/ArtificialViscosity/PDEmitAVSensor2D.h:38:46: note: #pragma message: #undef USE_GRID_LAPLACIAN
   38 | #pragma message( "#undef USE_GRID_LAPLACIAN" )
      |                                              ^
In file included from /jenkins/workspace/SANS_Nightly/builddir/undefined_gnu9/buildnode/reynolds/test/unit/Discretization/DG/ResidualCell_DGBR2_LiftedQuantity_TwoPhaseAV_btest.cpp:28:
/jenkins/workspace/SANS_Nightly/builddir/undefined_gnu9/buildnode/reynolds/src/pde/ArtificialViscosity/AVSensor_Source2D.h:38:46: note: #pragma message: #undef USE_GRID_LAPLACIAN
   38 | #pragma message( "#undef USE_GRID_LAPLACIAN" )
      |                                              ^
[ 62%] Built target ResidualCell_DGBR2_LiftedQuantity_TwoPhaseAV_btest_OBJECT
[ 62%] Checking style of test/unit/Discretization/DG/ResidualCell_DGBR2_LiftedQuantity_TwoPhaseAV_btest.cpp
[ 62%] Built target ResidualCell_DGBR2_LiftedQuantity_TwoPhaseAV_btest_build_vera
[ 62%] Linking CXX executable ResidualCell_DGBR2_LiftedQuantity_TwoPhaseAV_btest
[ 62%] Built target ResidualCell_DGBR2_LiftedQuantity_TwoPhaseAV_btest_build
[ 62%] Building CXX object test/unit/Discretization/DG/CMakeFiles/ResidualInteriorTrace_DGBR2_AD_btest_OBJECT.dir/ResidualInteriorTrace_DGBR2_AD_btest.cpp.o
[ 62%] Built target ResidualInteriorTrace_DGBR2_AD_btest_OBJECT
[ 62%] Checking style of test/unit/Discretization/DG/ResidualInteriorTrace_DGBR2_AD_btest.cpp
[ 62%] Built target ResidualInteriorTrace_DGBR2_AD_btest_build_vera
[ 62%] Linking CXX executable ResidualInteriorTrace_DGBR2_AD_btest
[ 62%] Built target ResidualInteriorTrace_DGBR2_AD_btest_build
[ 62%] Building CXX object test/unit/Discretization/DG/CMakeFiles/SetFieldBoundaryTrace_DGBR2_LO_AD_Dirichlet_mitState_btest_OBJECT.dir/SetFieldBoundaryTrace_DGBR2_LO_AD_Dirichlet_mitState_btest.cpp.o
[ 62%] Built target SetFieldBoundaryTrace_DGBR2_LO_AD_Dirichlet_mitState_btest_OBJECT
[ 62%] Checking style of test/unit/Discretization/DG/SetFieldBoundaryTrace_DGBR2_LO_AD_Dirichlet_mitState_btest.cpp
[ 62%] Built target SetFieldBoundaryTrace_DGBR2_LO_AD_Dirichlet_mitState_btest_build_vera
[ 62%] Linking CXX executable SetFieldBoundaryTrace_DGBR2_LO_AD_Dirichlet_mitState_btest
[ 62%] Built target SetFieldBoundaryTrace_DGBR2_LO_AD_Dirichlet_mitState_btest_build
[ 62%] Building CXX object test/unit/Discretization/DG/CMakeFiles/SetFieldInteriorTrace_DGBR2_LiftedQuantity_TwoPhaseAV_btest_OBJECT.dir/SetFieldInteriorTrace_DGBR2_LiftedQuantity_TwoPhaseAV_btest.cpp.o
In file included from /jenkins/workspace/SANS_Nightly/builddir/undefined_gnu9/buildnode/reynolds/test/unit/Discretization/DG/SetFieldInteriorTrace_DGBR2_LiftedQuantity_TwoPhaseAV_btest.cpp:17:
/jenkins/workspace/SANS_Nightly/builddir/undefined_gnu9/buildnode/reynolds/src/pde/PorousMedia/PDETwoPhase_ArtificialViscosity2D.h:32:46: note: #pragma message: #undef USE_GRID_LAPLACIAN
   32 | #pragma message( "#undef USE_GRID_LAPLACIAN" )
      |                                              ^
In file included from /jenkins/workspace/SANS_Nightly/builddir/undefined_gnu9/buildnode/reynolds/test/unit/Discretization/DG/SetFieldInteriorTrace_DGBR2_LiftedQuantity_TwoPhaseAV_btest.cpp:18:
/jenkins/workspace/SANS_Nightly/builddir/undefined_gnu9/buildnode/reynolds/src/pde/PorousMedia/BCTwoPhaseArtificialViscosity2D.h:32:46: note: #pragma message: #undef USE_GRID_LAPLACIAN
   32 | #pragma message( "#undef USE_GRID_LAPLACIAN" )
      |                                              ^
In file included from /jenkins/workspace/SANS_Nightly/builddir/undefined_gnu9/buildnode/reynolds/test/unit/Discretization/DG/SetFieldInteriorTrace_DGBR2_LiftedQuantity_TwoPhaseAV_btest.cpp:27:
/jenkins/workspace/SANS_Nightly/builddir/undefined_gnu9/buildnode/reynolds/src/pde/ArtificialViscosity/AVSensor_ViscousFlux2D.h:30:46: note: #pragma message: #undef USE_GRID_LAPLACIAN
   30 | #pragma message( "#undef USE_GRID_LAPLACIAN" )
      |                                              ^
In file included from /jenkins/workspace/SANS_Nightly/builddir/undefined_gnu9/buildnode/reynolds/src/pde/ArtificialViscosity/AVSensor_Source2D.h:26,
                 from /jenkins/workspace/SANS_Nightly/builddir/undefined_gnu9/buildnode/reynolds/test/unit/Discretization/DG/SetFieldInteriorTrace_DGBR2_LiftedQuantity_TwoPhaseAV_btest.cpp:28:
/jenkins/workspace/SANS_Nightly/builddir/undefined_gnu9/buildnode/reynolds/src/pde/ArtificialViscosity/PDEmitAVSensor2D.h:38:46: note: #pragma message: #undef USE_GRID_LAPLACIAN
   38 | #pragma message( "#undef USE_GRID_LAPLACIAN" )
      |                                              ^
In file included from /jenkins/workspace/SANS_Nightly/builddir/undefined_gnu9/buildnode/reynolds/test/unit/Discretization/DG/SetFieldInteriorTrace_DGBR2_LiftedQuantity_TwoPhaseAV_btest.cpp:28:
/jenkins/workspace/SANS_Nightly/builddir/undefined_gnu9/buildnode/reynolds/src/pde/ArtificialViscosity/AVSensor_Source2D.h:38:46: note: #pragma message: #undef USE_GRID_LAPLACIAN
   38 | #pragma message( "#undef USE_GRID_LAPLACIAN" )
      |                                              ^
[ 62%] Built target SetFieldInteriorTrace_DGBR2_LiftedQuantity_TwoPhaseAV_btest_OBJECT
[ 62%] Checking style of test/unit/Discretization/DG/SetFieldInteriorTrace_DGBR2_LiftedQuantity_TwoPhaseAV_btest.cpp
[ 62%] Built target SetFieldInteriorTrace_DGBR2_LiftedQuantity_TwoPhaseAV_btest_build_vera
[ 62%] Linking CXX executable SetFieldInteriorTrace_DGBR2_LiftedQuantity_TwoPhaseAV_btest
[ 62%] Built target SetFieldInteriorTrace_DGBR2_LiftedQuantity_TwoPhaseAV_btest_build
[ 62%] Building CXX object test/unit/Discretization/DG/CMakeFiles/SetFieldInteriorTrace_DGBR2_LiftingOperator_AD_btest_OBJECT.dir/SetFieldInteriorTrace_DGBR2_LiftingOperator_AD_btest.cpp.o
[ 62%] Built target SetFieldInteriorTrace_DGBR2_LiftingOperator_AD_btest_OBJECT
[ 62%] Checking style of test/unit/Discretization/DG/SetFieldInteriorTrace_DGBR2_LiftingOperator_AD_btest.cpp
[ 62%] Built target SetFieldInteriorTrace_DGBR2_LiftingOperator_AD_btest_build_vera
[ 62%] Linking CXX executable SetFieldInteriorTrace_DGBR2_LiftingOperator_AD_btest
[ 62%] Built target SetFieldInteriorTrace_DGBR2_LiftingOperator_AD_btest_build
[ 62%] Building CXX object test/unit/Discretization/DG/CMakeFiles/SolutionData_DGBR2_Block2_btest_OBJECT.dir/SolutionData_DGBR2_Block2_btest.cpp.o
In file included from /jenkins/workspace/SANS_Nightly/builddir/undefined_gnu9/buildnode/reynolds/test/unit/Discretization/DG/SolutionData_DGBR2_Block2_btest.cpp:15:
/jenkins/workspace/SANS_Nightly/builddir/undefined_gnu9/buildnode/reynolds/src/pde/AdvectionDiffusion/PDEAdvectionDiffusion_ArtificialViscosity2D.h:34:46: note: #pragma message: #undef USE_GRID_LAPLACIAN
   34 | #pragma message( "#undef USE_GRID_LAPLACIAN" )
      |                                              ^
In file included from /jenkins/workspace/SANS_Nightly/builddir/undefined_gnu9/buildnode/reynolds/src/pde/Sensor/PDESensorParameter2D.h:18,
                 from /jenkins/workspace/SANS_Nightly/builddir/undefined_gnu9/buildnode/reynolds/test/unit/Discretization/DG/SolutionData_DGBR2_Block2_btest.cpp:19:
/jenkins/workspace/SANS_Nightly/builddir/undefined_gnu9/buildnode/reynolds/src/pde/Sensor/Sensor_ViscousFlux2D.h:26:46: note: #pragma message: #undef USE_GRID_LAPLACIAN
   26 | #pragma message( "#undef USE_GRID_LAPLACIAN" )
      |                                              ^
[ 62%] Built target SolutionData_DGBR2_Block2_btest_OBJECT
[ 62%] Checking style of test/unit/Discretization/DG/SolutionData_DGBR2_Block2_btest.cpp
[ 62%] Built target SolutionData_DGBR2_Block2_btest_build_vera
[ 62%] Linking CXX executable SolutionData_DGBR2_Block2_btest
[ 62%] Built target SolutionData_DGBR2_Block2_btest_build
[ 62%] Building CXX object test/unit/Discretization/DG/CMakeFiles/SolutionData_DGBR2_btest_OBJECT.dir/SolutionData_DGBR2_btest.cpp.o
[ 62%] Built target SolutionData_DGBR2_btest_OBJECT
[ 62%] Checking style of test/unit/Discretization/DG/SolutionData_DGBR2_btest.cpp
[ 62%] Built target SolutionData_DGBR2_btest_build_vera
[ 62%] Linking CXX executable SolutionData_DGBR2_btest
[ 62%] Built target SolutionData_DGBR2_btest_build
[ 62%] Generating CXX unity source src/Discretization/cotire/GalerkinLib_CXX_unity.cxx
[ 62%] Generating CXX prefix source src/Discretization/cotire/GalerkinLib_CXX_prefix.cxx
[ 62%] Generating CXX prefix header src/Discretization/cotire/GalerkinLib_CXX_prefix.hxx
[ 62%] Building CXX precompiled header src/Discretization/cotire/GalerkinLib_CXX_prefix.hxx.gch
Scanning dependencies of target GalerkinLib
[ 62%] Building CXX object src/Discretization/CMakeFiles/GalerkinLib.dir/Galerkin/ExtractCGLocalBoundaries/ExtractCGLocalBoundaries1D.cpp.o
[ 62%] Building CXX object src/Discretization/CMakeFiles/GalerkinLib.dir/Galerkin/ExtractCGLocalBoundaries/ExtractCGLocalBoundaries2D.cpp.o
[ 62%] Building CXX object src/Discretization/CMakeFiles/GalerkinLib.dir/Galerkin/ExtractCGLocalBoundaries/ExtractCGLocalBoundaries3D.cpp.o
[ 62%] Building CXX object src/Discretization/CMakeFiles/GalerkinLib.dir/Galerkin/ExtractCGLocalBoundaries/ExtractCGLocalBoundaries4D.cpp.o
[ 62%] Building CXX object src/Discretization/CMakeFiles/GalerkinLib.dir/Galerkin/AlgebraicEquationSet_Rotor_GlobalConstraint.cpp.o
[ 62%] Linking CXX static library libGalerkinLib.a
[ 62%] Built target GalerkinLib
[ 62%] Checking style of src/pde/IncompressibleNS/BCIncompressibleNavierStokes1DChannel.cpp
[ 62%] Checking style of src/pde/IncompressibleNS/BCIncompressibleNavierStokes1DChannel.h
[ 62%] Checking style of src/pde/IncompressibleNS/BCIncompressibleRANSSA1DChannel.cpp
[ 62%] Checking style of src/pde/IncompressibleNS/BCIncompressibleRANSSA1DChannel.h
[ 62%] Checking style of src/pde/IncompressibleNS/OutputIncompressibleNavierStokes1DChannel.h
[ 62%] Checking style of src/pde/IncompressibleNS/PDEIncompressibleNavierStokes1DChannel.h
[ 62%] Checking style of src/pde/IncompressibleNS/PDEIncompressibleRANSSA1DChannel.h
[ 62%] Checking style of src/pde/IncompressibleNS/SolutionFunction_IncompressibleRANSSA1DChannel.h
[ 62%] Checking style of src/pde/IncompressibleNS/TraitsIncompressibleNavierStokes.h
[ 62%] Checking style of src/pde/IncompressibleNS/TraitsIncompressibleNavierStokesChannel.h
[ 62%] Checking style of src/pde/IncompressibleNS/TraitsIncompressibleRANSSAChannel.h
[ 62%] Checking style of src/pde/IncompressibleNS/SolutionFunction_IncompressibleRANSSA1DChannel.cpp
[ 62%] Built target IncompressibleNSLib_vera
[ 62%] Generating CXX unity source src/pde/IncompressibleNS/cotire/IncompressibleNSLib_CXX_unity.cxx
[ 62%] Generating CXX prefix source src/pde/IncompressibleNS/cotire/IncompressibleNSLib_CXX_prefix.cxx
[ 62%] Generating CXX prefix header src/pde/IncompressibleNS/cotire/IncompressibleNSLib_CXX_prefix.hxx
[ 63%] Building CXX precompiled header src/pde/IncompressibleNS/cotire/IncompressibleNSLib_CXX_prefix.hxx.gch
Scanning dependencies of target IncompressibleNSLib
[ 63%] Building CXX object src/pde/IncompressibleNS/CMakeFiles/IncompressibleNSLib.dir/BCIncompressibleNavierStokes1DChannel.cpp.o
[ 63%] Building CXX object src/pde/IncompressibleNS/CMakeFiles/IncompressibleNSLib.dir/BCIncompressibleRANSSA1DChannel.cpp.o
[ 63%] Building CXX object src/pde/IncompressibleNS/CMakeFiles/IncompressibleNSLib.dir/SolutionFunction_IncompressibleRANSSA1DChannel.cpp.o
[ 63%] Linking CXX static library libIncompressibleNSLib.a
[ 63%] Built target IncompressibleNSLib
[ 63%] Building CXX object test/unit/Discretization/Galerkin/CMakeFiles/AlgebraicEquationSet_Galerkin_BuckleyLeverett_ST_btest_OBJECT.dir/AlgebraicEquationSet_Galerkin_BuckleyLeverett_ST_btest.cpp.o
In file included from /usr/include/boost/config/header_deprecated.hpp:18,
                 from /usr/include/boost/test/output_test_stream.hpp:13,
                 from /jenkins/workspace/SANS_Nightly/builddir/undefined_gnu9/buildnode/reynolds/test/SANS_prefix_btest.h:51,
                 from /jenkins/workspace/SANS_Nightly/builddir/undefined_gnu9/buildnode/reynolds/build/undefined_gnu9/test/cotire/SANS_PREFIX_BTEST_CXX_prefix.cxx:4,
                 from /jenkins/workspace/SANS_Nightly/builddir/undefined_gnu9/buildnode/reynolds/build/undefined_gnu9/test/cotire/SANS_PREFIX_BTEST_CXX_prefix.hxx:4:
/usr/include/boost/test/output_test_stream.hpp:14:1: note: #pragma message: This header is deprecated. Use This header is deprecated. Please use <boost/test/tools/output_test_stream.hpp> instead. instead.
   14 | BOOST_HEADER_DEPRECATED( "This header is deprecated. Please use <boost/test/tools/output_test_stream.hpp> instead." )
      | ^~~~~~~~~~~~~~~~~~~~~~~
[ 63%] Built target AlgebraicEquationSet_Galerkin_BuckleyLeverett_ST_btest_OBJECT
[ 63%] Checking style of test/unit/Discretization/Galerkin/AlgebraicEquationSet_Galerkin_BuckleyLeverett_ST_btest.cpp
[ 63%] Built target AlgebraicEquationSet_Galerkin_BuckleyLeverett_ST_btest_build_vera
[ 63%] Linking CXX executable AlgebraicEquationSet_Galerkin_BuckleyLeverett_ST_btest
[ 63%] Built target AlgebraicEquationSet_Galerkin_BuckleyLeverett_ST_btest_build
[ 63%] Building CXX object test/unit/Discretization/Galerkin/CMakeFiles/AlgebraicEquationSet_Galerkin_Stabilized_Triangle_AD_btest_OBJECT.dir/AlgebraicEquationSet_Galerkin_Stabilized_Triangle_AD_btest.cpp.o
In file included from /usr/include/boost/config/header_deprecated.hpp:18,
                 from /usr/include/boost/test/output_test_stream.hpp:13,
                 from /jenkins/workspace/SANS_Nightly/builddir/undefined_gnu9/buildnode/reynolds/test/SANS_prefix_btest.h:51,
                 from /jenkins/workspace/SANS_Nightly/builddir/undefined_gnu9/buildnode/reynolds/build/undefined_gnu9/test/cotire/SANS_PREFIX_BTEST_CXX_prefix.cxx:4,
                 from /jenkins/workspace/SANS_Nightly/builddir/undefined_gnu9/buildnode/reynolds/build/undefined_gnu9/test/cotire/SANS_PREFIX_BTEST_CXX_prefix.hxx:4:
/usr/include/boost/test/output_test_stream.hpp:14:1: note: #pragma message: This header is deprecated. Use This header is deprecated. Please use <boost/test/tools/output_test_stream.hpp> instead. instead.
   14 | BOOST_HEADER_DEPRECATED( "This header is deprecated. Please use <boost/test/tools/output_test_stream.hpp> instead." )
      | ^~~~~~~~~~~~~~~~~~~~~~~
[ 63%] Built target AlgebraicEquationSet_Galerkin_Stabilized_Triangle_AD_btest_OBJECT
[ 63%] Checking style of test/unit/Discretization/Galerkin/AlgebraicEquationSet_Galerkin_Stabilized_Triangle_AD_btest.cpp
[ 63%] Built target AlgebraicEquationSet_Galerkin_Stabilized_Triangle_AD_btest_build_vera
[ 63%] Linking CXX executable AlgebraicEquationSet_Galerkin_Stabilized_Triangle_AD_btest
[ 63%] Built target AlgebraicEquationSet_Galerkin_Stabilized_Triangle_AD_btest_build
[ 63%] Building CXX object test/unit/Discretization/Galerkin/CMakeFiles/AlgebraicEquationSet_Galerkin_Stabilized_Triangle_SA_btest_OBJECT.dir/AlgebraicEquationSet_Galerkin_Stabilized_Triangle_SA_btest.cpp.o
In file included from /usr/include/boost/config/header_deprecated.hpp:18,
                 from /usr/include/boost/test/output_test_stream.hpp:13,
                 from /jenkins/workspace/SANS_Nightly/builddir/undefined_gnu9/buildnode/reynolds/test/SANS_prefix_btest.h:51,
                 from /jenkins/workspace/SANS_Nightly/builddir/undefined_gnu9/buildnode/reynolds/build/undefined_gnu9/test/cotire/SANS_PREFIX_BTEST_CXX_prefix.cxx:4,
                 from /jenkins/workspace/SANS_Nightly/builddir/undefined_gnu9/buildnode/reynolds/build/undefined_gnu9/test/cotire/SANS_PREFIX_BTEST_CXX_prefix.hxx:4:
/usr/include/boost/test/output_test_stream.hpp:14:1: note: #pragma message: This header is deprecated. Use This header is deprecated. Please use <boost/test/tools/output_test_stream.hpp> instead. instead.
   14 | BOOST_HEADER_DEPRECATED( "This header is deprecated. Please use <boost/test/tools/output_test_stream.hpp> instead." )
      | ^~~~~~~~~~~~~~~~~~~~~~~
In file included from /jenkins/workspace/SANS_Nightly/builddir/undefined_gnu9/buildnode/reynolds/test/unit/Discretization/Galerkin/AlgebraicEquationSet_Galerkin_Stabilized_Triangle_SA_btest.cpp:40:
/jenkins/workspace/SANS_Nightly/builddir/undefined_gnu9/buildnode/reynolds/src/pde/NS/PDEEulermitAVDiffusion2D.h:43:46: note: #pragma message: #undef USE_GRID_LAPLACIAN
   43 | #pragma message( "#undef USE_GRID_LAPLACIAN" )
      |                                              ^
In file included from /jenkins/workspace/SANS_Nightly/builddir/undefined_gnu9/buildnode/reynolds/src/pde/NS/BCEulermitAVSensor2D.h:15,
                 from /jenkins/workspace/SANS_Nightly/builddir/undefined_gnu9/buildnode/reynolds/test/unit/Discretization/Galerkin/AlgebraicEquationSet_Galerkin_Stabilized_Triangle_SA_btest.cpp:41:
/jenkins/workspace/SANS_Nightly/builddir/undefined_gnu9/buildnode/reynolds/src/pde/NS/PDEmitAVDiffusionOuter2D.h:43:46: note: #pragma message: #undef USE_GRID_LAPLACIAN
   43 | #pragma message( "#undef USE_GRID_LAPLACIAN" )
      |                                              ^
In file included from /jenkins/workspace/SANS_Nightly/builddir/undefined_gnu9/buildnode/reynolds/src/pde/NS/BCEulermitAVSensor2D.h:18,
                 from /jenkins/workspace/SANS_Nightly/builddir/undefined_gnu9/buildnode/reynolds/test/unit/Discretization/Galerkin/AlgebraicEquationSet_Galerkin_Stabilized_Triangle_SA_btest.cpp:41:
/jenkins/workspace/SANS_Nightly/builddir/undefined_gnu9/buildnode/reynolds/src/pde/ArtificialViscosity/BCmitAVSensor2D.h:32:46: note: #pragma message: #undef USE_GRID_LAPLACIAN
   32 | #pragma message( "#undef USE_GRID_LAPLACIAN" )
      |                                              ^
In file included from /jenkins/workspace/SANS_Nightly/builddir/undefined_gnu9/buildnode/reynolds/test/unit/Discretization/Galerkin/AlgebraicEquationSet_Galerkin_Stabilized_Triangle_SA_btest.cpp:44:
/jenkins/workspace/SANS_Nightly/builddir/undefined_gnu9/buildnode/reynolds/src/pde/ArtificialViscosity/AVSensor_ViscousFlux2D.h:30:46: note: #pragma message: #undef USE_GRID_LAPLACIAN
   30 | #pragma message( "#undef USE_GRID_LAPLACIAN" )
      |                                              ^
In file included from /jenkins/workspace/SANS_Nightly/builddir/undefined_gnu9/buildnode/reynolds/src/pde/ArtificialViscosity/AVSensor_Source2D.h:26,
                 from /jenkins/workspace/SANS_Nightly/builddir/undefined_gnu9/buildnode/reynolds/test/unit/Discretization/Galerkin/AlgebraicEquationSet_Galerkin_Stabilized_Triangle_SA_btest.cpp:45:
/jenkins/workspace/SANS_Nightly/builddir/undefined_gnu9/buildnode/reynolds/src/pde/ArtificialViscosity/PDEmitAVSensor2D.h:38:46: note: #pragma message: #undef USE_GRID_LAPLACIAN
   38 | #pragma message( "#undef USE_GRID_LAPLACIAN" )
      |                                              ^
In file included from /jenkins/workspace/SANS_Nightly/builddir/undefined_gnu9/buildnode/reynolds/test/unit/Discretization/Galerkin/AlgebraicEquationSet_Galerkin_Stabilized_Triangle_SA_btest.cpp:45:
/jenkins/workspace/SANS_Nightly/builddir/undefined_gnu9/buildnode/reynolds/src/pde/ArtificialViscosity/AVSensor_Source2D.h:38:46: note: #pragma message: #undef USE_GRID_LAPLACIAN
   38 | #pragma message( "#undef USE_GRID_LAPLACIAN" )
      |                                              ^
In file included from /jenkins/workspace/SANS_Nightly/builddir/undefined_gnu9/buildnode/reynolds/test/unit/Discretization/Galerkin/AlgebraicEquationSet_Galerkin_Stabilized_Triangle_SA_btest.cpp:29:
/jenkins/workspace/SANS_Nightly/builddir/undefined_gnu9/buildnode/reynolds/src/pde/NS/PDERANSSA2D.h: In member function ‘void SANS::PDERANSSA2D<PDETraitsSize, PDETraitsModel>::diffusionViscousGradient(const Real&, const Real&, const Real&, const Real&, SANS::PDERANSSA2D<PDETraitsSize, PDETraitsModel>::ArrayQ<T>&, SANS::PDERANSSA2D<PDETraitsSize, PDETraitsModel>::ArrayQ<Tg>&, SANS::PDERANSSA2D<PDETraitsSize, PDETraitsModel>::ArrayQ<Tg>&, SANS::PDERANSSA2D<PDETraitsSize, PDETraitsModel>::ArrayQ<Tf>&, SANS::PDERANSSA2D<PDETraitsSize, PDETraitsModel>::ArrayQ<Tf>&, SANS::PDERANSSA2D<PDETraitsSize, PDETraitsModel>::ArrayQ<Tf>&, SANS::PDERANSSA2D<PDETraitsSize, PDETraitsModel>::MatrixQ<Tk>&, SANS::PDERANSSA2D<PDETraitsSize, PDETraitsModel>::MatrixQ<Tk>&, SANS::PDERANSSA2D<PDETraitsSize, PDETraitsModel>::MatrixQ<Tk>&, SANS::PDERANSSA2D<PDETraitsSize, PDETraitsModel>::MatrixQ<Tk>&, SANS::PDERANSSA2D<PDETraitsSize, PDETraitsModel>::MatrixQ<Tk>&, SANS::PDERANSSA2D<PDETraitsSize, PDETraitsModel>::MatrixQ<Tk>&) const [with Tq = SANS::SurrealS<5, double>; Tg = double; Th = double; Tk = SANS::SurrealS<5, double>; PDETraitsSize = SANS::TraitsSizeRANSSA; PDETraitsModel = SANS::TraitsModelRANSSA<SANS::QTypePrimitiveRhoPressure, SANS::GasModel, SANS::ViscosityModel_Const, SANS::ThermalConductivityModel>]’:
/jenkins/workspace/SANS_Nightly/builddir/undefined_gnu9/buildnode/reynolds/src/pde/NS/PDERANSSA2D.h:2029:1: note: variable tracking size limit exceeded with ‘-fvar-tracking-assignments’, retrying without
 2029 | PDERANSSA2D<PDETraitsSize, PDETraitsModel>::diffusionViscousGradient(
      | ^~~~~~~~~~~~~~~~~~~~~~~~~~~~~~~~~~~~~~~~~~
/jenkins/workspace/SANS_Nightly/builddir/undefined_gnu9/buildnode/reynolds/src/pde/NS/PDERANSSA2D.h: In member function ‘void SANS::PDERANSSA2D<PDETraitsSize, PDETraitsModel>::jacobianGradientSourceGradient(const Real&, const Real&, const Real&, const Real&, SANS::PDERANSSA2D<PDETraitsSize, PDETraitsModel>::ArrayQ<T>&, SANS::PDERANSSA2D<PDETraitsSize, PDETraitsModel>::ArrayQ<Tg>&, SANS::PDERANSSA2D<PDETraitsSize, PDETraitsModel>::ArrayQ<Tg>&, SANS::PDERANSSA2D<PDETraitsSize, PDETraitsModel>::ArrayQ<Tf>&, SANS::PDERANSSA2D<PDETraitsSize, PDETraitsModel>::ArrayQ<Tf>&, SANS::PDERANSSA2D<PDETraitsSize, PDETraitsModel>::ArrayQ<Tf>&, SANS::PDERANSSA2D<PDETraitsSize, PDETraitsModel>::MatrixQ<Tk>&) const [with Tq = SANS::SurrealS<5, double>; Tg = double; Th = double; Ts = SANS::SurrealS<5, double>; PDETraitsSize = SANS::TraitsSizeRANSSA; PDETraitsModel = SANS::TraitsModelRANSSA<SANS::QTypePrimitiveRhoPressure, SANS::GasModel, SANS::ViscosityModel_Const, SANS::ThermalConductivityModel>]’:
/jenkins/workspace/SANS_Nightly/builddir/undefined_gnu9/buildnode/reynolds/src/pde/NS/PDERANSSA2D.h:4242:1: note: variable tracking size limit exceeded with ‘-fvar-tracking-assignments’, retrying without
 4242 | PDERANSSA2D<PDETraitsSize, PDETraitsModel>::jacobianGradientSourceGradient(
      | ^~~~~~~~~~~~~~~~~~~~~~~~~~~~~~~~~~~~~~~~~~
/jenkins/workspace/SANS_Nightly/builddir/undefined_gnu9/buildnode/reynolds/src/pde/NS/PDERANSSA2D.h: In member function ‘void SANS::PDERANSSA2D<PDETraitsSize, PDETraitsModel>::diffusionViscousGradient(const Real&, const Real&, const Real&, const Real&, SANS::PDERANSSA2D<PDETraitsSize, PDETraitsModel>::ArrayQ<T>&, SANS::PDERANSSA2D<PDETraitsSize, PDETraitsModel>::ArrayQ<Tg>&, SANS::PDERANSSA2D<PDETraitsSize, PDETraitsModel>::ArrayQ<Tg>&, SANS::PDERANSSA2D<PDETraitsSize, PDETraitsModel>::ArrayQ<Tf>&, SANS::PDERANSSA2D<PDETraitsSize, PDETraitsModel>::ArrayQ<Tf>&, SANS::PDERANSSA2D<PDETraitsSize, PDETraitsModel>::ArrayQ<Tf>&, SANS::PDERANSSA2D<PDETraitsSize, PDETraitsModel>::MatrixQ<Tk>&, SANS::PDERANSSA2D<PDETraitsSize, PDETraitsModel>::MatrixQ<Tk>&, SANS::PDERANSSA2D<PDETraitsSize, PDETraitsModel>::MatrixQ<Tk>&, SANS::PDERANSSA2D<PDETraitsSize, PDETraitsModel>::MatrixQ<Tk>&, SANS::PDERANSSA2D<PDETraitsSize, PDETraitsModel>::MatrixQ<Tk>&, SANS::PDERANSSA2D<PDETraitsSize, PDETraitsModel>::MatrixQ<Tk>&) const [with Tq = double; Tg = SANS::SurrealS<5, double>; Th = double; Tk = SANS::SurrealS<5, double>; PDETraitsSize = SANS::TraitsSizeRANSSA; PDETraitsModel = SANS::TraitsModelRANSSA<SANS::QTypePrimitiveRhoPressure, SANS::GasModel, SANS::ViscosityModel_Const, SANS::ThermalConductivityModel>]’:
/jenkins/workspace/SANS_Nightly/builddir/undefined_gnu9/buildnode/reynolds/src/pde/NS/PDERANSSA2D.h:2029:1: note: variable tracking size limit exceeded with ‘-fvar-tracking-assignments’, retrying without
 2029 | PDERANSSA2D<PDETraitsSize, PDETraitsModel>::diffusionViscousGradient(
      | ^~~~~~~~~~~~~~~~~~~~~~~~~~~~~~~~~~~~~~~~~~
[ 63%] Built target AlgebraicEquationSet_Galerkin_Stabilized_Triangle_SA_btest_OBJECT
[ 63%] Checking style of test/unit/Discretization/Galerkin/AlgebraicEquationSet_Galerkin_Stabilized_Triangle_SA_btest.cpp
[ 63%] Built target AlgebraicEquationSet_Galerkin_Stabilized_Triangle_SA_btest_build_vera
[ 63%] Linking CXX executable AlgebraicEquationSet_Galerkin_Stabilized_Triangle_SA_btest
[ 63%] Built target AlgebraicEquationSet_Galerkin_Stabilized_Triangle_SA_btest_build
[ 63%] Building CXX object test/unit/Discretization/Galerkin/CMakeFiles/AlgebraicEquationSet_Galerkin_Triangle_AD_btest_OBJECT.dir/AlgebraicEquationSet_Galerkin_Triangle_AD_btest.cpp.o
In file included from /usr/include/boost/config/header_deprecated.hpp:18,
                 from /usr/include/boost/test/output_test_stream.hpp:13,
                 from /jenkins/workspace/SANS_Nightly/builddir/undefined_gnu9/buildnode/reynolds/test/SANS_prefix_btest.h:51,
                 from /jenkins/workspace/SANS_Nightly/builddir/undefined_gnu9/buildnode/reynolds/build/undefined_gnu9/test/cotire/SANS_PREFIX_BTEST_CXX_prefix.cxx:4,
                 from /jenkins/workspace/SANS_Nightly/builddir/undefined_gnu9/buildnode/reynolds/build/undefined_gnu9/test/cotire/SANS_PREFIX_BTEST_CXX_prefix.hxx:4:
/usr/include/boost/test/output_test_stream.hpp:14:1: note: #pragma message: This header is deprecated. Use This header is deprecated. Please use <boost/test/tools/output_test_stream.hpp> instead. instead.
   14 | BOOST_HEADER_DEPRECATED( "This header is deprecated. Please use <boost/test/tools/output_test_stream.hpp> instead." )
      | ^~~~~~~~~~~~~~~~~~~~~~~
[ 63%] Built target AlgebraicEquationSet_Galerkin_Triangle_AD_btest_OBJECT
[ 63%] Checking style of test/unit/Discretization/Galerkin/AlgebraicEquationSet_Galerkin_Triangle_AD_btest.cpp
[ 63%] Built target AlgebraicEquationSet_Galerkin_Triangle_AD_btest_build_vera
[ 63%] Linking CXX executable AlgebraicEquationSet_Galerkin_Triangle_AD_btest
[ 63%] Built target AlgebraicEquationSet_Galerkin_Triangle_AD_btest_build
[ 63%] Building CXX object test/unit/Discretization/Galerkin/CMakeFiles/AlgebraicEquationSet_Local_Galerkin_Stabilized_Triangle_AD_btest_OBJECT.dir/AlgebraicEquationSet_Local_Galerkin_Stabilized_Triangle_AD_btest.cpp.o
[ 63%] Built target AlgebraicEquationSet_Local_Galerkin_Stabilized_Triangle_AD_btest_OBJECT
[ 63%] Checking style of test/unit/Discretization/Galerkin/AlgebraicEquationSet_Local_Galerkin_Stabilized_Triangle_AD_btest.cpp
[ 63%] Built target AlgebraicEquationSet_Local_Galerkin_Stabilized_Triangle_AD_btest_build_vera
[ 63%] Linking CXX executable AlgebraicEquationSet_Local_Galerkin_Stabilized_Triangle_AD_btest
[ 63%] Built target AlgebraicEquationSet_Local_Galerkin_Stabilized_Triangle_AD_btest_build
[ 63%] Building CXX object test/unit/Discretization/Galerkin/CMakeFiles/AlgebraicEquationSet_Local_Galerkin_Stabilized_Triangle_Euler_btest_OBJECT.dir/AlgebraicEquationSet_Local_Galerkin_Stabilized_Triangle_Euler_btest.cpp.o
[ 63%] Built target AlgebraicEquationSet_Local_Galerkin_Stabilized_Triangle_Euler_btest_OBJECT
[ 63%] Checking style of test/unit/Discretization/Galerkin/AlgebraicEquationSet_Local_Galerkin_Stabilized_Triangle_Euler_btest.cpp
[ 63%] Built target AlgebraicEquationSet_Local_Galerkin_Stabilized_Triangle_Euler_btest_build_vera
[ 63%] Linking CXX executable AlgebraicEquationSet_Local_Galerkin_Stabilized_Triangle_Euler_btest
[ 63%] Built target AlgebraicEquationSet_Local_Galerkin_Stabilized_Triangle_Euler_btest_build
[ 63%] Building CXX object test/unit/Discretization/Galerkin/CMakeFiles/AlgebraicEquationSet_ProjectFunction_btest_OBJECT.dir/AlgebraicEquationSet_ProjectFunction_btest.cpp.o
In file included from /usr/include/boost/config/header_deprecated.hpp:18,
                 from /usr/include/boost/test/output_test_stream.hpp:13,
                 from /jenkins/workspace/SANS_Nightly/builddir/undefined_gnu9/buildnode/reynolds/test/SANS_prefix_btest.h:51,
                 from /jenkins/workspace/SANS_Nightly/builddir/undefined_gnu9/buildnode/reynolds/build/undefined_gnu9/test/cotire/SANS_PREFIX_BTEST_CXX_prefix.cxx:4,
                 from /jenkins/workspace/SANS_Nightly/builddir/undefined_gnu9/buildnode/reynolds/build/undefined_gnu9/test/cotire/SANS_PREFIX_BTEST_CXX_prefix.hxx:4:
/usr/include/boost/test/output_test_stream.hpp:14:1: note: #pragma message: This header is deprecated. Use This header is deprecated. Please use <boost/test/tools/output_test_stream.hpp> instead. instead.
   14 | BOOST_HEADER_DEPRECATED( "This header is deprecated. Please use <boost/test/tools/output_test_stream.hpp> instead." )
      | ^~~~~~~~~~~~~~~~~~~~~~~
[ 63%] Built target AlgebraicEquationSet_ProjectFunction_btest_OBJECT
[ 63%] Checking style of test/unit/Discretization/Galerkin/AlgebraicEquationSet_ProjectFunction_btest.cpp
[ 63%] Built target AlgebraicEquationSet_ProjectFunction_btest_build_vera
[ 63%] Linking CXX executable AlgebraicEquationSet_ProjectFunction_btest
[ 63%] Built target AlgebraicEquationSet_ProjectFunction_btest_build
[ 63%] Building CXX object test/unit/Discretization/Galerkin/CMakeFiles/ElementIntegral_Galerkin_2D_Triangle_AD_btest_OBJECT.dir/ElementIntegral_Galerkin_2D_Triangle_AD_btest.cpp.o
[ 63%] Built target ElementIntegral_Galerkin_2D_Triangle_AD_btest_OBJECT
[ 63%] Checking style of test/unit/Discretization/Galerkin/ElementIntegral_Galerkin_2D_Triangle_AD_btest.cpp
[ 63%] Built target ElementIntegral_Galerkin_2D_Triangle_AD_btest_build_vera
[ 63%] Linking CXX executable ElementIntegral_Galerkin_2D_Triangle_AD_btest
[ 63%] Built target ElementIntegral_Galerkin_2D_Triangle_AD_btest_build
[ 63%] Building CXX object test/unit/Discretization/Galerkin/CMakeFiles/ExtractCGLocalBoundaries_btest_OBJECT.dir/ExtractCGLocalBoundaries_btest.cpp.o
[ 63%] Built target ExtractCGLocalBoundaries_btest_OBJECT
[ 63%] Checking style of test/unit/Discretization/Galerkin/ExtractCGLocalBoundaries_btest.cpp
[ 63%] Built target ExtractCGLocalBoundaries_btest_build_vera
[ 63%] Linking CXX executable ExtractCGLocalBoundaries_btest
[ 63%] Built target ExtractCGLocalBoundaries_btest_build
[ 63%] Building CXX object test/unit/Discretization/Galerkin/CMakeFiles/FunctionalBoundaryTrace_Dispatch_Galerkin_AD_btest_OBJECT.dir/FunctionalBoundaryTrace_Dispatch_Galerkin_AD_btest.cpp.o
[ 63%] Built target FunctionalBoundaryTrace_Dispatch_Galerkin_AD_btest_OBJECT
[ 63%] Checking style of test/unit/Discretization/Galerkin/FunctionalBoundaryTrace_Dispatch_Galerkin_AD_btest.cpp
[ 63%] Built target FunctionalBoundaryTrace_Dispatch_Galerkin_AD_btest_build_vera
[ 63%] Linking CXX executable FunctionalBoundaryTrace_Dispatch_Galerkin_AD_btest
[ 63%] Built target FunctionalBoundaryTrace_Dispatch_Galerkin_AD_btest_build
[ 63%] Building CXX object test/unit/Discretization/Galerkin/CMakeFiles/FunctionalBoundaryTrace_Galerkin_btest_OBJECT.dir/FunctionalBoundaryTrace_Galerkin_btest.cpp.o
[ 63%] Built target FunctionalBoundaryTrace_Galerkin_btest_OBJECT
[ 63%] Checking style of test/unit/Discretization/Galerkin/FunctionalBoundaryTrace_Galerkin_btest.cpp
[ 63%] Built target FunctionalBoundaryTrace_Galerkin_btest_build_vera
[ 63%] Linking CXX executable FunctionalBoundaryTrace_Galerkin_btest
[ 63%] Built target FunctionalBoundaryTrace_Galerkin_btest_build
[ 63%] Building CXX object test/unit/Discretization/Galerkin/CMakeFiles/FunctionalBoundaryTrace_WeightedResidual_Galerkin_btest_OBJECT.dir/FunctionalBoundaryTrace_WeightedResidual_Galerkin_btest.cpp.o
[ 63%] Built target FunctionalBoundaryTrace_WeightedResidual_Galerkin_btest_OBJECT
[ 63%] Checking style of test/unit/Discretization/Galerkin/FunctionalBoundaryTrace_WeightedResidual_Galerkin_btest.cpp
[ 63%] Built target FunctionalBoundaryTrace_WeightedResidual_Galerkin_btest_build_vera
[ 63%] Linking CXX executable FunctionalBoundaryTrace_WeightedResidual_Galerkin_btest
[ 63%] Built target FunctionalBoundaryTrace_WeightedResidual_Galerkin_btest_build
[ 63%] Building CXX object test/unit/Discretization/Galerkin/CMakeFiles/FunctionalCell_Galerkin_btest_OBJECT.dir/FunctionalCell_Galerkin_btest.cpp.o
[ 63%] Built target FunctionalCell_Galerkin_btest_OBJECT
[ 63%] Checking style of test/unit/Discretization/Galerkin/FunctionalCell_Galerkin_btest.cpp
[ 63%] Built target FunctionalCell_Galerkin_btest_build_vera
[ 63%] Linking CXX executable FunctionalCell_Galerkin_btest
[ 63%] Built target FunctionalCell_Galerkin_btest_build
[ 63%] Building CXX object test/unit/Discretization/Galerkin/CMakeFiles/IntegrandBoundaryTrace_Dirichlet_Galerkin_HSM2D_btest_OBJECT.dir/IntegrandBoundaryTrace_Dirichlet_Galerkin_HSM2D_btest.cpp.o
[ 63%] Built target IntegrandBoundaryTrace_Dirichlet_Galerkin_HSM2D_btest_OBJECT
[ 63%] Checking style of test/unit/Discretization/Galerkin/IntegrandBoundaryTrace_Dirichlet_Galerkin_HSM2D_btest.cpp
[ 63%] Built target IntegrandBoundaryTrace_Dirichlet_Galerkin_HSM2D_btest_build_vera
[ 63%] Linking CXX executable IntegrandBoundaryTrace_Dirichlet_Galerkin_HSM2D_btest
[ 63%] Built target IntegrandBoundaryTrace_Dirichlet_Galerkin_HSM2D_btest_build
[ 63%] Building CXX object test/unit/Discretization/Galerkin/CMakeFiles/IntegrandBoundaryTrace_Dirichlet_mitLG_Galerkin_AD_btest_OBJECT.dir/IntegrandBoundaryTrace_Dirichlet_mitLG_Galerkin_AD_btest.cpp.o
[ 63%] Built target IntegrandBoundaryTrace_Dirichlet_mitLG_Galerkin_AD_btest_OBJECT
[ 63%] Checking style of test/unit/Discretization/Galerkin/IntegrandBoundaryTrace_Dirichlet_mitLG_Galerkin_AD_btest.cpp
[ 63%] Built target IntegrandBoundaryTrace_Dirichlet_mitLG_Galerkin_AD_btest_build_vera
[ 63%] Linking CXX executable IntegrandBoundaryTrace_Dirichlet_mitLG_Galerkin_AD_btest
[ 63%] Built target IntegrandBoundaryTrace_Dirichlet_mitLG_Galerkin_AD_btest_build
[ 63%] Building CXX object test/unit/Discretization/Galerkin/CMakeFiles/IntegrandBoundaryTrace_Dirichlet_mitLG_Galerkin_Euler_btest_OBJECT.dir/IntegrandBoundaryTrace_Dirichlet_mitLG_Galerkin_Euler_btest.cpp.o
[ 63%] Built target IntegrandBoundaryTrace_Dirichlet_mitLG_Galerkin_Euler_btest_OBJECT
[ 63%] Checking style of test/unit/Discretization/Galerkin/IntegrandBoundaryTrace_Dirichlet_mitLG_Galerkin_Euler_btest.cpp
[ 63%] Built target IntegrandBoundaryTrace_Dirichlet_mitLG_Galerkin_Euler_btest_build_vera
[ 63%] Linking CXX executable IntegrandBoundaryTrace_Dirichlet_mitLG_Galerkin_Euler_btest
[ 63%] Built target IntegrandBoundaryTrace_Dirichlet_mitLG_Galerkin_Euler_btest_build
[ 63%] Building CXX object test/unit/Discretization/Galerkin/CMakeFiles/IntegrandBoundaryTrace_Dirichlet_mitState_Galerkin_Euler_btest_OBJECT.dir/IntegrandBoundaryTrace_Dirichlet_mitState_Galerkin_Euler_btest.cpp.o
[ 63%] Built target IntegrandBoundaryTrace_Dirichlet_mitState_Galerkin_Euler_btest_OBJECT
[ 63%] Checking style of test/unit/Discretization/Galerkin/IntegrandBoundaryTrace_Dirichlet_mitState_Galerkin_Euler_btest.cpp
[ 63%] Built target IntegrandBoundaryTrace_Dirichlet_mitState_Galerkin_Euler_btest_build_vera
[ 63%] Linking CXX executable IntegrandBoundaryTrace_Dirichlet_mitState_Galerkin_Euler_btest
[ 63%] Built target IntegrandBoundaryTrace_Dirichlet_mitState_Galerkin_Euler_btest_build
[ 63%] Building CXX object test/unit/Discretization/Galerkin/CMakeFiles/IntegrandBoundaryTrace_Dirichlet_sansLG_Galerkin_Euler_btest_OBJECT.dir/IntegrandBoundaryTrace_Dirichlet_sansLG_Galerkin_Euler_btest.cpp.o
[ 63%] Built target IntegrandBoundaryTrace_Dirichlet_sansLG_Galerkin_Euler_btest_OBJECT
[ 63%] Checking style of test/unit/Discretization/Galerkin/IntegrandBoundaryTrace_Dirichlet_sansLG_Galerkin_Euler_btest.cpp
[ 63%] Built target IntegrandBoundaryTrace_Dirichlet_sansLG_Galerkin_Euler_btest_build_vera
[ 63%] Linking CXX executable IntegrandBoundaryTrace_Dirichlet_sansLG_Galerkin_Euler_btest
[ 63%] Built target IntegrandBoundaryTrace_Dirichlet_sansLG_Galerkin_Euler_btest_build
[ 63%] Building CXX object test/unit/Discretization/Galerkin/CMakeFiles/IntegrandBoundaryTrace_Flux_mitState_Nitsche_AD_btest_OBJECT.dir/IntegrandBoundaryTrace_Flux_mitState_Nitsche_AD_btest.cpp.o
[ 63%] Built target IntegrandBoundaryTrace_Flux_mitState_Nitsche_AD_btest_OBJECT
[ 63%] Checking style of test/unit/Discretization/Galerkin/IntegrandBoundaryTrace_Flux_mitState_Nitsche_AD_btest.cpp
[ 63%] Built target IntegrandBoundaryTrace_Flux_mitState_Nitsche_AD_btest_build_vera
[ 63%] Linking CXX executable IntegrandBoundaryTrace_Flux_mitState_Nitsche_AD_btest
[ 63%] Built target IntegrandBoundaryTrace_Flux_mitState_Nitsche_AD_btest_build
[ 63%] Building CXX object test/unit/Discretization/Galerkin/CMakeFiles/IntegrandBoundaryTrace_LinearScalar_mitLG_Galerkin_AD_btest_OBJECT.dir/IntegrandBoundaryTrace_LinearScalar_mitLG_Galerkin_AD_btest.cpp.o
[ 63%] Built target IntegrandBoundaryTrace_LinearScalar_mitLG_Galerkin_AD_btest_OBJECT
[ 63%] Checking style of test/unit/Discretization/Galerkin/IntegrandBoundaryTrace_LinearScalar_mitLG_Galerkin_AD_btest.cpp
[ 63%] Built target IntegrandBoundaryTrace_LinearScalar_mitLG_Galerkin_AD_btest_build_vera
[ 63%] Linking CXX executable IntegrandBoundaryTrace_LinearScalar_mitLG_Galerkin_AD_btest
[ 63%] Built target IntegrandBoundaryTrace_LinearScalar_mitLG_Galerkin_AD_btest_build
[ 63%] Building CXX object test/unit/Discretization/Galerkin/CMakeFiles/IntegrandBoundaryTrace_LinearScalar_sansLG_Galerkin_AD_btest_OBJECT.dir/IntegrandBoundaryTrace_LinearScalar_sansLG_Galerkin_AD_btest.cpp.o
[ 63%] Built target IntegrandBoundaryTrace_LinearScalar_sansLG_Galerkin_AD_btest_OBJECT
[ 63%] Checking style of test/unit/Discretization/Galerkin/IntegrandBoundaryTrace_LinearScalar_sansLG_Galerkin_AD_btest.cpp
[ 63%] Built target IntegrandBoundaryTrace_LinearScalar_sansLG_Galerkin_AD_btest_build_vera
[ 63%] Linking CXX executable IntegrandBoundaryTrace_LinearScalar_sansLG_Galerkin_AD_btest
[ 63%] Built target IntegrandBoundaryTrace_LinearScalar_sansLG_Galerkin_AD_btest_build
[ 63%] Building CXX object test/unit/Discretization/Galerkin/CMakeFiles/IntegrandBoundaryTrace_None_Galerkin_AD_btest_OBJECT.dir/IntegrandBoundaryTrace_None_Galerkin_AD_btest.cpp.o
[ 63%] Built target IntegrandBoundaryTrace_None_Galerkin_AD_btest_OBJECT
[ 63%] Checking style of test/unit/Discretization/Galerkin/IntegrandBoundaryTrace_None_Galerkin_AD_btest.cpp
[ 63%] Built target IntegrandBoundaryTrace_None_Galerkin_AD_btest_build_vera
[ 63%] Linking CXX executable IntegrandBoundaryTrace_None_Galerkin_AD_btest
[ 63%] Built target IntegrandBoundaryTrace_None_Galerkin_AD_btest_build
[ 63%] Building CXX object test/unit/Discretization/Galerkin/CMakeFiles/IntegrandBoundaryTrace_Output_Galerkin_btest_OBJECT.dir/IntegrandBoundaryTrace_Output_Galerkin_btest.cpp.o
[ 63%] Built target IntegrandBoundaryTrace_Output_Galerkin_btest_OBJECT
[ 63%] Checking style of test/unit/Discretization/Galerkin/IntegrandBoundaryTrace_Output_Galerkin_btest.cpp
[ 63%] Built target IntegrandBoundaryTrace_Output_Galerkin_btest_build_vera
[ 63%] Linking CXX executable IntegrandBoundaryTrace_Output_Galerkin_btest
[ 63%] Built target IntegrandBoundaryTrace_Output_Galerkin_btest_build
[ 63%] Building CXX object test/unit/Discretization/Galerkin/CMakeFiles/IntegrandBoundaryTrace_Robin_sansLG_Galerkin_IncNS_btest_OBJECT.dir/IntegrandBoundaryTrace_Robin_sansLG_Galerkin_IncNS_btest.cpp.o
[ 63%] Built target IntegrandBoundaryTrace_Robin_sansLG_Galerkin_IncNS_btest_OBJECT
[ 63%] Checking style of test/unit/Discretization/Galerkin/IntegrandBoundaryTrace_Robin_sansLG_Galerkin_IncNS_btest.cpp
[ 63%] Built target IntegrandBoundaryTrace_Robin_sansLG_Galerkin_IncNS_btest_build_vera
[ 63%] Linking CXX executable IntegrandBoundaryTrace_Robin_sansLG_Galerkin_IncNS_btest
[ 63%] Built target IntegrandBoundaryTrace_Robin_sansLG_Galerkin_IncNS_btest_build
[ 63%] Building CXX object test/unit/Discretization/Galerkin/CMakeFiles/IntegrandBoundaryTrace_Robin_sansLG_Galerkin_IncRANSSA_btest_OBJECT.dir/IntegrandBoundaryTrace_Robin_sansLG_Galerkin_IncRANSSA_btest.cpp.o
[ 63%] Built target IntegrandBoundaryTrace_Robin_sansLG_Galerkin_IncRANSSA_btest_OBJECT
[ 63%] Checking style of test/unit/Discretization/Galerkin/IntegrandBoundaryTrace_Robin_sansLG_Galerkin_IncRANSSA_btest.cpp
[ 63%] Built target IntegrandBoundaryTrace_Robin_sansLG_Galerkin_IncRANSSA_btest_build_vera
[ 63%] Linking CXX executable IntegrandBoundaryTrace_Robin_sansLG_Galerkin_IncRANSSA_btest
[ 63%] Built target IntegrandBoundaryTrace_Robin_sansLG_Galerkin_IncRANSSA_btest_build
[ 63%] Building CXX object test/unit/Discretization/Galerkin/CMakeFiles/IntegrandCell_Galerkin_AD_btest_OBJECT.dir/IntegrandCell_Galerkin_AD_btest.cpp.o
[ 63%] Built target IntegrandCell_Galerkin_AD_btest_OBJECT
[ 63%] Checking style of test/unit/Discretization/Galerkin/IntegrandCell_Galerkin_AD_btest.cpp
[ 63%] Built target IntegrandCell_Galerkin_AD_btest_build_vera
[ 63%] Linking CXX executable IntegrandCell_Galerkin_AD_btest
[ 63%] Built target IntegrandCell_Galerkin_AD_btest_build
[ 63%] Building CXX object test/unit/Discretization/Galerkin/CMakeFiles/IntegrandCell_Galerkin_BDF_AD_btest_OBJECT.dir/IntegrandCell_Galerkin_BDF_AD_btest.cpp.o
[ 63%] Built target IntegrandCell_Galerkin_BDF_AD_btest_OBJECT
[ 63%] Checking style of test/unit/Discretization/Galerkin/IntegrandCell_Galerkin_BDF_AD_btest.cpp
[ 63%] Built target IntegrandCell_Galerkin_BDF_AD_btest_build_vera
[ 63%] Linking CXX executable IntegrandCell_Galerkin_BDF_AD_btest
[ 63%] Built target IntegrandCell_Galerkin_BDF_AD_btest_build
[ 63%] Building CXX object test/unit/Discretization/Galerkin/CMakeFiles/IntegrandCell_Galerkin_CR_btest_OBJECT.dir/IntegrandCell_Galerkin_CR_btest.cpp.o
[ 63%] Built target IntegrandCell_Galerkin_CR_btest_OBJECT
[ 63%] Checking style of test/unit/Discretization/Galerkin/IntegrandCell_Galerkin_CR_btest.cpp
[ 63%] Built target IntegrandCell_Galerkin_CR_btest_build_vera
[ 63%] Linking CXX executable IntegrandCell_Galerkin_CR_btest
[ 63%] Built target IntegrandCell_Galerkin_CR_btest_build
[ 63%] Building CXX object test/unit/Discretization/Galerkin/CMakeFiles/IntegrandCell_Galerkin_Conservative_btest_OBJECT.dir/IntegrandCell_Galerkin_Conservative_btest.cpp.o
[ 63%] Built target IntegrandCell_Galerkin_Conservative_btest_OBJECT
[ 63%] Checking style of test/unit/Discretization/Galerkin/IntegrandCell_Galerkin_Conservative_btest.cpp
[ 63%] Built target IntegrandCell_Galerkin_Conservative_btest_build_vera
[ 63%] Linking CXX executable IntegrandCell_Galerkin_Conservative_btest
[ 63%] Built target IntegrandCell_Galerkin_Conservative_btest_build
[ 63%] Building CXX object test/unit/Discretization/Galerkin/CMakeFiles/IntegrandCell_Galerkin_HB_AD_btest_OBJECT.dir/IntegrandCell_Galerkin_HB_AD_btest.cpp.o
[ 63%] Built target IntegrandCell_Galerkin_HB_AD_btest_OBJECT
[ 63%] Checking style of test/unit/Discretization/Galerkin/IntegrandCell_Galerkin_HB_AD_btest.cpp
[ 63%] Built target IntegrandCell_Galerkin_HB_AD_btest_build_vera
[ 63%] Linking CXX executable IntegrandCell_Galerkin_HB_AD_btest
[ 63%] Built target IntegrandCell_Galerkin_HB_AD_btest_build
[ 63%] Building CXX object test/unit/Discretization/Galerkin/CMakeFiles/IntegrandCell_Galerkin_HSM2D_btest_OBJECT.dir/IntegrandCell_Galerkin_HSM2D_btest.cpp.o
[ 63%] Built target IntegrandCell_Galerkin_HSM2D_btest_OBJECT
[ 63%] Checking style of test/unit/Discretization/Galerkin/IntegrandCell_Galerkin_HSM2D_btest.cpp
[ 63%] Built target IntegrandCell_Galerkin_HSM2D_btest_build_vera
[ 63%] Linking CXX executable IntegrandCell_Galerkin_HSM2D_btest
[ 63%] Built target IntegrandCell_Galerkin_HSM2D_btest_build
[ 63%] Building CXX object test/unit/Discretization/Galerkin/CMakeFiles/IntegrandCell_Galerkin_HSMKL_btest_OBJECT.dir/IntegrandCell_Galerkin_HSMKL_btest.cpp.o
[ 63%] Built target IntegrandCell_Galerkin_HSMKL_btest_OBJECT
[ 63%] Checking style of test/unit/Discretization/Galerkin/IntegrandCell_Galerkin_HSMKL_btest.cpp
[ 63%] Built target IntegrandCell_Galerkin_HSMKL_btest_build_vera
[ 63%] Linking CXX executable IntegrandCell_Galerkin_HSMKL_btest
[ 63%] Built target IntegrandCell_Galerkin_HSMKL_btest_build
[ 63%] Building CXX object test/unit/Discretization/Galerkin/CMakeFiles/IntegrandCell_Galerkin_IRS_AD_btest_OBJECT.dir/IntegrandCell_Galerkin_IRS_AD_btest.cpp.o
[ 63%] Built target IntegrandCell_Galerkin_IRS_AD_btest_OBJECT
[ 63%] Checking style of test/unit/Discretization/Galerkin/IntegrandCell_Galerkin_IRS_AD_btest.cpp
[ 63%] Built target IntegrandCell_Galerkin_IRS_AD_btest_build_vera
[ 63%] Linking CXX executable IntegrandCell_Galerkin_IRS_AD_btest
[ 63%] Built target IntegrandCell_Galerkin_IRS_AD_btest_build
[ 63%] Building CXX object test/unit/Discretization/Galerkin/CMakeFiles/IntegrandCell_Galerkin_Output_AD_btest_OBJECT.dir/IntegrandCell_Galerkin_Output_AD_btest.cpp.o
[ 63%] Built target IntegrandCell_Galerkin_Output_AD_btest_OBJECT
[ 63%] Checking style of test/unit/Discretization/Galerkin/IntegrandCell_Galerkin_Output_AD_btest.cpp
[ 63%] Built target IntegrandCell_Galerkin_Output_AD_btest_build_vera
[ 63%] Linking CXX executable IntegrandCell_Galerkin_Output_AD_btest
[ 63%] Built target IntegrandCell_Galerkin_Output_AD_btest_build
[ 63%] Building CXX object test/unit/Discretization/Galerkin/CMakeFiles/IntegrandCell_Galerkin_Output_Stabilized_AD_btest_OBJECT.dir/IntegrandCell_Galerkin_Output_Stabilized_AD_btest.cpp.o
[ 63%] Built target IntegrandCell_Galerkin_Output_Stabilized_AD_btest_OBJECT
[ 63%] Checking style of test/unit/Discretization/Galerkin/IntegrandCell_Galerkin_Output_Stabilized_AD_btest.cpp
[ 63%] Built target IntegrandCell_Galerkin_Output_Stabilized_AD_btest_build_vera
[ 63%] Linking CXX executable IntegrandCell_Galerkin_Output_Stabilized_AD_btest
[ 63%] Built target IntegrandCell_Galerkin_Output_Stabilized_AD_btest_build
[ 63%] Building CXX object test/unit/Discretization/Galerkin/CMakeFiles/IntegrandCell_Galerkin_PTC_AD_btest_OBJECT.dir/IntegrandCell_Galerkin_PTC_AD_btest.cpp.o
[ 63%] Built target IntegrandCell_Galerkin_PTC_AD_btest_OBJECT
[ 63%] Checking style of test/unit/Discretization/Galerkin/IntegrandCell_Galerkin_PTC_AD_btest.cpp
[ 63%] Built target IntegrandCell_Galerkin_PTC_AD_btest_build_vera
[ 63%] Linking CXX executable IntegrandCell_Galerkin_PTC_AD_btest
[ 63%] Built target IntegrandCell_Galerkin_PTC_AD_btest_build
[ 63%] Building CXX object test/unit/Discretization/Galerkin/CMakeFiles/IntegrandCell_Galerkin_ShallowWater1D_btest_OBJECT.dir/IntegrandCell_Galerkin_ShallowWater1D_btest.cpp.o
[ 63%] Built target IntegrandCell_Galerkin_ShallowWater1D_btest_OBJECT
[ 63%] Checking style of test/unit/Discretization/Galerkin/IntegrandCell_Galerkin_ShallowWater1D_btest.cpp
[ 63%] Built target IntegrandCell_Galerkin_ShallowWater1D_btest_build_vera
[ 63%] Linking CXX executable IntegrandCell_Galerkin_ShallowWater1D_btest
[ 63%] Built target IntegrandCell_Galerkin_ShallowWater1D_btest_build
[ 63%] Building CXX object test/unit/Discretization/Galerkin/CMakeFiles/IntegrandCell_Galerkin_Stabilized_AD_btest_OBJECT.dir/IntegrandCell_Galerkin_Stabilized_AD_btest.cpp.o
[ 63%] Built target IntegrandCell_Galerkin_Stabilized_AD_btest_OBJECT
[ 63%] Checking style of test/unit/Discretization/Galerkin/IntegrandCell_Galerkin_Stabilized_AD_btest.cpp
[ 63%] Built target IntegrandCell_Galerkin_Stabilized_AD_btest_build_vera
[ 63%] Linking CXX executable IntegrandCell_Galerkin_Stabilized_AD_btest
[ 63%] Built target IntegrandCell_Galerkin_Stabilized_AD_btest_build
[ 63%] Building CXX object test/unit/Discretization/Galerkin/CMakeFiles/IntegrandCell_Galerkin_Stabilized_Corrected_AD_btest_OBJECT.dir/IntegrandCell_Galerkin_Stabilized_Corrected_AD_btest.cpp.o
[ 63%] Built target IntegrandCell_Galerkin_Stabilized_Corrected_AD_btest_OBJECT
[ 63%] Checking style of test/unit/Discretization/Galerkin/IntegrandCell_Galerkin_Stabilized_Corrected_AD_btest.cpp
[ 63%] Built target IntegrandCell_Galerkin_Stabilized_Corrected_AD_btest_build_vera
[ 63%] Linking CXX executable IntegrandCell_Galerkin_Stabilized_Corrected_AD_btest
[ 63%] Built target IntegrandCell_Galerkin_Stabilized_Corrected_AD_btest_build
[ 63%] Building CXX object test/unit/Discretization/Galerkin/CMakeFiles/IntegrandCell_Galerkin_Stabilized_NS_btest_OBJECT.dir/IntegrandCell_Galerkin_Stabilized_NS_btest.cpp.o
[ 63%] Built target IntegrandCell_Galerkin_Stabilized_NS_btest_OBJECT
[ 63%] Checking style of test/unit/Discretization/Galerkin/IntegrandCell_Galerkin_Stabilized_NS_btest.cpp
[ 63%] Built target IntegrandCell_Galerkin_Stabilized_NS_btest_build_vera
[ 63%] Linking CXX executable IntegrandCell_Galerkin_Stabilized_NS_btest
[ 63%] Built target IntegrandCell_Galerkin_Stabilized_NS_btest_build
[ 63%] Building CXX object test/unit/Discretization/Galerkin/CMakeFiles/IntegrandCell_Galerkin_StrongForm_AD_btest_OBJECT.dir/IntegrandCell_Galerkin_StrongForm_AD_btest.cpp.o
[ 63%] Built target IntegrandCell_Galerkin_StrongForm_AD_btest_OBJECT
[ 63%] Checking style of test/unit/Discretization/Galerkin/IntegrandCell_Galerkin_StrongForm_AD_btest.cpp
[ 63%] Built target IntegrandCell_Galerkin_StrongForm_AD_btest_build_vera
[ 63%] Linking CXX executable IntegrandCell_Galerkin_StrongForm_AD_btest
[ 63%] Built target IntegrandCell_Galerkin_StrongForm_AD_btest_build
[ 63%] Building CXX object test/unit/Discretization/Galerkin/CMakeFiles/IntegrandCell_ProjectFunction_btest_OBJECT.dir/IntegrandCell_ProjectFunction_btest.cpp.o
[ 63%] Built target IntegrandCell_ProjectFunction_btest_OBJECT
[ 63%] Checking style of test/unit/Discretization/Galerkin/IntegrandCell_ProjectFunction_btest.cpp
[ 63%] Built target IntegrandCell_ProjectFunction_btest_build_vera
[ 63%] Linking CXX executable IntegrandCell_ProjectFunction_btest
[ 63%] Built target IntegrandCell_ProjectFunction_btest_build
[ 63%] Building CXX object test/unit/Discretization/Galerkin/CMakeFiles/IntegrandCell_Project_btest_OBJECT.dir/IntegrandCell_Project_btest.cpp.o
[ 63%] Built target IntegrandCell_Project_btest_OBJECT
[ 63%] Checking style of test/unit/Discretization/Galerkin/IntegrandCell_Project_btest.cpp
[ 63%] Built target IntegrandCell_Project_btest_build_vera
[ 63%] Linking CXX executable IntegrandCell_Project_btest
[ 63%] Built target IntegrandCell_Project_btest_build
[ 63%] Building CXX object test/unit/Discretization/Galerkin/CMakeFiles/IntegrandInteriorTrace_Galerkin_AD_btest_OBJECT.dir/IntegrandInteriorTrace_Galerkin_AD_btest.cpp.o
[ 63%] Built target IntegrandInteriorTrace_Galerkin_AD_btest_OBJECT
[ 63%] Checking style of test/unit/Discretization/Galerkin/IntegrandInteriorTrace_Galerkin_AD_btest.cpp
[ 63%] Built target IntegrandInteriorTrace_Galerkin_AD_btest_build_vera
[ 63%] Linking CXX executable IntegrandInteriorTrace_Galerkin_AD_btest
[ 63%] Built target IntegrandInteriorTrace_Galerkin_AD_btest_build
[ 63%] Building CXX object test/unit/Discretization/Galerkin/CMakeFiles/IntegrandInteriorTrace_Galerkin_CR_btest_OBJECT.dir/IntegrandInteriorTrace_Galerkin_CR_btest.cpp.o
[ 63%] Built target IntegrandInteriorTrace_Galerkin_CR_btest_OBJECT
[ 63%] Checking style of test/unit/Discretization/Galerkin/IntegrandInteriorTrace_Galerkin_CR_btest.cpp
[ 63%] Built target IntegrandInteriorTrace_Galerkin_CR_btest_build_vera
[ 63%] Linking CXX executable IntegrandInteriorTrace_Galerkin_CR_btest
[ 63%] Built target IntegrandInteriorTrace_Galerkin_CR_btest_build
[ 63%] Building CXX object test/unit/Discretization/Galerkin/CMakeFiles/IntegrandInteriorTrace_Galerkin_StrongForm_AD_btest_OBJECT.dir/IntegrandInteriorTrace_Galerkin_StrongForm_AD_btest.cpp.o
[ 63%] Built target IntegrandInteriorTrace_Galerkin_StrongForm_AD_btest_OBJECT
[ 63%] Checking style of test/unit/Discretization/Galerkin/IntegrandInteriorTrace_Galerkin_StrongForm_AD_btest.cpp
[ 63%] Built target IntegrandInteriorTrace_Galerkin_StrongForm_AD_btest_build_vera
[ 63%] Linking CXX executable IntegrandInteriorTrace_Galerkin_StrongForm_AD_btest
[ 63%] Built target IntegrandInteriorTrace_Galerkin_StrongForm_AD_btest_build
[ 63%] Building CXX object test/unit/Discretization/Galerkin/CMakeFiles/IntegrandInteriorTrace_SIP_Galerkin_AD_btest_OBJECT.dir/IntegrandInteriorTrace_SIP_Galerkin_AD_btest.cpp.o
[ 63%] Built target IntegrandInteriorTrace_SIP_Galerkin_AD_btest_OBJECT
[ 65%] Checking style of test/unit/Discretization/Galerkin/IntegrandInteriorTrace_SIP_Galerkin_AD_btest.cpp
[ 65%] Built target IntegrandInteriorTrace_SIP_Galerkin_AD_btest_build_vera
[ 65%] Linking CXX executable IntegrandInteriorTrace_SIP_Galerkin_AD_btest
[ 65%] Built target IntegrandInteriorTrace_SIP_Galerkin_AD_btest_build
[ 65%] Building CXX object test/unit/Discretization/Galerkin/CMakeFiles/IntegrateBoundaryTrace_Dispatch_Galerkin_AD_1D_btest_OBJECT.dir/IntegrateBoundaryTrace_Dispatch_Galerkin_AD_1D_btest.cpp.o
[ 65%] Built target IntegrateBoundaryTrace_Dispatch_Galerkin_AD_1D_btest_OBJECT
[ 65%] Checking style of test/unit/Discretization/Galerkin/IntegrateBoundaryTrace_Dispatch_Galerkin_AD_1D_btest.cpp
[ 65%] Built target IntegrateBoundaryTrace_Dispatch_Galerkin_AD_1D_btest_build_vera
[ 65%] Linking CXX executable IntegrateBoundaryTrace_Dispatch_Galerkin_AD_1D_btest
[ 65%] Built target IntegrateBoundaryTrace_Dispatch_Galerkin_AD_1D_btest_build
[ 65%] Building CXX object test/unit/Discretization/Galerkin/CMakeFiles/JacobianBoundaryTrace_Dirichlet_mitLG_Galerkin_AD_btest_OBJECT.dir/JacobianBoundaryTrace_Dirichlet_mitLG_Galerkin_AD_btest.cpp.o
[ 65%] Built target JacobianBoundaryTrace_Dirichlet_mitLG_Galerkin_AD_btest_OBJECT
[ 65%] Checking style of test/unit/Discretization/Galerkin/JacobianBoundaryTrace_Dirichlet_mitLG_Galerkin_AD_btest.cpp
[ 65%] Built target JacobianBoundaryTrace_Dirichlet_mitLG_Galerkin_AD_btest_build_vera
[ 65%] Linking CXX executable JacobianBoundaryTrace_Dirichlet_mitLG_Galerkin_AD_btest
[ 65%] Built target JacobianBoundaryTrace_Dirichlet_mitLG_Galerkin_AD_btest_build
[ 65%] Building CXX object test/unit/Discretization/Galerkin/CMakeFiles/JacobianBoundaryTrace_LinearScalar_mitLG_Galerkin_AD_btest_OBJECT.dir/JacobianBoundaryTrace_LinearScalar_mitLG_Galerkin_AD_btest.cpp.o
[ 65%] Built target JacobianBoundaryTrace_LinearScalar_mitLG_Galerkin_AD_btest_OBJECT
[ 65%] Checking style of test/unit/Discretization/Galerkin/JacobianBoundaryTrace_LinearScalar_mitLG_Galerkin_AD_btest.cpp
[ 65%] Built target JacobianBoundaryTrace_LinearScalar_mitLG_Galerkin_AD_btest_build_vera
[ 65%] Linking CXX executable JacobianBoundaryTrace_LinearScalar_mitLG_Galerkin_AD_btest
[ 65%] Built target JacobianBoundaryTrace_LinearScalar_mitLG_Galerkin_AD_btest_build
[ 65%] Building CXX object test/unit/Discretization/Galerkin/CMakeFiles/JacobianBoundaryTrace_LinearScalar_sansLG_Galerkin_AD_btest_OBJECT.dir/JacobianBoundaryTrace_LinearScalar_sansLG_Galerkin_AD_btest.cpp.o
[ 65%] Built target JacobianBoundaryTrace_LinearScalar_sansLG_Galerkin_AD_btest_OBJECT
[ 65%] Checking style of test/unit/Discretization/Galerkin/JacobianBoundaryTrace_LinearScalar_sansLG_Galerkin_AD_btest.cpp
[ 65%] Built target JacobianBoundaryTrace_LinearScalar_sansLG_Galerkin_AD_btest_build_vera
[ 65%] Linking CXX executable JacobianBoundaryTrace_LinearScalar_sansLG_Galerkin_AD_btest
[ 65%] Built target JacobianBoundaryTrace_LinearScalar_sansLG_Galerkin_AD_btest_build
[ 65%] Building CXX object test/unit/Discretization/Galerkin/CMakeFiles/JacobianCell_Galerkin_AD_ArtificialViscosity_btest_OBJECT.dir/JacobianCell_Galerkin_AD_ArtificialViscosity_btest.cpp.o
In file included from /jenkins/workspace/SANS_Nightly/builddir/undefined_gnu9/buildnode/reynolds/test/unit/Discretization/Galerkin/JacobianCell_Galerkin_AD_ArtificialViscosity_btest.cpp:16:
/jenkins/workspace/SANS_Nightly/builddir/undefined_gnu9/buildnode/reynolds/src/pde/AdvectionDiffusion/PDEAdvectionDiffusion_ArtificialViscosity2D.h:34:46: note: #pragma message: #undef USE_GRID_LAPLACIAN
   34 | #pragma message( "#undef USE_GRID_LAPLACIAN" )
      |                                              ^
[ 65%] Built target JacobianCell_Galerkin_AD_ArtificialViscosity_btest_OBJECT
[ 65%] Checking style of test/unit/Discretization/Galerkin/JacobianCell_Galerkin_AD_ArtificialViscosity_btest.cpp
[ 65%] Built target JacobianCell_Galerkin_AD_ArtificialViscosity_btest_build_vera
[ 65%] Linking CXX executable JacobianCell_Galerkin_AD_ArtificialViscosity_btest
[ 65%] Built target JacobianCell_Galerkin_AD_ArtificialViscosity_btest_build
[ 65%] Building CXX object test/unit/Discretization/Galerkin/CMakeFiles/JacobianCell_Galerkin_AD_btest_OBJECT.dir/JacobianCell_Galerkin_AD_btest.cpp.o
[ 65%] Built target JacobianCell_Galerkin_AD_btest_OBJECT
[ 65%] Checking style of test/unit/Discretization/Galerkin/JacobianCell_Galerkin_AD_btest.cpp
[ 65%] Built target JacobianCell_Galerkin_AD_btest_build_vera
[ 65%] Linking CXX executable JacobianCell_Galerkin_AD_btest
[ 65%] Built target JacobianCell_Galerkin_AD_btest_build
[ 65%] Building CXX object test/unit/Discretization/Galerkin/CMakeFiles/JacobianCell_Galerkin_BDF_AD_btest_OBJECT.dir/JacobianCell_Galerkin_BDF_AD_btest.cpp.o
[ 65%] Built target JacobianCell_Galerkin_BDF_AD_btest_OBJECT
[ 65%] Checking style of test/unit/Discretization/Galerkin/JacobianCell_Galerkin_BDF_AD_btest.cpp
[ 65%] Built target JacobianCell_Galerkin_BDF_AD_btest_build_vera
[ 65%] Linking CXX executable JacobianCell_Galerkin_BDF_AD_btest
[ 65%] Built target JacobianCell_Galerkin_BDF_AD_btest_build
[ 65%] Building CXX object test/unit/Discretization/Galerkin/CMakeFiles/JacobianCell_Galerkin_CR_btest_OBJECT.dir/JacobianCell_Galerkin_CR_btest.cpp.o
[ 65%] Built target JacobianCell_Galerkin_CR_btest_OBJECT
[ 65%] Checking style of test/unit/Discretization/Galerkin/JacobianCell_Galerkin_CR_btest.cpp
[ 65%] Built target JacobianCell_Galerkin_CR_btest_build_vera
[ 65%] Linking CXX executable JacobianCell_Galerkin_CR_btest
[ 65%] Built target JacobianCell_Galerkin_CR_btest_build
[ 65%] Building CXX object test/unit/Discretization/Galerkin/CMakeFiles/JacobianCell_Galerkin_IRS_AD_btest_OBJECT.dir/JacobianCell_Galerkin_IRS_AD_btest.cpp.o
[ 65%] Built target JacobianCell_Galerkin_IRS_AD_btest_OBJECT
[ 65%] Checking style of test/unit/Discretization/Galerkin/JacobianCell_Galerkin_IRS_AD_btest.cpp
[ 65%] Built target JacobianCell_Galerkin_IRS_AD_btest_build_vera
[ 65%] Linking CXX executable JacobianCell_Galerkin_IRS_AD_btest
[ 65%] Built target JacobianCell_Galerkin_IRS_AD_btest_build
[ 65%] Building CXX object test/unit/Discretization/Galerkin/CMakeFiles/JacobianCell_Galerkin_PTC_AD_btest_OBJECT.dir/JacobianCell_Galerkin_PTC_AD_btest.cpp.o
[ 65%] Built target JacobianCell_Galerkin_PTC_AD_btest_OBJECT
[ 65%] Checking style of test/unit/Discretization/Galerkin/JacobianCell_Galerkin_PTC_AD_btest.cpp
[ 65%] Built target JacobianCell_Galerkin_PTC_AD_btest_build_vera
[ 65%] Linking CXX executable JacobianCell_Galerkin_PTC_AD_btest
[ 65%] Built target JacobianCell_Galerkin_PTC_AD_btest_build
[ 65%] Building CXX object test/unit/Discretization/Galerkin/CMakeFiles/JacobianCell_Galerkin_Stabilized_AD_btest_OBJECT.dir/JacobianCell_Galerkin_Stabilized_AD_btest.cpp.o
[ 65%] Built target JacobianCell_Galerkin_Stabilized_AD_btest_OBJECT
[ 65%] Checking style of test/unit/Discretization/Galerkin/JacobianCell_Galerkin_Stabilized_AD_btest.cpp
[ 65%] Built target JacobianCell_Galerkin_Stabilized_AD_btest_build_vera
[ 65%] Linking CXX executable JacobianCell_Galerkin_Stabilized_AD_btest
[ 65%] Built target JacobianCell_Galerkin_Stabilized_AD_btest_build
[ 65%] Building CXX object test/unit/Discretization/Galerkin/CMakeFiles/JacobianCell_Galerkin_Stabilized_NS_btest_OBJECT.dir/JacobianCell_Galerkin_Stabilized_NS_btest.cpp.o
In file included from /jenkins/workspace/SANS_Nightly/builddir/undefined_gnu9/buildnode/reynolds/test/unit/Discretization/Galerkin/JacobianCell_Galerkin_Stabilized_NS_btest.cpp:26:
/jenkins/workspace/SANS_Nightly/builddir/undefined_gnu9/buildnode/reynolds/src/pde/NS/PDENavierStokes3D.h: In member function ‘void SANS::PDENavierStokes3D<PDETraitsSize, PDETraitsModel>::jacobianFluxViscous(const Tq&, const Tq&, SANS::PDENavierStokes3D<PDETraitsSize, PDETraitsModel>::ArrayQ<Tq>&, SANS::PDENavierStokes3D<PDETraitsSize, PDETraitsModel>::ArrayQ<Tq>, SANS::PDENavierStokes3D<PDETraitsSize, PDETraitsModel>::ArrayQ<Tg>&, SANS::PDENavierStokes3D<PDETraitsSize, PDETraitsModel>::ArrayQ<Tf>&, SANS::PDENavierStokes3D<PDETraitsSize, PDETraitsModel>::ArrayQ<Tf>&, SANS::PDENavierStokes3D<PDETraitsSize, PDETraitsModel>::ArrayQ<Tf>&, SANS::PDENavierStokes3D<PDETraitsSize, PDETraitsModel>::MatrixQ<Tk>&, SANS::PDENavierStokes3D<PDETraitsSize, PDETraitsModel>::MatrixQ<Tk>&, SANS::PDENavierStokes3D<PDETraitsSize, PDETraitsModel>::MatrixQ<Tk>&) const [with Tm = SANS::SurrealS<5, double>; Tq = SANS::SurrealS<5, double>; Tg = double; Tf = SANS::SurrealS<5, double>; PDETraitsSize = SANS::TraitsSizeNavierStokes; PDETraitsModel = SANS::TraitsModelNavierStokes<SANS::QTypePrimitiveRhoPressure, SANS::GasModel, SANS::ViscosityModel_Sutherland, SANS::ThermalConductivityModel>]’:
/jenkins/workspace/SANS_Nightly/builddir/undefined_gnu9/buildnode/reynolds/src/pde/NS/PDENavierStokes3D.h:931:1: note: variable tracking size limit exceeded with ‘-fvar-tracking-assignments’, retrying without
  931 | PDENavierStokes3D<PDETraitsSize, PDETraitsModel>::jacobianFluxViscous(
      | ^~~~~~~~~~~~~~~~~~~~~~~~~~~~~~~~~~~~~~~~~~~~~~~~
/jenkins/workspace/SANS_Nightly/builddir/undefined_gnu9/buildnode/reynolds/src/pde/NS/PDENavierStokes3D.h: In member function ‘void SANS::PDENavierStokes3D<PDETraitsSize, PDETraitsModel>::diffusionViscousGradient(const Tq&, const Tq&, const Tq&, const Tq&, const Tq&, const Tq&, const Tq&, const Tg&, const Tg&, const Tg&, const Tg&, const Tg&, const Tqg&, const Tqg&, const Tg&, const Tg&, const Tg&, const Tg&, const Tg&, const Tqg&, const Tqg&, const Tg&, const Tg&, const Tg&, const Tg&, const Tg&, const Tqg&, const Tqg&, SANS::PDENavierStokes3D<PDETraitsSize, PDETraitsModel>::MatrixQ<Tk>&, SANS::PDENavierStokes3D<PDETraitsSize, PDETraitsModel>::MatrixQ<Tk>&, SANS::PDENavierStokes3D<PDETraitsSize, PDETraitsModel>::MatrixQ<Tk>&, SANS::PDENavierStokes3D<PDETraitsSize, PDETraitsModel>::MatrixQ<Tk>&, SANS::PDENavierStokes3D<PDETraitsSize, PDETraitsModel>::MatrixQ<Tk>&, SANS::PDENavierStokes3D<PDETraitsSize, PDETraitsModel>::MatrixQ<Tk>&, SANS::PDENavierStokes3D<PDETraitsSize, PDETraitsModel>::MatrixQ<Tk>&, SANS::PDENavierStokes3D<PDETraitsSize, PDETraitsModel>::MatrixQ<Tk>&, SANS::PDENavierStokes3D<PDETraitsSize, PDETraitsModel>::MatrixQ<Tk>&, SANS::PDENavierStokes3D<PDETraitsSize, PDETraitsModel>::MatrixQ<Tk>&, SANS::PDENavierStokes3D<PDETraitsSize, PDETraitsModel>::MatrixQ<Tk>&, SANS::PDENavierStokes3D<PDETraitsSize, PDETraitsModel>::MatrixQ<Tk>&, SANS::PDENavierStokes3D<PDETraitsSize, PDETraitsModel>::MatrixQ<Tk>&, SANS::PDENavierStokes3D<PDETraitsSize, PDETraitsModel>::MatrixQ<Tk>&, SANS::PDENavierStokes3D<PDETraitsSize, PDETraitsModel>::MatrixQ<Tk>&) const [with Tq = SANS::SurrealS<5, double>; Tg = SANS::SurrealS<5, double>; Tk = SANS::SurrealS<5, double>; Tqg = SANS::SurrealS<5, double>; PDETraitsSize = SANS::TraitsSizeNavierStokes; PDETraitsModel = SANS::TraitsModelNavierStokes<SANS::QTypePrimitiveRhoPressure, SANS::GasModel, SANS::ViscosityModel_Sutherland, SANS::ThermalConductivityModel>]’:
/jenkins/workspace/SANS_Nightly/builddir/undefined_gnu9/buildnode/reynolds/src/pde/NS/PDENavierStokes3D.h:655:1: note: variable tracking size limit exceeded with ‘-fvar-tracking-assignments’, retrying without
  655 | PDENavierStokes3D<PDETraitsSize, PDETraitsModel>::diffusionViscousGradient(
      | ^~~~~~~~~~~~~~~~~~~~~~~~~~~~~~~~~~~~~~~~~~~~~~~~
/jenkins/workspace/SANS_Nightly/builddir/undefined_gnu9/buildnode/reynolds/src/pde/NS/PDENavierStokes3D.h: In member function ‘void SANS::PDENavierStokes3D<PDETraitsSize, PDETraitsModel>::diffusionViscousGradient(const Tq&, const Tq&, const Tq&, const Tq&, const Tq&, const Tq&, const Tq&, const Tg&, const Tg&, const Tg&, const Tg&, const Tg&, const Tqg&, const Tqg&, const Tg&, const Tg&, const Tg&, const Tg&, const Tg&, const Tqg&, const Tqg&, const Tg&, const Tg&, const Tg&, const Tg&, const Tg&, const Tqg&, const Tqg&, SANS::PDENavierStokes3D<PDETraitsSize, PDETraitsModel>::MatrixQ<Tk>&, SANS::PDENavierStokes3D<PDETraitsSize, PDETraitsModel>::MatrixQ<Tk>&, SANS::PDENavierStokes3D<PDETraitsSize, PDETraitsModel>::MatrixQ<Tk>&, SANS::PDENavierStokes3D<PDETraitsSize, PDETraitsModel>::MatrixQ<Tk>&, SANS::PDENavierStokes3D<PDETraitsSize, PDETraitsModel>::MatrixQ<Tk>&, SANS::PDENavierStokes3D<PDETraitsSize, PDETraitsModel>::MatrixQ<Tk>&, SANS::PDENavierStokes3D<PDETraitsSize, PDETraitsModel>::MatrixQ<Tk>&, SANS::PDENavierStokes3D<PDETraitsSize, PDETraitsModel>::MatrixQ<Tk>&, SANS::PDENavierStokes3D<PDETraitsSize, PDETraitsModel>::MatrixQ<Tk>&, SANS::PDENavierStokes3D<PDETraitsSize, PDETraitsModel>::MatrixQ<Tk>&, SANS::PDENavierStokes3D<PDETraitsSize, PDETraitsModel>::MatrixQ<Tk>&, SANS::PDENavierStokes3D<PDETraitsSize, PDETraitsModel>::MatrixQ<Tk>&, SANS::PDENavierStokes3D<PDETraitsSize, PDETraitsModel>::MatrixQ<Tk>&, SANS::PDENavierStokes3D<PDETraitsSize, PDETraitsModel>::MatrixQ<Tk>&, SANS::PDENavierStokes3D<PDETraitsSize, PDETraitsModel>::MatrixQ<Tk>&) const [with Tq = double; Tg = SANS::SurrealS<5, double>; Tk = SANS::SurrealS<5, double>; Tqg = SANS::SurrealS<5, double>; PDETraitsSize = SANS::TraitsSizeNavierStokes; PDETraitsModel = SANS::TraitsModelNavierStokes<SANS::QTypePrimitiveRhoPressure, SANS::GasModel, SANS::ViscosityModel_Sutherland, SANS::ThermalConductivityModel>]’:
/jenkins/workspace/SANS_Nightly/builddir/undefined_gnu9/buildnode/reynolds/src/pde/NS/PDENavierStokes3D.h:655:1: note: variable tracking size limit exceeded with ‘-fvar-tracking-assignments’, retrying without
[ 65%] Built target JacobianCell_Galerkin_Stabilized_NS_btest_OBJECT
[ 65%] Checking style of test/unit/Discretization/Galerkin/JacobianCell_Galerkin_Stabilized_NS_btest.cpp
[ 65%] Built target JacobianCell_Galerkin_Stabilized_NS_btest_build_vera
[ 65%] Linking CXX executable JacobianCell_Galerkin_Stabilized_NS_btest
[ 65%] Built target JacobianCell_Galerkin_Stabilized_NS_btest_build
[ 65%] Building CXX object test/unit/Discretization/Galerkin/CMakeFiles/JacobianFunctionalBoundaryTrace_Galerkin_HSM2D_btest_OBJECT.dir/JacobianFunctionalBoundaryTrace_Galerkin_HSM2D_btest.cpp.o
[ 65%] Built target JacobianFunctionalBoundaryTrace_Galerkin_HSM2D_btest_OBJECT
[ 67%] Checking style of test/unit/Discretization/Galerkin/JacobianFunctionalBoundaryTrace_Galerkin_HSM2D_btest.cpp
[ 67%] Built target JacobianFunctionalBoundaryTrace_Galerkin_HSM2D_btest_build_vera
[ 67%] Linking CXX executable JacobianFunctionalBoundaryTrace_Galerkin_HSM2D_btest
[ 67%] Built target JacobianFunctionalBoundaryTrace_Galerkin_HSM2D_btest_build
[ 67%] Building CXX object test/unit/Discretization/Galerkin/CMakeFiles/JacobianFunctionalBoundaryTrace_WeightedResidual_Galerkin_btest_OBJECT.dir/JacobianFunctionalBoundaryTrace_WeightedResidual_Galerkin_btest.cpp.o
[ 67%] Built target JacobianFunctionalBoundaryTrace_WeightedResidual_Galerkin_btest_OBJECT
[ 67%] Checking style of test/unit/Discretization/Galerkin/JacobianFunctionalBoundaryTrace_WeightedResidual_Galerkin_btest.cpp
[ 67%] Built target JacobianFunctionalBoundaryTrace_WeightedResidual_Galerkin_btest_build_vera
[ 67%] Linking CXX executable JacobianFunctionalBoundaryTrace_WeightedResidual_Galerkin_btest
[ 67%] Built target JacobianFunctionalBoundaryTrace_WeightedResidual_Galerkin_btest_build
[ 67%] Building CXX object test/unit/Discretization/Galerkin/CMakeFiles/JacobianFunctionalCell_Galerkin_btest_OBJECT.dir/JacobianFunctionalCell_Galerkin_btest.cpp.o
[ 67%] Built target JacobianFunctionalCell_Galerkin_btest_OBJECT
[ 67%] Checking style of test/unit/Discretization/Galerkin/JacobianFunctionalCell_Galerkin_btest.cpp
[ 67%] Built target JacobianFunctionalCell_Galerkin_btest_build_vera
[ 67%] Linking CXX executable JacobianFunctionalCell_Galerkin_btest
[ 67%] Built target JacobianFunctionalCell_Galerkin_btest_build
[ 67%] Building CXX object test/unit/Discretization/Galerkin/CMakeFiles/JacobianInteriorTrace_Galerkin_AD_btest_OBJECT.dir/JacobianInteriorTrace_Galerkin_AD_btest.cpp.o
[ 67%] Built target JacobianInteriorTrace_Galerkin_AD_btest_OBJECT
[ 67%] Checking style of test/unit/Discretization/Galerkin/JacobianInteriorTrace_Galerkin_AD_btest.cpp
[ 67%] Built target JacobianInteriorTrace_Galerkin_AD_btest_build_vera
[ 67%] Linking CXX executable JacobianInteriorTrace_Galerkin_AD_btest
[ 67%] Built target JacobianInteriorTrace_Galerkin_AD_btest_build
[ 67%] Building CXX object test/unit/Discretization/Galerkin/CMakeFiles/JacobianNonZeroPattern_Galerkin_Triangle_AD_btest_OBJECT.dir/JacobianNonZeroPattern_Galerkin_Triangle_AD_btest.cpp.o
[ 67%] Built target JacobianNonZeroPattern_Galerkin_Triangle_AD_btest_OBJECT
[ 67%] Checking style of test/unit/Discretization/Galerkin/JacobianNonZeroPattern_Galerkin_Triangle_AD_btest.cpp
[ 67%] Built target JacobianNonZeroPattern_Galerkin_Triangle_AD_btest_build_vera
[ 67%] Linking CXX executable JacobianNonZeroPattern_Galerkin_Triangle_AD_btest
[ 67%] Built target JacobianNonZeroPattern_Galerkin_Triangle_AD_btest_build
[ 67%] Building CXX object test/unit/Discretization/Galerkin/CMakeFiles/JacobianTranspose_Galerkin_Triangle_AD_btest_OBJECT.dir/JacobianTranspose_Galerkin_Triangle_AD_btest.cpp.o
[ 67%] Built target JacobianTranspose_Galerkin_Triangle_AD_btest_OBJECT
[ 67%] Checking style of test/unit/Discretization/Galerkin/JacobianTranspose_Galerkin_Triangle_AD_btest.cpp
[ 67%] Built target JacobianTranspose_Galerkin_Triangle_AD_btest_build_vera
[ 67%] Linking CXX executable JacobianTranspose_Galerkin_Triangle_AD_btest
[ 67%] Built target JacobianTranspose_Galerkin_Triangle_AD_btest_build
[ 67%] Building CXX object test/unit/Discretization/Galerkin/CMakeFiles/ResidualBoundaryTrace_LinearScalar_mitLG_Galerkin_AD_btest_OBJECT.dir/ResidualBoundaryTrace_LinearScalar_mitLG_Galerkin_AD_btest.cpp.o
[ 67%] Built target ResidualBoundaryTrace_LinearScalar_mitLG_Galerkin_AD_btest_OBJECT
[ 67%] Checking style of test/unit/Discretization/Galerkin/ResidualBoundaryTrace_LinearScalar_mitLG_Galerkin_AD_btest.cpp
[ 67%] Built target ResidualBoundaryTrace_LinearScalar_mitLG_Galerkin_AD_btest_build_vera
[ 67%] Linking CXX executable ResidualBoundaryTrace_LinearScalar_mitLG_Galerkin_AD_btest
[ 67%] Built target ResidualBoundaryTrace_LinearScalar_mitLG_Galerkin_AD_btest_build
[ 67%] Building CXX object test/unit/Discretization/Galerkin/CMakeFiles/ResidualBoundaryTrace_None_Galerkin_AD_btest_OBJECT.dir/ResidualBoundaryTrace_None_Galerkin_AD_btest.cpp.o
[ 67%] Built target ResidualBoundaryTrace_None_Galerkin_AD_btest_OBJECT
[ 67%] Checking style of test/unit/Discretization/Galerkin/ResidualBoundaryTrace_None_Galerkin_AD_btest.cpp
[ 67%] Built target ResidualBoundaryTrace_None_Galerkin_AD_btest_build_vera
[ 67%] Linking CXX executable ResidualBoundaryTrace_None_Galerkin_AD_btest
[ 67%] Built target ResidualBoundaryTrace_None_Galerkin_AD_btest_build
[ 67%] Building CXX object test/unit/Discretization/Galerkin/CMakeFiles/ResidualCell_Galerkin_AD_btest_OBJECT.dir/ResidualCell_Galerkin_AD_btest.cpp.o
[ 67%] Built target ResidualCell_Galerkin_AD_btest_OBJECT
[ 67%] Checking style of test/unit/Discretization/Galerkin/ResidualCell_Galerkin_AD_btest.cpp
[ 67%] Built target ResidualCell_Galerkin_AD_btest_build_vera
[ 67%] Linking CXX executable ResidualCell_Galerkin_AD_btest
[ 67%] Built target ResidualCell_Galerkin_AD_btest_build
[ 67%] Building CXX object test/unit/Discretization/Galerkin/CMakeFiles/ResidualCell_Galerkin_BDF_AD_btest_OBJECT.dir/ResidualCell_Galerkin_BDF_AD_btest.cpp.o
[ 67%] Built target ResidualCell_Galerkin_BDF_AD_btest_OBJECT
[ 67%] Checking style of test/unit/Discretization/Galerkin/ResidualCell_Galerkin_BDF_AD_btest.cpp
[ 67%] Built target ResidualCell_Galerkin_BDF_AD_btest_build_vera
[ 67%] Linking CXX executable ResidualCell_Galerkin_BDF_AD_btest
[ 67%] Built target ResidualCell_Galerkin_BDF_AD_btest_build
[ 67%] Building CXX object test/unit/Discretization/Galerkin/CMakeFiles/ResidualCell_Galerkin_CR_btest_OBJECT.dir/ResidualCell_Galerkin_CR_btest.cpp.o
[ 67%] Built target ResidualCell_Galerkin_CR_btest_OBJECT
[ 67%] Checking style of test/unit/Discretization/Galerkin/ResidualCell_Galerkin_CR_btest.cpp
[ 67%] Built target ResidualCell_Galerkin_CR_btest_build_vera
[ 67%] Linking CXX executable ResidualCell_Galerkin_CR_btest
[ 67%] Built target ResidualCell_Galerkin_CR_btest_build
[ 67%] Building CXX object test/unit/Discretization/Galerkin/CMakeFiles/ResidualCell_Galerkin_HSM2D_btest_OBJECT.dir/ResidualCell_Galerkin_HSM2D_btest.cpp.o
[ 67%] Built target ResidualCell_Galerkin_HSM2D_btest_OBJECT
[ 67%] Checking style of test/unit/Discretization/Galerkin/ResidualCell_Galerkin_HSM2D_btest.cpp
[ 67%] Built target ResidualCell_Galerkin_HSM2D_btest_build_vera
[ 67%] Linking CXX executable ResidualCell_Galerkin_HSM2D_btest
[ 67%] Built target ResidualCell_Galerkin_HSM2D_btest_build
[ 67%] Building CXX object test/unit/Discretization/Galerkin/CMakeFiles/ResidualCell_Galerkin_IRS_AD_btest_OBJECT.dir/ResidualCell_Galerkin_IRS_AD_btest.cpp.o
[ 67%] Built target ResidualCell_Galerkin_IRS_AD_btest_OBJECT
[ 67%] Checking style of test/unit/Discretization/Galerkin/ResidualCell_Galerkin_IRS_AD_btest.cpp
[ 67%] Built target ResidualCell_Galerkin_IRS_AD_btest_build_vera
[ 67%] Linking CXX executable ResidualCell_Galerkin_IRS_AD_btest
[ 67%] Built target ResidualCell_Galerkin_IRS_AD_btest_build
[ 67%] Building CXX object test/unit/Discretization/Galerkin/CMakeFiles/ResidualCell_Galerkin_PTC_AD_btest_OBJECT.dir/ResidualCell_Galerkin_PTC_AD_btest.cpp.o
[ 67%] Built target ResidualCell_Galerkin_PTC_AD_btest_OBJECT
[ 67%] Checking style of test/unit/Discretization/Galerkin/ResidualCell_Galerkin_PTC_AD_btest.cpp
[ 67%] Built target ResidualCell_Galerkin_PTC_AD_btest_build_vera
[ 67%] Linking CXX executable ResidualCell_Galerkin_PTC_AD_btest
[ 67%] Built target ResidualCell_Galerkin_PTC_AD_btest_build
[ 68%] Building CXX object test/unit/Discretization/Galerkin/CMakeFiles/ResidualCell_Galerkin_ShallowWater1D_btest_OBJECT.dir/ResidualCell_Galerkin_ShallowWater1D_btest.cpp.o
[ 68%] Built target ResidualCell_Galerkin_ShallowWater1D_btest_OBJECT
[ 68%] Checking style of test/unit/Discretization/Galerkin/ResidualCell_Galerkin_ShallowWater1D_btest.cpp
[ 68%] Built target ResidualCell_Galerkin_ShallowWater1D_btest_build_vera
[ 68%] Linking CXX executable ResidualCell_Galerkin_ShallowWater1D_btest
[ 68%] Built target ResidualCell_Galerkin_ShallowWater1D_btest_build
[ 68%] Building CXX object test/unit/Discretization/Galerkin/CMakeFiles/ResidualInteriorTrace_Galerkin_AD_btest_OBJECT.dir/ResidualInteriorTrace_Galerkin_AD_btest.cpp.o
[ 68%] Built target ResidualInteriorTrace_Galerkin_AD_btest_OBJECT
[ 68%] Checking style of test/unit/Discretization/Galerkin/ResidualInteriorTrace_Galerkin_AD_btest.cpp
[ 68%] Built target ResidualInteriorTrace_Galerkin_AD_btest_build_vera
[ 68%] Linking CXX executable ResidualInteriorTrace_Galerkin_AD_btest
[ 68%] Built target ResidualInteriorTrace_Galerkin_AD_btest_build
[ 68%] Building CXX object test/unit/Discretization/Galerkin/CMakeFiles/ResidualInteriorTrace_Galerkin_CR_btest_OBJECT.dir/ResidualInteriorTrace_Galerkin_CR_btest.cpp.o
[ 68%] Built target ResidualInteriorTrace_Galerkin_CR_btest_OBJECT
[ 68%] Checking style of test/unit/Discretization/Galerkin/ResidualInteriorTrace_Galerkin_CR_btest.cpp
[ 68%] Built target ResidualInteriorTrace_Galerkin_CR_btest_build_vera
[ 68%] Linking CXX executable ResidualInteriorTrace_Galerkin_CR_btest
[ 68%] Built target ResidualInteriorTrace_Galerkin_CR_btest_build
[ 68%] Building CXX object test/unit/Discretization/Galerkin/CMakeFiles/SolutionData_Galerkin_Stabilized_btest_OBJECT.dir/SolutionData_Galerkin_Stabilized_btest.cpp.o
[ 68%] Built target SolutionData_Galerkin_Stabilized_btest_OBJECT
[ 68%] Checking style of test/unit/Discretization/Galerkin/SolutionData_Galerkin_Stabilized_btest.cpp
[ 68%] Built target SolutionData_Galerkin_Stabilized_btest_build_vera
[ 68%] Linking CXX executable SolutionData_Galerkin_Stabilized_btest
[ 68%] Built target SolutionData_Galerkin_Stabilized_btest_build
[ 68%] Building CXX object test/unit/Discretization/Galerkin/CMakeFiles/StabilizationMatrix_NS_btest_OBJECT.dir/StabilizationMatrix_NS_btest.cpp.o
[ 68%] Built target StabilizationMatrix_NS_btest_OBJECT
[ 68%] Checking style of test/unit/Discretization/Galerkin/StabilizationMatrix_NS_btest.cpp
[ 68%] Built target StabilizationMatrix_NS_btest_build_vera
[ 68%] Linking CXX executable StabilizationMatrix_NS_btest
[ 68%] Built target StabilizationMatrix_NS_btest_build
[ 68%] Building CXX object test/unit/Discretization/Galerkin/CMakeFiles/UpdateFraction_Euler_btest_OBJECT.dir/UpdateFraction_Euler_btest.cpp.o
[ 68%] Built target UpdateFraction_Euler_btest_OBJECT
[ 68%] Checking style of test/unit/Discretization/Galerkin/UpdateFraction_Euler_btest.cpp
[ 68%] Built target UpdateFraction_Euler_btest_build_vera
[ 68%] Linking CXX executable UpdateFraction_Euler_btest
[ 68%] Built target UpdateFraction_Euler_btest_build
[ 68%] Building CXX object test/unit/Discretization/Galerkin/CMakeFiles/isValidStateCell_Euler_btest_OBJECT.dir/isValidStateCell_Euler_btest.cpp.o
[ 68%] Built target isValidStateCell_Euler_btest_OBJECT
[ 68%] Checking style of test/unit/Discretization/Galerkin/isValidStateCell_Euler_btest.cpp
[ 68%] Built target isValidStateCell_Euler_btest_build_vera
[ 68%] Linking CXX executable isValidStateCell_Euler_btest
[ 68%] Built target isValidStateCell_Euler_btest_build
[ 68%] Building CXX object test/unit/Discretization/Galerkin/CMakeFiles/isValidStateInteriorTrace_Euler_btest_OBJECT.dir/isValidStateInteriorTrace_Euler_btest.cpp.o
[ 68%] Built target isValidStateInteriorTrace_Euler_btest_OBJECT
[ 68%] Checking style of test/unit/Discretization/Galerkin/isValidStateInteriorTrace_Euler_btest.cpp
[ 68%] Built target isValidStateInteriorTrace_Euler_btest_build_vera
[ 68%] Linking CXX executable isValidStateInteriorTrace_Euler_btest
[ 68%] Built target isValidStateInteriorTrace_Euler_btest_build
[ 68%] Building CXX object test/unit/Discretization/GloballyConstrained/CMakeFiles/AlgebraicEquationSet_GloballyConstrained_btest_OBJECT.dir/AlgebraicEquationSet_GloballyConstrained_btest.cpp.o
Build was aborted
[GNU C Compiler (gcc)ClangIntel Compiler (C, Fortran)Vera++] Skipping execution of recorder since overall result is 'ABORTED'
In file included from /usr/include/boost/config/header_deprecated.hpp:18,
                 from /usr/include/boost/test/output_test_stream.hpp:13,
                 from /jenkins/workspace/SANS_Nightly/builddir/undefined_gnu9/buildnode/reynolds/test/SANS_prefix_btest.h:51,
                 from /jenkins/workspace/SANS_Nightly/builddir/undefined_gnu9/buildnode/reynolds/build/undefined_gnu9/test/cotire/SANS_PREFIX_BTEST_CXX_prefix.cxx:4,
                 from /jenkins/workspace/SANS_Nightly/builddir/undefined_gnu9/buildnode/reynolds/build/undefined_gnu9/test/cotire/SANS_PREFIX_BTEST_CXX_prefix.hxx:4:
/usr/include/boost/test/output_test_stream.hpp:14:1: note: #pragma message: This header is deprecated. Use This header is deprecated. Please use <boost/test/tools/output_test_stream.hpp> instead. instead.
   14 | BOOST_HEADER_DEPRECATED( "This header is deprecated. Please use <boost/test/tools/output_test_stream.hpp> instead." )
      | ^~~~~~~~~~~~~~~~~~~~~~~
g++-9: fatal error: Terminated signal terminated program cc1plus
compilation terminated.
make[3]: *** [test/unit/Discretization/GloballyConstrained/CMakeFiles/AlgebraicEquationSet_GloballyConstrained_btest_OBJECT.dir/build.make:77: test/unit/Discretization/GloballyConstrained/CMakeFiles/AlgebraicEquationSet_GloballyConstrained_btest_OBJECT.dir/AlgebraicEquationSet_GloballyConstrained_btest.cpp.o] Error 1
make[2]: *** [CMakeFiles/Makefile2:44674: test/unit/Discretization/GloballyConstrained/CMakeFiles/AlgebraicEquationSet_GloballyConstrained_btest_OBJECT.dir/all] Error 2
make[1]: *** [CMakeFiles/Makefile2:16410: test/unit/CMakeFiles/check_unit.dir/rule] Error 2
make: *** [Makefile:3169: check_unit] Error 2

real	487m15.324s
user	466m15.400s
sys	15m9.483s
+ status=1
++ find /jenkins/workspace/SANS_Nightly/builddir/undefined_gnu9/buildnode/reynolds/build/undefined_gnu9 -name Test.xml
+ mv /jenkins/workspace/SANS_Nightly/builddir/undefined_gnu9/buildnode/reynolds/build/Test_unit_memcheck.xml
mv: missing destination file operand after '/jenkins/workspace/SANS_Nightly/builddir/undefined_gnu9/buildnode/reynolds/build/Test_unit_memcheck.xml'
Try 'mv --help' for more information.
[Valgrind] Files to copy:
[Valgrind] Analysing valgrind results
[Valgrind] Ending the valgrind analysis.
INFO: Processing BoostTest-1.x (default)
INFO: [BoostTest-1.x (default)] - No test report file(s) were found with the pattern 'build/boosttest/*.xml' relative to '/jenkins/workspace/SANS_Nightly/builddir/undefined_gnu9/buildnode/reynolds' for the testing framework 'BoostTest-1.x (default)'.
Did you enter a pattern relative to (and within) the workspace directory?
Did you generate the result report(s) for 'BoostTest-1.x (default)'?"
WARNING: All test reports are empty.
INFO: Check 'Failed Tests' threshold.
INFO: Check 'Skipped Tests' threshold.
INFO: Setting the build status to SUCCESS
[PostBuildScript] - [INFO] Executing post build scripts.
[PostBuildScript] - [INFO] Node does not have the role MASTER. Did not execute build step #0.
[PostBuildScript] - [INFO] Node does not have the role MASTER. Did not execute build step #1.
[WS-CLEANUP] Deleting project workspace...
[WS-CLEANUP] Deferred wipeout is used...
[WS-CLEANUP] done
Finished: ABORTED