Console Output

Skipping 1,240 KB.. Full Log
[ 96%] Linking CXX executable XField2D_Annulus_Triangle_X1_btest
[ 96%] Built target XField2D_Annulus_Triangle_X1_btest_build
[ 98%] Checking style of test/unit/UnitGrids/XField2D_BackwardsStep_X1_btest.cpp
[ 98%] Built target XField2D_BackwardsStep_X1_btest_build_vera
[ 98%] Building CXX object test/unit/UnitGrids/CMakeFiles/XField2D_BackwardsStep_X1_btest_OBJECT.dir/XField2D_BackwardsStep_X1_btest.cpp.o
[ 98%] Built target XField2D_BackwardsStep_X1_btest_OBJECT
[ 98%] Linking CXX executable XField2D_BackwardsStep_X1_btest
[ 98%] Built target XField2D_BackwardsStep_X1_btest_build
[ 98%] Checking style of test/unit/UnitGrids/XField2D_BoxPeriodic_Triangle_X1_btest.cpp
[ 98%] Built target XField2D_BoxPeriodic_Triangle_X1_btest_build_vera
[ 98%] Building CXX object test/unit/UnitGrids/CMakeFiles/XField2D_BoxPeriodic_Triangle_X1_btest_OBJECT.dir/XField2D_BoxPeriodic_Triangle_X1_btest.cpp.o
[ 98%] Built target XField2D_BoxPeriodic_Triangle_X1_btest_OBJECT
[ 98%] Linking CXX executable XField2D_BoxPeriodic_Triangle_X1_btest
[ 98%] Built target XField2D_BoxPeriodic_Triangle_X1_btest_build
[ 98%] Checking style of test/unit/UnitGrids/XField2D_Box_Mixed_X1_btest.cpp
[ 98%] Built target XField2D_Box_Mixed_X1_btest_build_vera
[ 98%] Building CXX object test/unit/UnitGrids/CMakeFiles/XField2D_Box_Mixed_X1_btest_OBJECT.dir/XField2D_Box_Mixed_X1_btest.cpp.o
[ 98%] Built target XField2D_Box_Mixed_X1_btest_OBJECT
[ 98%] Linking CXX executable XField2D_Box_Mixed_X1_btest
[ 98%] Built target XField2D_Box_Mixed_X1_btest_build
[ 98%] Checking style of test/unit/UnitGrids/XField2D_Box_Quad_Lagrange_X1_btest.cpp
[ 98%] Built target XField2D_Box_Quad_Lagrange_X1_btest_build_vera
[ 98%] Building CXX object test/unit/UnitGrids/CMakeFiles/XField2D_Box_Quad_Lagrange_X1_btest_OBJECT.dir/XField2D_Box_Quad_Lagrange_X1_btest.cpp.o
[ 98%] Built target XField2D_Box_Quad_Lagrange_X1_btest_OBJECT
[ 98%] Linking CXX executable XField2D_Box_Quad_Lagrange_X1_btest
[ 98%] Built target XField2D_Box_Quad_Lagrange_X1_btest_build
[ 98%] Checking style of test/unit/UnitGrids/XField2D_Box_Quad_X1_btest.cpp
[ 98%] Built target XField2D_Box_Quad_X1_btest_build_vera
[ 98%] Building CXX object test/unit/UnitGrids/CMakeFiles/XField2D_Box_Quad_X1_btest_OBJECT.dir/XField2D_Box_Quad_X1_btest.cpp.o
[ 98%] Built target XField2D_Box_Quad_X1_btest_OBJECT
[ 98%] Linking CXX executable XField2D_Box_Quad_X1_btest
[ 98%] Built target XField2D_Box_Quad_X1_btest_build
[ 98%] Checking style of test/unit/UnitGrids/XField2D_Box_Triangle_Ghost_X1_btest.cpp
[ 98%] Built target XField2D_Box_Triangle_Ghost_X1_btest_build_vera
[ 98%] Building CXX object test/unit/UnitGrids/CMakeFiles/XField2D_Box_Triangle_Ghost_X1_btest_OBJECT.dir/XField2D_Box_Triangle_Ghost_X1_btest.cpp.o
[ 98%] Built target XField2D_Box_Triangle_Ghost_X1_btest_OBJECT
[ 98%] Linking CXX executable XField2D_Box_Triangle_Ghost_X1_btest
[ 98%] Built target XField2D_Box_Triangle_Ghost_X1_btest_build
[ 98%] Checking style of test/unit/UnitGrids/XField2D_Box_Triangle_Lagrange_X1_btest.cpp
[ 98%] Built target XField2D_Box_Triangle_Lagrange_X1_btest_build_vera
[ 98%] Building CXX object test/unit/UnitGrids/CMakeFiles/XField2D_Box_Triangle_Lagrange_X1_btest_OBJECT.dir/XField2D_Box_Triangle_Lagrange_X1_btest.cpp.o
[ 98%] Built target XField2D_Box_Triangle_Lagrange_X1_btest_OBJECT
[ 98%] Linking CXX executable XField2D_Box_Triangle_Lagrange_X1_btest
[ 98%] Built target XField2D_Box_Triangle_Lagrange_X1_btest_build
[ 98%] Checking style of test/unit/UnitGrids/XField2D_Box_Triangle_X1_btest.cpp
[ 98%] Built target XField2D_Box_Triangle_X1_btest_build_vera
[ 98%] Building CXX object test/unit/UnitGrids/CMakeFiles/XField2D_Box_Triangle_X1_btest_OBJECT.dir/XField2D_Box_Triangle_X1_btest.cpp.o
[ 98%] Built target XField2D_Box_Triangle_X1_btest_OBJECT
[ 98%] Linking CXX executable XField2D_Box_Triangle_X1_btest
[ 98%] Built target XField2D_Box_Triangle_X1_btest_build
[ 98%] Checking style of test/unit/UnitGrids/XField2D_Box_UnionJack_LocalRefine_Triangle_X1_btest.cpp
[ 98%] Built target XField2D_Box_UnionJack_LocalRefine_Triangle_X1_btest_build_vera
[ 98%] Building CXX object test/unit/UnitGrids/CMakeFiles/XField2D_Box_UnionJack_LocalRefine_Triangle_X1_btest_OBJECT.dir/XField2D_Box_UnionJack_LocalRefine_Triangle_X1_btest.cpp.o
[ 98%] Built target XField2D_Box_UnionJack_LocalRefine_Triangle_X1_btest_OBJECT
[ 98%] Linking CXX executable XField2D_Box_UnionJack_LocalRefine_Triangle_X1_btest
[ 98%] Built target XField2D_Box_UnionJack_LocalRefine_Triangle_X1_btest_build
[ 98%] Checking style of test/unit/UnitGrids/XField2D_Box_UnionJack_Triangle_X1_btest.cpp
[ 98%] Built target XField2D_Box_UnionJack_Triangle_X1_btest_build_vera
[ 98%] Building CXX object test/unit/UnitGrids/CMakeFiles/XField2D_Box_UnionJack_Triangle_X1_btest_OBJECT.dir/XField2D_Box_UnionJack_Triangle_X1_btest.cpp.o
[ 98%] Built target XField2D_Box_UnionJack_Triangle_X1_btest_OBJECT
[ 98%] Linking CXX executable XField2D_Box_UnionJack_Triangle_X1_btest
[ 98%] Built target XField2D_Box_UnionJack_Triangle_X1_btest_build
[ 98%] Checking style of test/unit/UnitGrids/XField2D_Circle_Line_X1_1Group_btest.cpp
[ 98%] Built target XField2D_Circle_Line_X1_1Group_btest_build_vera
[ 98%] Building CXX object test/unit/UnitGrids/CMakeFiles/XField2D_Circle_Line_X1_1Group_btest_OBJECT.dir/XField2D_Circle_Line_X1_1Group_btest.cpp.o
[ 98%] Built target XField2D_Circle_Line_X1_1Group_btest_OBJECT
[ 98%] Linking CXX executable XField2D_Circle_Line_X1_1Group_btest
[ 98%] Built target XField2D_Circle_Line_X1_1Group_btest_build
[ 98%] Checking style of test/unit/UnitGrids/XField2D_CubicSourceBump_Xq_btest.cpp
[ 98%] Built target XField2D_CubicSourceBump_Xq_btest_build_vera
[ 98%] Building CXX object test/unit/UnitGrids/CMakeFiles/XField2D_CubicSourceBump_Xq_btest_OBJECT.dir/XField2D_CubicSourceBump_Xq_btest.cpp.o
[ 98%] Built target XField2D_CubicSourceBump_Xq_btest_OBJECT
[ 98%] Linking CXX executable XField2D_CubicSourceBump_Xq_btest
[ 98%] Built target XField2D_CubicSourceBump_Xq_btest_build
[ 98%] Checking style of test/unit/UnitGrids/XField2D_Duct_Triangle_Lagrange_Xq_btest.cpp
[ 98%] Built target XField2D_Duct_Triangle_Lagrange_Xq_btest_build_vera
[ 98%] Building CXX object test/unit/UnitGrids/CMakeFiles/XField2D_Duct_Triangle_Lagrange_Xq_btest_OBJECT.dir/XField2D_Duct_Triangle_Lagrange_Xq_btest.cpp.o
[ 98%] Built target XField2D_Duct_Triangle_Lagrange_Xq_btest_OBJECT
[ 98%] Linking CXX executable XField2D_Duct_Triangle_Lagrange_Xq_btest
[ 98%] Built target XField2D_Duct_Triangle_Lagrange_Xq_btest_build
[ 98%] Checking style of test/unit/UnitGrids/XField2D_FlatPlate_X1_btest.cpp
[ 98%] Built target XField2D_FlatPlate_X1_btest_build_vera
[ 98%] Building CXX object test/unit/UnitGrids/CMakeFiles/XField2D_FlatPlate_X1_btest_OBJECT.dir/XField2D_FlatPlate_X1_btest.cpp.o
[ 98%] Built target XField2D_FlatPlate_X1_btest_OBJECT
[ 98%] Linking CXX executable XField2D_FlatPlate_X1_btest
[ 98%] Built target XField2D_FlatPlate_X1_btest_build
[ 98%] Checking style of test/unit/UnitGrids/XField2D_GilesPierceNozzle_HACK_btest.cpp
[ 98%] Built target XField2D_GilesPierceNozzle_HACK_btest_build_vera
[ 98%] Building CXX object test/unit/UnitGrids/CMakeFiles/XField2D_GilesPierceNozzle_HACK_btest_OBJECT.dir/XField2D_GilesPierceNozzle_HACK_btest.cpp.o
[ 98%] Built target XField2D_GilesPierceNozzle_HACK_btest_OBJECT
[ 98%] Linking CXX executable XField2D_GilesPierceNozzle_HACK_btest
[ 98%] Built target XField2D_GilesPierceNozzle_HACK_btest_build
[ 98%] Checking style of test/unit/UnitGrids/XField2D_Line_X1_1Group_btest.cpp
[ 98%] Built target XField2D_Line_X1_1Group_btest_build_vera
[ 98%] Building CXX object test/unit/UnitGrids/CMakeFiles/XField2D_Line_X1_1Group_btest_OBJECT.dir/XField2D_Line_X1_1Group_btest.cpp.o
[ 98%] Built target XField2D_Line_X1_1Group_btest_OBJECT
[ 98%] Linking CXX executable XField2D_Line_X1_1Group_btest
[ 98%] Built target XField2D_Line_X1_1Group_btest_build
[ 98%] Checking style of test/unit/UnitGrids/XField2D_Line_X1_2Group_AirfoilWithWake_btest.cpp
[ 98%] Built target XField2D_Line_X1_2Group_AirfoilWithWake_btest_build_vera
[ 98%] Building CXX object test/unit/UnitGrids/CMakeFiles/XField2D_Line_X1_2Group_AirfoilWithWake_btest_OBJECT.dir/XField2D_Line_X1_2Group_AirfoilWithWake_btest.cpp.o
[ 98%] Built target XField2D_Line_X1_2Group_AirfoilWithWake_btest_OBJECT
[ 98%] Linking CXX executable XField2D_Line_X1_2Group_AirfoilWithWake_btest
[ 98%] Built target XField2D_Line_X1_2Group_AirfoilWithWake_btest_build
[ 98%] Checking style of test/unit/UnitGrids/XField2D_Line_Xq_1Group_btest.cpp
[ 98%] Built target XField2D_Line_Xq_1Group_btest_build_vera
[ 98%] Building CXX object test/unit/UnitGrids/CMakeFiles/XField2D_Line_Xq_1Group_btest_OBJECT.dir/XField2D_Line_Xq_1Group_btest.cpp.o
[ 98%] Built target XField2D_Line_Xq_1Group_btest_OBJECT
[ 98%] Linking CXX executable XField2D_Line_Xq_1Group_btest
[ 98%] Built target XField2D_Line_Xq_1Group_btest_build
[ 98%] Checking style of test/unit/UnitGrids/XField2D_SymAirfoil_X1_btest.cpp
[ 98%] Built target XField2D_SymAirfoil_X1_btest_build_vera
[ 98%] Building CXX object test/unit/UnitGrids/CMakeFiles/XField2D_SymAirfoil_X1_btest_OBJECT.dir/XField2D_SymAirfoil_X1_btest.cpp.o
[ 98%] Built target XField2D_SymAirfoil_X1_btest_OBJECT
[ 98%] Linking CXX executable XField2D_SymAirfoil_X1_btest
[ 98%] Built target XField2D_SymAirfoil_X1_btest_build
[ 98%] Checking style of test/unit/UnitGrids/XField2D_WakeSymAirfoil_X1_btest.cpp
[ 98%] Built target XField2D_WakeSymAirfoil_X1_btest_build_vera
[ 98%] Building CXX object test/unit/UnitGrids/CMakeFiles/XField2D_WakeSymAirfoil_X1_btest_OBJECT.dir/XField2D_WakeSymAirfoil_X1_btest.cpp.o
[ 98%] Built target XField2D_WakeSymAirfoil_X1_btest_OBJECT
[ 98%] Linking CXX executable XField2D_WakeSymAirfoil_X1_btest
[ 98%] Built target XField2D_WakeSymAirfoil_X1_btest_build
[ 98%] Checking style of test/unit/UnitGrids/XField3D_1Hex_X1_1Group_btest.cpp
[ 98%] Built target XField3D_1Hex_X1_1Group_btest_build_vera
[ 98%] Building CXX object test/unit/UnitGrids/CMakeFiles/XField3D_1Hex_X1_1Group_btest_OBJECT.dir/XField3D_1Hex_X1_1Group_btest.cpp.o
[ 98%] Built target XField3D_1Hex_X1_1Group_btest_OBJECT
[ 98%] Linking CXX executable XField3D_1Hex_X1_1Group_btest
[ 98%] Built target XField3D_1Hex_X1_1Group_btest_build
[ 98%] Checking style of test/unit/UnitGrids/XField3D_1Tet_X1_1Group_btest.cpp
[ 98%] Built target XField3D_1Tet_X1_1Group_btest_build_vera
[ 98%] Building CXX object test/unit/UnitGrids/CMakeFiles/XField3D_1Tet_X1_1Group_btest_OBJECT.dir/XField3D_1Tet_X1_1Group_btest.cpp.o
[ 98%] Built target XField3D_1Tet_X1_1Group_btest_OBJECT
[ 98%] Linking CXX executable XField3D_1Tet_X1_1Group_btest
[ 98%] Built target XField3D_1Tet_X1_1Group_btest_build
[ 98%] Checking style of test/unit/UnitGrids/XField3D_2Hex_X1_1Group_btest.cpp
[ 98%] Built target XField3D_2Hex_X1_1Group_btest_build_vera
[ 98%] Building CXX object test/unit/UnitGrids/CMakeFiles/XField3D_2Hex_X1_1Group_btest_OBJECT.dir/XField3D_2Hex_X1_1Group_btest.cpp.o
[ 98%] Built target XField3D_2Hex_X1_1Group_btest_OBJECT
[ 98%] Linking CXX executable XField3D_2Hex_X1_1Group_btest
[ 98%] Built target XField3D_2Hex_X1_1Group_btest_build
[ 98%] Checking style of test/unit/UnitGrids/XField3D_2Tet_X1_1Group_WakeCut_btest.cpp
[ 98%] Built target XField3D_2Tet_X1_1Group_WakeCut_btest_build_vera
[ 98%] Building CXX object test/unit/UnitGrids/CMakeFiles/XField3D_2Tet_X1_1Group_WakeCut_btest_OBJECT.dir/XField3D_2Tet_X1_1Group_WakeCut_btest.cpp.o
[ 98%] Built target XField3D_2Tet_X1_1Group_WakeCut_btest_OBJECT
[ 98%] Linking CXX executable XField3D_2Tet_X1_1Group_WakeCut_btest
[ 98%] Built target XField3D_2Tet_X1_1Group_WakeCut_btest_build
[ 98%] Checking style of test/unit/UnitGrids/XField3D_2Tet_X1_1Group_btest.cpp
[ 98%] Built target XField3D_2Tet_X1_1Group_btest_build_vera
[ 98%] Building CXX object test/unit/UnitGrids/CMakeFiles/XField3D_2Tet_X1_1Group_btest_OBJECT.dir/XField3D_2Tet_X1_1Group_btest.cpp.o
[ 98%] Built target XField3D_2Tet_X1_1Group_btest_OBJECT
[ 98%] Linking CXX executable XField3D_2Tet_X1_1Group_btest
[ 98%] Built target XField3D_2Tet_X1_1Group_btest_build
[ 98%] Checking style of test/unit/UnitGrids/XField3D_5Tet_X1_1Group_AllOrientations_btest.cpp
[ 98%] Built target XField3D_5Tet_X1_1Group_AllOrientations_btest_build_vera
[ 98%] Building CXX object test/unit/UnitGrids/CMakeFiles/XField3D_5Tet_X1_1Group_AllOrientations_btest_OBJECT.dir/XField3D_5Tet_X1_1Group_AllOrientations_btest.cpp.o
[ 98%] Built target XField3D_5Tet_X1_1Group_AllOrientations_btest_OBJECT
[ 98%] Linking CXX executable XField3D_5Tet_X1_1Group_AllOrientations_btest
[ 98%] Built target XField3D_5Tet_X1_1Group_AllOrientations_btest_build
[ 98%] Checking style of test/unit/UnitGrids/XField3D_6Tet_X1_1Group_btest.cpp
[ 98%] Built target XField3D_6Tet_X1_1Group_btest_build_vera
[ 98%] Building CXX object test/unit/UnitGrids/CMakeFiles/XField3D_6Tet_X1_1Group_btest_OBJECT.dir/XField3D_6Tet_X1_1Group_btest.cpp.o
In file included from /usr/include/boost/test/unit_test.hpp:19,
                 from /jenkins/workspace/SANS_Nightly/builddir/undefined_gnu9/buildnode/reynolds/test/SANS_prefix_btest.h:50,
                 from /jenkins/workspace/SANS_Nightly/builddir/undefined_gnu9/buildnode/reynolds/build/undefined_gnu9/test/cotire/SANS_PREFIX_BTEST_CXX_prefix.cxx:4,
                 from /jenkins/workspace/SANS_Nightly/builddir/undefined_gnu9/buildnode/reynolds/build/undefined_gnu9/test/cotire/SANS_PREFIX_BTEST_CXX_prefix.hxx:4:
/jenkins/workspace/SANS_Nightly/builddir/undefined_gnu9/buildnode/reynolds/test/unit/UnitGrids/XField3D_6Tet_X1_1Group_btest.cpp: In member function ‘void UnitGrids_test_suite::XField3D_6Tet_X1_1Group_test::test_method()’:
/jenkins/workspace/SANS_Nightly/builddir/undefined_gnu9/buildnode/reynolds/test/unit/UnitGrids/XField3D_6Tet_X1_1Group_btest.cpp:26:23: note: variable tracking size limit exceeded with ‘-fvar-tracking-assignments’, retrying without
   26 | BOOST_AUTO_TEST_CASE( XField3D_6Tet_X1_1Group_test )
      |                       ^~~~~~~~~~~~~~~~~~~~~~~~~~~~
[ 98%] Built target XField3D_6Tet_X1_1Group_btest_OBJECT
[ 98%] Linking CXX executable XField3D_6Tet_X1_1Group_btest
[ 98%] Built target XField3D_6Tet_X1_1Group_btest_build
[ 98%] Checking style of test/unit/UnitGrids/XField3D_8Tet_X1_1Group_btest.cpp
[ 98%] Built target XField3D_8Tet_X1_1Group_btest_build_vera
[ 98%] Building CXX object test/unit/UnitGrids/CMakeFiles/XField3D_8Tet_X1_1Group_btest_OBJECT.dir/XField3D_8Tet_X1_1Group_btest.cpp.o
[ 98%] Built target XField3D_8Tet_X1_1Group_btest_OBJECT
[ 98%] Linking CXX executable XField3D_8Tet_X1_1Group_btest
[ 98%] Built target XField3D_8Tet_X1_1Group_btest_build
[ 98%] Checking style of test/unit/UnitGrids/XField3D_BoxBoundaries_Quad_X1_btest.cpp
[ 98%] Built target XField3D_BoxBoundaries_Quad_X1_btest_build_vera
[ 98%] Building CXX object test/unit/UnitGrids/CMakeFiles/XField3D_BoxBoundaries_Quad_X1_btest_OBJECT.dir/XField3D_BoxBoundaries_Quad_X1_btest.cpp.o
[ 98%] Built target XField3D_BoxBoundaries_Quad_X1_btest_OBJECT
[ 98%] Linking CXX executable XField3D_BoxBoundaries_Quad_X1_btest
[ 98%] Built target XField3D_BoxBoundaries_Quad_X1_btest_build
[ 98%] Checking style of test/unit/UnitGrids/XField3D_BoxBoundary_Quad_X1_btest.cpp
[ 98%] Built target XField3D_BoxBoundary_Quad_X1_btest_build_vera
[100%] Building CXX object test/unit/UnitGrids/CMakeFiles/XField3D_BoxBoundary_Quad_X1_btest_OBJECT.dir/XField3D_BoxBoundary_Quad_X1_btest.cpp.o
[100%] Built target XField3D_BoxBoundary_Quad_X1_btest_OBJECT
[100%] Linking CXX executable XField3D_BoxBoundary_Quad_X1_btest
[100%] Built target XField3D_BoxBoundary_Quad_X1_btest_build
[100%] Checking style of test/unit/UnitGrids/XField3D_Box_Hex_X1_WakeCut_btest.cpp
[100%] Built target XField3D_Box_Hex_X1_WakeCut_btest_build_vera
[100%] Building CXX object test/unit/UnitGrids/CMakeFiles/XField3D_Box_Hex_X1_WakeCut_btest_OBJECT.dir/XField3D_Box_Hex_X1_WakeCut_btest.cpp.o
[100%] Built target XField3D_Box_Hex_X1_WakeCut_btest_OBJECT
[100%] Linking CXX executable XField3D_Box_Hex_X1_WakeCut_btest
[100%] Built target XField3D_Box_Hex_X1_WakeCut_btest_build
[100%] Checking style of test/unit/UnitGrids/XField3D_Box_Hex_X1_btest.cpp
[100%] Built target XField3D_Box_Hex_X1_btest_build_vera
[100%] Building CXX object test/unit/UnitGrids/CMakeFiles/XField3D_Box_Hex_X1_btest_OBJECT.dir/XField3D_Box_Hex_X1_btest.cpp.o
[100%] Built target XField3D_Box_Hex_X1_btest_OBJECT
[100%] Linking CXX executable XField3D_Box_Hex_X1_btest
[100%] Built target XField3D_Box_Hex_X1_btest_build
[100%] Checking style of test/unit/UnitGrids/XField3D_Box_Tet_X1_WakeCut_btest.cpp
[100%] Built target XField3D_Box_Tet_X1_WakeCut_btest_build_vera
[100%] Building CXX object test/unit/UnitGrids/CMakeFiles/XField3D_Box_Tet_X1_WakeCut_btest_OBJECT.dir/XField3D_Box_Tet_X1_WakeCut_btest.cpp.o
[100%] Built target XField3D_Box_Tet_X1_WakeCut_btest_OBJECT
[100%] Linking CXX executable XField3D_Box_Tet_X1_WakeCut_btest
[100%] Built target XField3D_Box_Tet_X1_WakeCut_btest_build
[100%] Checking style of test/unit/UnitGrids/XField3D_Box_Tet_X1_btest.cpp
[100%] Built target XField3D_Box_Tet_X1_btest_build_vera
[100%] Building CXX object test/unit/UnitGrids/CMakeFiles/XField3D_Box_Tet_X1_btest_OBJECT.dir/XField3D_Box_Tet_X1_btest.cpp.o
[100%] Built target XField3D_Box_Tet_X1_btest_OBJECT
[100%] Linking CXX executable XField3D_Box_Tet_X1_btest
[100%] Built target XField3D_Box_Tet_X1_btest_build
[100%] Checking style of test/unit/UnitGrids/XField3D_CornerFlatPlate_X1_btest.cpp
[100%] Built target XField3D_CornerFlatPlate_X1_btest_build_vera
[100%] Building CXX object test/unit/UnitGrids/CMakeFiles/XField3D_CornerFlatPlate_X1_btest_OBJECT.dir/XField3D_CornerFlatPlate_X1_btest.cpp.o
[100%] Built target XField3D_CornerFlatPlate_X1_btest_OBJECT
[100%] Linking CXX executable XField3D_CornerFlatPlate_X1_btest
[100%] Built target XField3D_CornerFlatPlate_X1_btest_build
[100%] Checking style of test/unit/UnitGrids/XField3D_FlatPlate_X1_btest.cpp
[100%] Built target XField3D_FlatPlate_X1_btest_build_vera
[100%] Building CXX object test/unit/UnitGrids/CMakeFiles/XField3D_FlatPlate_X1_btest_OBJECT.dir/XField3D_FlatPlate_X1_btest.cpp.o
[100%] Built target XField3D_FlatPlate_X1_btest_OBJECT
[100%] Linking CXX executable XField3D_FlatPlate_X1_btest
[100%] Built target XField3D_FlatPlate_X1_btest_build
[100%] Checking style of test/unit/UnitGrids/XField3D_ForwardStep_Hex_X1_btest.cpp
[100%] Built target XField3D_ForwardStep_Hex_X1_btest_build_vera
[100%] Building CXX object test/unit/UnitGrids/CMakeFiles/XField3D_ForwardStep_Hex_X1_btest_OBJECT.dir/XField3D_ForwardStep_Hex_X1_btest.cpp.o
[100%] Built target XField3D_ForwardStep_Hex_X1_btest_OBJECT
[100%] Linking CXX executable XField3D_ForwardStep_Hex_X1_btest
[100%] Built target XField3D_ForwardStep_Hex_X1_btest_build
[100%] Checking style of test/unit/UnitGrids/XField3D_GaussianBump_Xq_btest.cpp
[100%] Built target XField3D_GaussianBump_Xq_btest_build_vera
[100%] Building CXX object test/unit/UnitGrids/CMakeFiles/XField3D_GaussianBump_Xq_btest_OBJECT.dir/XField3D_GaussianBump_Xq_btest.cpp.o
[100%] Built target XField3D_GaussianBump_Xq_btest_OBJECT
[100%] Linking CXX executable XField3D_GaussianBump_Xq_btest
[100%] Built target XField3D_GaussianBump_Xq_btest_build
[100%] Checking style of test/unit/UnitGrids/XField3D_Sheet_Quad_X1_btest.cpp
[100%] Built target XField3D_Sheet_Quad_X1_btest_build_vera
[100%] Building CXX object test/unit/UnitGrids/CMakeFiles/XField3D_Sheet_Quad_X1_btest_OBJECT.dir/XField3D_Sheet_Quad_X1_btest.cpp.o
[100%] Built target XField3D_Sheet_Quad_X1_btest_OBJECT
[100%] Linking CXX executable XField3D_Sheet_Quad_X1_btest
[100%] Built target XField3D_Sheet_Quad_X1_btest_build
[100%] Checking style of test/unit/UnitGrids/XField3D_Sheet_Triangle_X1_btest.cpp
[100%] Built target XField3D_Sheet_Triangle_X1_btest_build_vera
[100%] Building CXX object test/unit/UnitGrids/CMakeFiles/XField3D_Sheet_Triangle_X1_btest_OBJECT.dir/XField3D_Sheet_Triangle_X1_btest.cpp.o
[100%] Built target XField3D_Sheet_Triangle_X1_btest_OBJECT
[100%] Linking CXX executable XField3D_Sheet_Triangle_X1_btest
[100%] Built target XField3D_Sheet_Triangle_X1_btest_build
[100%] Checking style of test/unit/UnitGrids/XField3D_Sphere_Triangle_X1_btest.cpp
[100%] Built target XField3D_Sphere_Triangle_X1_btest_build_vera
[100%] Building CXX object test/unit/UnitGrids/CMakeFiles/XField3D_Sphere_Triangle_X1_btest_OBJECT.dir/XField3D_Sphere_Triangle_X1_btest.cpp.o
[100%] Built target XField3D_Sphere_Triangle_X1_btest_OBJECT
[100%] Linking CXX executable XField3D_Sphere_Triangle_X1_btest
[100%] Built target XField3D_Sphere_Triangle_X1_btest_build
[100%] Checking style of test/unit/UnitGrids/XField4D_1Pentatope_X1_1Group_btest.cpp
[100%] Built target XField4D_1Pentatope_X1_1Group_btest_build_vera
[100%] Building CXX object test/unit/UnitGrids/CMakeFiles/XField4D_1Pentatope_X1_1Group_btest_OBJECT.dir/XField4D_1Pentatope_X1_1Group_btest.cpp.o
[100%] Built target XField4D_1Pentatope_X1_1Group_btest_OBJECT
[100%] Linking CXX executable XField4D_1Pentatope_X1_1Group_btest
[100%] Built target XField4D_1Pentatope_X1_1Group_btest_build
[100%] Checking style of test/unit/UnitGrids/XField4D_24Pentatope_X1_1Group_btest.cpp
[100%] Built target XField4D_24Pentatope_X1_1Group_btest_build_vera
[100%] Building CXX object test/unit/UnitGrids/CMakeFiles/XField4D_24Pentatope_X1_1Group_btest_OBJECT.dir/XField4D_24Pentatope_X1_1Group_btest.cpp.o
[100%] Built target XField4D_24Pentatope_X1_1Group_btest_OBJECT
[100%] Linking CXX executable XField4D_24Pentatope_X1_1Group_btest
[100%] Built target XField4D_24Pentatope_X1_1Group_btest_build
[100%] Checking style of test/unit/UnitGrids/XField4D_2Pentatope_X1_1Group_btest.cpp
[100%] Built target XField4D_2Pentatope_X1_1Group_btest_build_vera
[100%] Building CXX object test/unit/UnitGrids/CMakeFiles/XField4D_2Pentatope_X1_1Group_btest_OBJECT.dir/XField4D_2Pentatope_X1_1Group_btest.cpp.o
[100%] Built target XField4D_2Pentatope_X1_1Group_btest_OBJECT
[100%] Linking CXX executable XField4D_2Pentatope_X1_1Group_btest
[100%] Built target XField4D_2Pentatope_X1_1Group_btest_build
[100%] Checking style of test/unit/UnitGrids/XField4D_6Pentatope_X1_1Group_NegativeTraceOrientation_btest.cpp
[100%] Built target XField4D_6Pentatope_X1_1Group_NegativeTraceOrientation_btest_build_vera
[100%] Building CXX object test/unit/UnitGrids/CMakeFiles/XField4D_6Pentatope_X1_1Group_NegativeTraceOrientation_btest_OBJECT.dir/XField4D_6Pentatope_X1_1Group_NegativeTraceOrientation_btest.cpp.o
[100%] Built target XField4D_6Pentatope_X1_1Group_NegativeTraceOrientation_btest_OBJECT
[100%] Linking CXX executable XField4D_6Pentatope_X1_1Group_NegativeTraceOrientation_btest
[100%] Built target XField4D_6Pentatope_X1_1Group_NegativeTraceOrientation_btest_build
[100%] Built target check_unit_build
   Site: reynolds
   Build name: Linux-g++-9
Create new tag: 20220408-1435 - Experimental
Test project /jenkins/workspace/SANS_Nightly/builddir/undefined_gnu9/buildnode/reynolds/build/undefined_gnu9
        Start   1: AnisotropicStepCalculation_btest
  1/910 Test   #1: AnisotropicStepCalculation_btest .................................................................   Passed    1.69 sec
        Start   2: CostModel_LogEuclidian_btest
  2/910 Test   #2: CostModel_LogEuclidian_btest .....................................................................   Passed    2.08 sec
        Start   3: ErrorModel_Local_btest
  3/910 Test   #3: ErrorModel_Local_btest ...........................................................................   Passed    1.54 sec
        Start   4: ErrorModel_btest
  4/910 Test   #4: ErrorModel_btest .................................................................................   Passed    2.45 sec
        Start   5: MOESS_btest
  5/910 Test   #5: MOESS_btest ......................................................................................   Passed    1.56 sec
        Start   6: NodalMetrics_btest
  6/910 Test   #6: NodalMetrics_btest ...............................................................................   Passed    9.03 sec
        Start   7: ParamFieldBuilder_Block2_btest
  7/910 Test   #7: ParamFieldBuilder_Block2_btest ...................................................................   Passed    1.45 sec
        Start   8: ParamFieldBuilder_btest
  8/910 Test   #8: ParamFieldBuilder_btest ..........................................................................   Passed    1.68 sec
        Start   9: ReferenceStepMatrix_btest
  9/910 Test   #9: ReferenceStepMatrix_btest ........................................................................   Passed    1.55 sec
        Start  10: XFieldND_EquilateralRef_btest
 10/910 Test  #10: XFieldND_EquilateralRef_btest ....................................................................   Passed    1.84 sec
        Start  11: MOESS_SANS_Optimizer_MMA_btest
 11/910 Test  #11: MOESS_SANS_Optimizer_MMA_btest ...................................................................   Passed   17.13 sec
        Start  12: ImpliedMetric_Optimizer_NLOPT_btest
 12/910 Test  #12: ImpliedMetric_Optimizer_NLOPT_btest ..............................................................   Passed    2.82 sec
        Start  13: MOESS_Gradation_Optimizer_NLOPT_btest
 13/910 Test  #13: MOESS_Gradation_Optimizer_NLOPT_btest ............................................................   Passed    1.29 sec
        Start  14: MOESS_PX_Optimizer_NLOPT_btest
 14/910 Test  #14: MOESS_PX_Optimizer_NLOPT_btest ...................................................................   Passed    1.79 sec
        Start  15: MOESS_SANS_Optimizer_NLOPT_btest
 15/910 Test  #15: MOESS_SANS_Optimizer_NLOPT_btest .................................................................   Passed    1.79 sec
        Start  16: ImpliedMetric_Optimizer_TAO_btest
 16/910 Test  #16: ImpliedMetric_Optimizer_TAO_btest ................................................................   Passed    2.06 sec
        Start  17: MOESS_SANS_Optimizer_TAO_btest
 17/910 Test  #17: MOESS_SANS_Optimizer_TAO_btest ...................................................................   Passed    1.88 sec
        Start  18: BasisFunctionArea_Quad_Hierarchical_btest
 18/910 Test  #18: BasisFunctionArea_Quad_Hierarchical_btest ........................................................   Passed    1.30 sec
        Start  19: BasisFunctionArea_Quad_Lagrange_btest
 19/910 Test  #19: BasisFunctionArea_Quad_Lagrange_btest ............................................................   Passed    1.31 sec
        Start  20: BasisFunctionArea_Quad_Legendre_btest
 20/910 Test  #20: BasisFunctionArea_Quad_Legendre_btest ............................................................   Passed    1.34 sec
        Start  21: BasisFunctionArea_Triangle_Bernstein_btest
 21/910 Test  #21: BasisFunctionArea_Triangle_Bernstein_btest .......................................................   Passed    1.29 sec
        Start  22: BasisFunctionArea_Triangle_HierarchicalP1to4_btest
 22/910 Test  #22: BasisFunctionArea_Triangle_HierarchicalP1to4_btest ...............................................   Passed    1.29 sec
        Start  23: BasisFunctionArea_Triangle_HierarchicalP5to6_btest
 23/910 Test  #23: BasisFunctionArea_Triangle_HierarchicalP5to6_btest ...............................................   Passed    1.30 sec
        Start  24: BasisFunctionArea_Triangle_HierarchicalP7_btest
 24/910 Test  #24: BasisFunctionArea_Triangle_HierarchicalP7_btest ..................................................   Passed    1.28 sec
        Start  25: BasisFunctionArea_Triangle_Lagrange_btest
 25/910 Test  #25: BasisFunctionArea_Triangle_Lagrange_btest ........................................................   Passed    1.31 sec
        Start  26: BasisFunctionArea_Triangle_Legendre_btest
 26/910 Test  #26: BasisFunctionArea_Triangle_Legendre_btest ........................................................   Passed    1.29 sec
        Start  27: BasisFunctionLine_btest
 27/910 Test  #27: BasisFunctionLine_btest ..........................................................................   Passed    1.30 sec
        Start  28: BasisFunctionNode_btest
 28/910 Test  #28: BasisFunctionNode_btest ..........................................................................   Passed    1.30 sec
        Start  29: BasisFunctionSpacetime_Pentatope_Bernstein_btest
 29/910 Test  #29: BasisFunctionSpacetime_Pentatope_Bernstein_btest .................................................   Passed    1.36 sec
        Start  30: BasisFunctionSpacetime_Pentatope_Lagrange_btest
 30/910 Test  #30: BasisFunctionSpacetime_Pentatope_Lagrange_btest ..................................................   Passed    1.36 sec
        Start  31: BasisFunctionSpacetime_Pentatope_Legendre_btest
 31/910 Test  #31: BasisFunctionSpacetime_Pentatope_Legendre_btest ..................................................   Passed    1.37 sec
        Start  32: BasisFunctionVolume_Hexahedron_Hierarchical_btest
 32/910 Test  #32: BasisFunctionVolume_Hexahedron_Hierarchical_btest ................................................   Passed    1.31 sec
        Start  33: BasisFunctionVolume_Hexahedron_Lagrange_btest
 33/910 Test  #33: BasisFunctionVolume_Hexahedron_Lagrange_btest ....................................................   Passed    1.36 sec
        Start  34: BasisFunctionVolume_Hexahedron_Legendre_btest
 34/910 Test  #34: BasisFunctionVolume_Hexahedron_Legendre_btest ....................................................   Passed    1.35 sec
        Start  35: BasisFunctionVolume_Tetrahedron_Bernstein_btest
 35/910 Test  #35: BasisFunctionVolume_Tetrahedron_Bernstein_btest ..................................................   Passed    1.29 sec
        Start  36: BasisFunctionVolume_Tetrahedron_Hierarchical_btest
 36/910 Test  #36: BasisFunctionVolume_Tetrahedron_Hierarchical_btest ...............................................   Passed    1.29 sec
        Start  37: BasisFunctionVolume_Tetrahedron_Lagrange_btest
 37/910 Test  #37: BasisFunctionVolume_Tetrahedron_Lagrange_btest ...................................................   Passed    1.29 sec
        Start  38: BasisFunctionVolume_Tetrahedron_Legendre_btest
 38/910 Test  #38: BasisFunctionVolume_Tetrahedron_Legendre_btest ...................................................   Passed    1.30 sec
        Start  39: BasisFunction_RefElement_Split_TraceToCell_btest
 39/910 Test  #39: BasisFunction_RefElement_Split_TraceToCell_btest .................................................   Passed    1.28 sec
        Start  40: BasisFunction_RefElement_Split_btest
 40/910 Test  #40: BasisFunction_RefElement_Split_btest .............................................................   Passed    1.28 sec
        Start  41: BasisFunction_TraceOrientation_btest
 41/910 Test  #41: BasisFunction_TraceOrientation_btest .............................................................   Passed    1.27 sec
        Start  42: ElementEdges_btest
 42/910 Test  #42: ElementEdges_btest ...............................................................................   Passed    1.27 sec
        Start  43: ElementFrame_btest
 43/910 Test  #43: ElementFrame_btest ...............................................................................   Passed    1.26 sec
        Start  44: LagrangeDOFMap_btest
 44/910 Test  #44: LagrangeDOFMap_btest .............................................................................   Passed    1.47 sec
        Start  45: ReferenceElement_btest
 45/910 Test  #45: ReferenceElement_btest ...........................................................................   Passed    1.27 sec
        Start  46: TraceToCellRefCoord_Hexahedron_btest
 46/910 Test  #46: TraceToCellRefCoord_Hexahedron_btest .............................................................   Passed    1.31 sec
        Start  47: TraceToCellRefCoord_Line_btest
 47/910 Test  #47: TraceToCellRefCoord_Line_btest ...................................................................   Passed    1.29 sec
        Start  48: TraceToCellRefCoord_Pentatope_btest
 48/910 Test  #48: TraceToCellRefCoord_Pentatope_btest ..............................................................   Passed    1.43 sec
        Start  49: TraceToCellRefCoord_Quad_btest
 49/910 Test  #49: TraceToCellRefCoord_Quad_btest ...................................................................   Passed    1.28 sec
        Start  50: TraceToCellRefCoord_Tetrahedron_btest
 50/910 Test  #50: TraceToCellRefCoord_Tetrahedron_btest ............................................................   Passed    1.29 sec
        Start  51: TraceToCellRefCoord_Triangle_btest
 51/910 Test  #51: TraceToCellRefCoord_Triangle_btest ...............................................................   Passed    1.29 sec
        Start  52: AlgebraicEquationSet_Block2x2_DGBR2_BuckleyLeverett_ArtificialViscosity_ST_btest
 52/910 Test  #52: AlgebraicEquationSet_Block2x2_DGBR2_BuckleyLeverett_ArtificialViscosity_ST_btest .................   Passed    4.10 sec
        Start  53: AlgebraicEquationSet_Block2x2_DGBR2_Line_Euler1DSensor_btest
 53/910 Test  #53: AlgebraicEquationSet_Block2x2_DGBR2_Line_Euler1DSensor_btest .....................................   Passed    2.06 sec
        Start  54: AlgebraicEquationSet_Block2x2_DGBR2_Triangle_BuckleyLeverett_AV_btest
 54/910 Test  #54: AlgebraicEquationSet_Block2x2_DGBR2_Triangle_BuckleyLeverett_AV_btest ............................   Passed    2.10 sec
        Start  55: AlgebraicEquationSet_Block2x2_Triangle_AD_btest
 55/910 Test  #55: AlgebraicEquationSet_Block2x2_Triangle_AD_btest ..................................................   Passed    1.70 sec
        Start  56: AlgebraicEquationSet_Block3x3_Auxv_Auxi_IBLFourEqn_Quad_btest
 56/910 Test  #56: AlgebraicEquationSet_Block3x3_Auxv_Auxi_IBLFourEqn_Quad_btest ....................................   Passed   45.10 sec
        Start  57: AlgebraicEquationSet_Block3x3_Auxv_Auxi_IBL_Quad_btest
 57/910 Test  #57: AlgebraicEquationSet_Block3x3_Auxv_Auxi_IBL_Quad_btest ...........................................   Passed   45.60 sec
        Start  58: AlgebraicEquationSet_Block3x3_Auxv_Auxi_IBL_Triangle_btest
 58/910 Test  #58: AlgebraicEquationSet_Block3x3_Auxv_Auxi_IBL_Triangle_btest .......................................   Passed    4.33 sec
        Start  59: AlgebraicEquationSet_Block4x4_Auxv_Auxi_CutCellForcedTransitionIBL_Panel_btest
 59/910 Test  #59: AlgebraicEquationSet_Block4x4_Auxv_Auxi_CutCellForcedTransitionIBL_Panel_btest ...................   Passed   16.47 sec
        Start  60: AlgebraicEquationSet_Block4x4_Auxv_Auxi_CutCellNaturalTransitionIBL_Panel_btest
 60/910 Test  #60: AlgebraicEquationSet_Block4x4_Auxv_Auxi_CutCellNaturalTransitionIBL_Panel_btest ..................   Passed   16.21 sec
        Start  61: AlgebraicEquationSet_Block4x4_Auxv_Auxi_HDGAdvIBL_Panel_btest
 61/910 Test  #61: AlgebraicEquationSet_Block4x4_Auxv_Auxi_HDGAdvIBL_Panel_btest ....................................   Passed   13.49 sec
        Start  62: AlgebraicEquationSet_Block4x4_Auxv_Auxi_HubtraceHDGAdvIBL_CutCellNaturalTransition_Panel_btest
 62/910 Test  #62: AlgebraicEquationSet_Block4x4_Auxv_Auxi_HubtraceHDGAdvIBL_CutCellNaturalTransition_Panel_btest ...   Passed   29.39 sec
        Start  63: AlgebraicEquationSet_Block4x4_Auxv_Auxi_IBL_Panel_btest
 63/910 Test  #63: AlgebraicEquationSet_Block4x4_Auxv_Auxi_IBL_Panel_btest ..........................................   Passed   13.12 sec
        Start  64: AlgebraicEquationSet_Block4x4_FP_Auxv_Auxi_IBL3_Quad_btest
 64/910 Test  #64: AlgebraicEquationSet_Block4x4_FP_Auxv_Auxi_IBL3_Quad_btest .......................................   Passed   96.69 sec
        Start  65: AlgebraicEquationSet_Block4x4_Heat1D_btest
 65/910 Test  #65: AlgebraicEquationSet_Block4x4_Heat1D_btest .......................................................   Passed    1.30 sec
        Start  66: ResidualParamSensitivity_CG_Triangle_AD_btest
 66/910 Test  #66: ResidualParamSensitivity_CG_Triangle_AD_btest ....................................................   Passed    1.77 sec
        Start  67: Adjoint_LiftingOperator_DGBR2_Triangle_AD_btest
 67/910 Test  #67: Adjoint_LiftingOperator_DGBR2_Triangle_AD_btest ..................................................   Passed    3.09 sec
        Start  68: Adjoint_LiftingOperator_DGBR2_Triangle_NS_btest
 68/910 Test  #68: Adjoint_LiftingOperator_DGBR2_Triangle_NS_btest ..................................................   Passed    6.17 sec
        Start  69: AlgebraicEquationSet_DGAdvective_BuckleyLeverett_ST_btest
 69/910 Test  #69: AlgebraicEquationSet_DGAdvective_BuckleyLeverett_ST_btest ........................................   Passed    1.82 sec
        Start  70: AlgebraicEquationSet_DGAdvective_Line_IBL_airfoilOnly_btest
 70/910 Test  #70: AlgebraicEquationSet_DGAdvective_Line_IBL_airfoilOnly_btest ......................................   Passed    1.74 sec
        Start  71: AlgebraicEquationSet_DGAdvective_Triangle_AD_btest
 71/910 Test  #71: AlgebraicEquationSet_DGAdvective_Triangle_AD_btest ...............................................   Passed    1.71 sec
        Start  72: AlgebraicEquationSet_DGBR2_BuckleyLeverett_ST_btest
 72/910 Test  #72: AlgebraicEquationSet_DGBR2_BuckleyLeverett_ST_btest ..............................................   Passed    2.26 sec
        Start  73: AlgebraicEquationSet_DGBR2_Quad_SA_btest
 73/910 Test  #73: AlgebraicEquationSet_DGBR2_Quad_SA_btest .........................................................   Passed    2.22 sec
        Start  74: AlgebraicEquationSet_DGBR2_Triangle_AD_btest
 74/910 Test  #74: AlgebraicEquationSet_DGBR2_Triangle_AD_btest .....................................................   Passed    2.04 sec
        Start  75: AlgebraicEquationSet_DGBR2_Triangle_SA_btest
 75/910 Test  #75: AlgebraicEquationSet_DGBR2_Triangle_SA_btest .....................................................   Passed    4.17 sec
        Start  76: AlgebraicEquationSet_Local_DGBR2_Triangle_AD_btest
 76/910 Test  #76: AlgebraicEquationSet_Local_DGBR2_Triangle_AD_btest ...............................................   Passed    1.87 sec
        Start  77: DiscretizationDGBR2_btest
 77/910 Test  #77: DiscretizationDGBR2_btest ........................................................................   Passed    1.33 sec
        Start  78: ElementIntegral_DGBR2_2D_Triangle_AD_btest
 78/910 Test  #78: ElementIntegral_DGBR2_2D_Triangle_AD_btest .......................................................   Passed    1.33 sec
        Start  79: FunctionalBoundaryTrace_DGBR2_btest
 79/910 Test  #79: FunctionalBoundaryTrace_DGBR2_btest ..............................................................   Passed    1.40 sec
        Start  80: FunctionalCell_DGBR2_btest
 80/910 Test  #80: FunctionalCell_DGBR2_btest .......................................................................   Passed    1.41 sec
        Start  81: FunctionalCellwise_DGBR2_btest
 81/910 Test  #81: FunctionalCellwise_DGBR2_btest ...................................................................   Passed    1.56 sec
        Start  82: IntegrandBoundaryTrace_Dirichlet_mitState_DGBR2_AD_btest
 82/910 Test  #82: IntegrandBoundaryTrace_Dirichlet_mitState_DGBR2_AD_btest .........................................   Passed    1.36 sec
        Start  83: IntegrandBoundaryTrace_Dirichlet_mitState_DGBR2_BuckleyLeverett_btest
 83/910 Test  #83: IntegrandBoundaryTrace_Dirichlet_mitState_DGBR2_BuckleyLeverett_btest ............................   Passed    1.29 sec
        Start  84: IntegrandBoundaryTrace_Flux_mitState_DGBR2_AD_btest
 84/910 Test  #84: IntegrandBoundaryTrace_Flux_mitState_DGBR2_AD_btest ..............................................   Passed    1.34 sec
        Start  85: IntegrandBoundaryTrace_Flux_mitState_DGBR2_NS_btest
 85/910 Test  #85: IntegrandBoundaryTrace_Flux_mitState_DGBR2_NS_btest ..............................................   Passed    1.33 sec
        Start  86: IntegrandBoundaryTrace_LinearScalar_sansLG_DGBR2_AD_btest
 86/910 Test  #86: IntegrandBoundaryTrace_LinearScalar_sansLG_DGBR2_AD_btest ........................................   Passed    1.32 sec
        Start  87: IntegrandBoundaryTrace_Output_DGBR2_btest
 87/910 Test  #87: IntegrandBoundaryTrace_Output_DGBR2_btest ........................................................   Passed    1.33 sec
        Start  88: IntegrandBoundaryTrace_Reflect_mitState_DGBR2_NS_btest
 88/910 Test  #88: IntegrandBoundaryTrace_Reflect_mitState_DGBR2_NS_btest ...........................................   Passed    1.71 sec
        Start  89: IntegrandCell_DGAdvective_Euler2D_btest
 89/910 Test  #89: IntegrandCell_DGAdvective_Euler2D_btest ..........................................................   Passed    1.37 sec
        Start  90: IntegrandCell_DGBR2_AD_btest
 90/910 Test  #90: IntegrandCell_DGBR2_AD_btest .....................................................................   Passed    1.34 sec
        Start  91: IntegrandCell_DGBR2_CR_btest
 91/910 Test  #91: IntegrandCell_DGBR2_CR_btest .....................................................................   Passed    1.34 sec
        Start  92: IntegrandCell_DGBR2_Output_btest
 92/910 Test  #92: IntegrandCell_DGBR2_Output_btest .................................................................   Passed    1.35 sec
        Start  93: IntegrandInteriorTrace_DGBR2_AD_btest
 93/910 Test  #93: IntegrandInteriorTrace_DGBR2_AD_btest ............................................................   Passed    1.37 sec
        Start  94: IntegrandInteriorTrace_DGBR2_Sensor_btest
 94/910 Test  #94: IntegrandInteriorTrace_DGBR2_Sensor_btest ........................................................   Passed    1.32 sec
        Start  95: JacobianBoundaryTrace_Dirichlet_mitState_DGBR2_AD_btest
 95/910 Test  #95: JacobianBoundaryTrace_Dirichlet_mitState_DGBR2_AD_btest ..........................................   Passed    1.75 sec
        Start  96: JacobianBoundaryTrace_Dirichlet_mitState_DGBR2_TwoPhase_btest
 96/910 Test  #96: JacobianBoundaryTrace_Dirichlet_mitState_DGBR2_TwoPhase_btest ....................................   Passed    2.59 sec
        Start  97: JacobianBoundaryTrace_LinearScalar_sansLG_DGBR2_AD_btest
 97/910 Test  #97: JacobianBoundaryTrace_LinearScalar_sansLG_DGBR2_AD_btest .........................................   Passed    1.71 sec
        Start  98: JacobianCell_DGBR2_AD_btest
 98/910 Test  #98: JacobianCell_DGBR2_AD_btest ......................................................................   Passed    1.66 sec
        Start  99: JacobianCell_DGBR2_LiftedQuantity_TwoPhaseAV_btest
 99/910 Test  #99: JacobianCell_DGBR2_LiftedQuantity_TwoPhaseAV_btest ...............................................   Passed    5.37 sec
        Start 100: JacobianCell_DGBR2_LiftingOperator_AD_btest
100/910 Test #100: JacobianCell_DGBR2_LiftingOperator_AD_btest ......................................................   Passed    1.83 sec
        Start 101: JacobianCell_DGBR2_LiftingOperator_LiftedQuantity_TwoPhaseAV_btest
101/910 Test #101: JacobianCell_DGBR2_LiftingOperator_LiftedQuantity_TwoPhaseAV_btest ...............................   Passed    4.92 sec
        Start 102: JacobianCell_DGBR2_Param_Euler1D_btest
102/910 Test #102: JacobianCell_DGBR2_Param_Euler1D_btest ...........................................................   Passed    1.38 sec
        Start 103: JacobianCell_DGBR2_TwoPhase_btest
103/910 Test #103: JacobianCell_DGBR2_TwoPhase_btest ................................................................   Passed    2.60 sec
        Start 104: JacobianFunctionalBoundaryTrace_DGBR2_btest
104/910 Test #104: JacobianFunctionalBoundaryTrace_DGBR2_btest ......................................................   Passed    1.85 sec
        Start 105: JacobianFunctionalCell_DGBR2_btest
105/910 Test #105: JacobianFunctionalCell_DGBR2_btest ...............................................................   Passed    1.55 sec
        Start 106: JacobianInteriorTrace_DGBR2_AD_btest
106/910 Test #106: JacobianInteriorTrace_DGBR2_AD_btest .............................................................   Passed   13.33 sec
        Start 107: JacobianInteriorTrace_DGBR2_Param_Euler1D_btest
107/910 Test #107: JacobianInteriorTrace_DGBR2_Param_Euler1D_btest ..................................................   Passed    1.41 sec
        Start 108: JacobianInteriorTrace_DGBR2_TwoPhase_btest
108/910 Test #108: JacobianInteriorTrace_DGBR2_TwoPhase_btest .......................................................   Passed    2.36 sec
        Start 109: JacobianTranspose_DGBR2_Triangle_AD_btest
109/910 Test #109: JacobianTranspose_DGBR2_Triangle_AD_btest ........................................................   Passed    1.59 sec
        Start 110: ResidualBoundaryTrace_Dirichlet_mitState_DGBR2_AD_btest
110/910 Test #110: ResidualBoundaryTrace_Dirichlet_mitState_DGBR2_AD_btest ..........................................   Passed    1.38 sec
        Start 111: ResidualBoundaryTrace_LinearScalar_sansLG_DGBR2_AD_btest
111/910 Test #111: ResidualBoundaryTrace_LinearScalar_sansLG_DGBR2_AD_btest .........................................   Passed    1.47 sec
        Start 112: ResidualCell_DGAdvective_Euler2D_btest
112/910 Test #112: ResidualCell_DGAdvective_Euler2D_btest ...........................................................   Passed    1.35 sec
        Start 113: ResidualCell_DGBR2_AD_btest
113/910 Test #113: ResidualCell_DGBR2_AD_btest ......................................................................   Passed    1.55 sec
        Start 114: ResidualCell_DGBR2_LiftedQuantity_TwoPhaseAV_btest
114/910 Test #114: ResidualCell_DGBR2_LiftedQuantity_TwoPhaseAV_btest ...............................................   Passed    1.66 sec
        Start 115: ResidualInteriorTrace_DGBR2_AD_btest
115/910 Test #115: ResidualInteriorTrace_DGBR2_AD_btest .............................................................   Passed    1.46 sec
        Start 116: SetFieldBoundaryTrace_DGBR2_LO_AD_Dirichlet_mitState_btest
116/910 Test #116: SetFieldBoundaryTrace_DGBR2_LO_AD_Dirichlet_mitState_btest .......................................   Passed    1.65 sec
        Start 117: SetFieldInteriorTrace_DGBR2_LiftedQuantity_TwoPhaseAV_btest
117/910 Test #117: SetFieldInteriorTrace_DGBR2_LiftedQuantity_TwoPhaseAV_btest ......................................   Passed    1.65 sec
        Start 118: SetFieldInteriorTrace_DGBR2_LiftingOperator_AD_btest
118/910 Test #118: SetFieldInteriorTrace_DGBR2_LiftingOperator_AD_btest .............................................   Passed    1.66 sec
        Start 119: SolutionData_DGBR2_Block2_btest
119/910 Test #119: SolutionData_DGBR2_Block2_btest ..................................................................   Passed    1.59 sec
        Start 120: SolutionData_DGBR2_btest
120/910 Test #120: SolutionData_DGBR2_btest .........................................................................   Passed    1.51 sec
        Start 121: AlgebraicEquationSet_Galerkin_BuckleyLeverett_ST_btest
121/910 Test #121: AlgebraicEquationSet_Galerkin_BuckleyLeverett_ST_btest ...........................................   Passed    1.90 sec
        Start 122: AlgebraicEquationSet_Galerkin_Stabilized_Triangle_AD_btest
122/910 Test #122: AlgebraicEquationSet_Galerkin_Stabilized_Triangle_AD_btest .......................................   Passed   17.33 sec
        Start 123: AlgebraicEquationSet_Galerkin_Stabilized_Triangle_SA_btest
123/910 Test #123: AlgebraicEquationSet_Galerkin_Stabilized_Triangle_SA_btest .......................................   Passed   60.47 sec
        Start 124: AlgebraicEquationSet_Galerkin_Triangle_AD_btest
124/910 Test #124: AlgebraicEquationSet_Galerkin_Triangle_AD_btest ..................................................   Passed    4.03 sec
        Start 125: AlgebraicEquationSet_Local_Galerkin_Stabilized_Triangle_AD_btest
125/910 Test #125: AlgebraicEquationSet_Local_Galerkin_Stabilized_Triangle_AD_btest .................................   Passed    2.51 sec
        Start 126: AlgebraicEquationSet_Local_Galerkin_Stabilized_Triangle_Euler_btest
126/910 Test #126: AlgebraicEquationSet_Local_Galerkin_Stabilized_Triangle_Euler_btest ..............................   Passed    1.91 sec
        Start 127: AlgebraicEquationSet_ProjectFunction_btest
127/910 Test #127: AlgebraicEquationSet_ProjectFunction_btest .......................................................   Passed    1.37 sec
        Start 128: ElementIntegral_Galerkin_2D_Triangle_AD_btest
128/910 Test #128: ElementIntegral_Galerkin_2D_Triangle_AD_btest ....................................................   Passed    1.35 sec
        Start 129: ExtractCGLocalBoundaries_btest
129/910 Test #129: ExtractCGLocalBoundaries_btest ...................................................................   Passed    1.63 sec
        Start 130: FunctionalBoundaryTrace_Dispatch_Galerkin_AD_btest
130/910 Test #130: FunctionalBoundaryTrace_Dispatch_Galerkin_AD_btest ...............................................   Passed    1.40 sec
        Start 131: FunctionalBoundaryTrace_Galerkin_btest
131/910 Test #131: FunctionalBoundaryTrace_Galerkin_btest ...........................................................   Passed    1.44 sec
        Start 132: FunctionalBoundaryTrace_WeightedResidual_Galerkin_btest
132/910 Test #132: FunctionalBoundaryTrace_WeightedResidual_Galerkin_btest ..........................................   Passed    1.38 sec
        Start 133: FunctionalCell_Galerkin_btest
133/910 Test #133: FunctionalCell_Galerkin_btest ....................................................................   Passed    1.39 sec
        Start 134: IntegrandBoundaryTrace_Dirichlet_Galerkin_HSM2D_btest
134/910 Test #134: IntegrandBoundaryTrace_Dirichlet_Galerkin_HSM2D_btest ............................................   Passed    1.31 sec
        Start 135: IntegrandBoundaryTrace_Dirichlet_mitLG_Galerkin_AD_btest
135/910 Test #135: IntegrandBoundaryTrace_Dirichlet_mitLG_Galerkin_AD_btest .........................................   Passed    1.33 sec
        Start 136: IntegrandBoundaryTrace_Dirichlet_mitLG_Galerkin_Euler_btest
136/910 Test #136: IntegrandBoundaryTrace_Dirichlet_mitLG_Galerkin_Euler_btest ......................................   Passed    1.28 sec
        Start 137: IntegrandBoundaryTrace_Dirichlet_mitState_Galerkin_Euler_btest
137/910 Test #137: IntegrandBoundaryTrace_Dirichlet_mitState_Galerkin_Euler_btest ...................................   Passed    1.31 sec
        Start 138: IntegrandBoundaryTrace_Dirichlet_sansLG_Galerkin_Euler_btest
138/910 Test #138: IntegrandBoundaryTrace_Dirichlet_sansLG_Galerkin_Euler_btest .....................................   Passed    1.32 sec
        Start 139: IntegrandBoundaryTrace_Flux_mitState_Nitsche_AD_btest
139/910 Test #139: IntegrandBoundaryTrace_Flux_mitState_Nitsche_AD_btest ............................................   Passed    1.38 sec
        Start 140: IntegrandBoundaryTrace_LinearScalar_mitLG_Galerkin_AD_btest
140/910 Test #140: IntegrandBoundaryTrace_LinearScalar_mitLG_Galerkin_AD_btest ......................................   Passed    1.35 sec
        Start 141: IntegrandBoundaryTrace_LinearScalar_sansLG_Galerkin_AD_btest
141/910 Test #141: IntegrandBoundaryTrace_LinearScalar_sansLG_Galerkin_AD_btest .....................................   Passed    1.36 sec
        Start 142: IntegrandBoundaryTrace_None_Galerkin_AD_btest
142/910 Test #142: IntegrandBoundaryTrace_None_Galerkin_AD_btest ....................................................   Passed    1.36 sec
        Start 143: IntegrandBoundaryTrace_Output_Galerkin_btest
143/910 Test #143: IntegrandBoundaryTrace_Output_Galerkin_btest .....................................................   Passed    1.32 sec
        Start 144: IntegrandBoundaryTrace_Robin_sansLG_Galerkin_IncNS_btest
144/910 Test #144: IntegrandBoundaryTrace_Robin_sansLG_Galerkin_IncNS_btest .........................................   Passed    1.28 sec
        Start 145: IntegrandBoundaryTrace_Robin_sansLG_Galerkin_IncRANSSA_btest
145/910 Test #145: IntegrandBoundaryTrace_Robin_sansLG_Galerkin_IncRANSSA_btest .....................................   Passed    1.28 sec
        Start 146: IntegrandCell_Galerkin_AD_btest
146/910 Test #146: IntegrandCell_Galerkin_AD_btest ..................................................................   Passed    1.36 sec
        Start 147: IntegrandCell_Galerkin_BDF_AD_btest
147/910 Test #147: IntegrandCell_Galerkin_BDF_AD_btest ..............................................................   Passed    1.31 sec
        Start 148: IntegrandCell_Galerkin_CR_btest
148/910 Test #148: IntegrandCell_Galerkin_CR_btest ..................................................................   Passed    1.32 sec
        Start 149: IntegrandCell_Galerkin_Conservative_btest
149/910 Test #149: IntegrandCell_Galerkin_Conservative_btest ........................................................   Passed    1.30 sec
        Start 150: IntegrandCell_Galerkin_HB_AD_btest
150/910 Test #150: IntegrandCell_Galerkin_HB_AD_btest ...............................................................   Passed    1.28 sec
        Start 151: IntegrandCell_Galerkin_HSM2D_btest
151/910 Test #151: IntegrandCell_Galerkin_HSM2D_btest ...............................................................   Passed    1.35 sec
        Start 152: IntegrandCell_Galerkin_HSMKL_btest
152/910 Test #152: IntegrandCell_Galerkin_HSMKL_btest ...............................................................   Passed    1.32 sec
        Start 153: IntegrandCell_Galerkin_IRS_AD_btest
153/910 Test #153: IntegrandCell_Galerkin_IRS_AD_btest ..............................................................   Passed    1.32 sec
        Start 154: IntegrandCell_Galerkin_Output_AD_btest
154/910 Test #154: IntegrandCell_Galerkin_Output_AD_btest ...........................................................   Passed    1.32 sec
        Start 155: IntegrandCell_Galerkin_Output_Stabilized_AD_btest
155/910 Test #155: IntegrandCell_Galerkin_Output_Stabilized_AD_btest ................................................   Passed    1.36 sec
        Start 156: IntegrandCell_Galerkin_PTC_AD_btest
156/910 Test #156: IntegrandCell_Galerkin_PTC_AD_btest ..............................................................   Passed    1.31 sec
        Start 157: IntegrandCell_Galerkin_ShallowWater1D_btest
157/910 Test #157: IntegrandCell_Galerkin_ShallowWater1D_btest ......................................................   Passed    1.32 sec
        Start 158: IntegrandCell_Galerkin_Stabilized_AD_btest
158/910 Test #158: IntegrandCell_Galerkin_Stabilized_AD_btest .......................................................   Passed    1.40 sec
        Start 159: IntegrandCell_Galerkin_Stabilized_Corrected_AD_btest
159/910 Test #159: IntegrandCell_Galerkin_Stabilized_Corrected_AD_btest .............................................   Passed    1.29 sec
        Start 160: IntegrandCell_Galerkin_Stabilized_NS_btest
160/910 Test #160: IntegrandCell_Galerkin_Stabilized_NS_btest .......................................................   Passed    2.05 sec
        Start 161: IntegrandCell_Galerkin_StrongForm_AD_btest
161/910 Test #161: IntegrandCell_Galerkin_StrongForm_AD_btest .......................................................   Passed    1.32 sec
        Start 162: IntegrandCell_ProjectFunction_btest
162/910 Test #162: IntegrandCell_ProjectFunction_btest ..............................................................   Passed    1.31 sec
        Start 163: IntegrandCell_Project_btest
163/910 Test #163: IntegrandCell_Project_btest ......................................................................   Passed    1.28 sec
        Start 164: IntegrandInteriorTrace_Galerkin_AD_btest
164/910 Test #164: IntegrandInteriorTrace_Galerkin_AD_btest .........................................................   Passed    1.40 sec
        Start 165: IntegrandInteriorTrace_Galerkin_CR_btest
165/910 Test #165: IntegrandInteriorTrace_Galerkin_CR_btest .........................................................   Passed    1.32 sec
        Start 166: IntegrandInteriorTrace_Galerkin_StrongForm_AD_btest
166/910 Test #166: IntegrandInteriorTrace_Galerkin_StrongForm_AD_btest ..............................................   Passed    1.35 sec
        Start 167: IntegrandInteriorTrace_SIP_Galerkin_AD_btest
167/910 Test #167: IntegrandInteriorTrace_SIP_Galerkin_AD_btest .....................................................   Passed    1.34 sec
        Start 168: IntegrateBoundaryTrace_Dispatch_Galerkin_AD_1D_btest
168/910 Test #168: IntegrateBoundaryTrace_Dispatch_Galerkin_AD_1D_btest .............................................   Passed    1.35 sec
        Start 169: JacobianBoundaryTrace_Dirichlet_mitLG_Galerkin_AD_btest
169/910 Test #169: JacobianBoundaryTrace_Dirichlet_mitLG_Galerkin_AD_btest ..........................................   Passed    1.36 sec
        Start 170: JacobianBoundaryTrace_LinearScalar_mitLG_Galerkin_AD_btest
170/910 Test #170: JacobianBoundaryTrace_LinearScalar_mitLG_Galerkin_AD_btest .......................................   Passed    1.47 sec
        Start 171: JacobianBoundaryTrace_LinearScalar_sansLG_Galerkin_AD_btest
171/910 Test #171: JacobianBoundaryTrace_LinearScalar_sansLG_Galerkin_AD_btest ......................................   Passed    1.55 sec
        Start 172: JacobianCell_Galerkin_AD_ArtificialViscosity_btest
172/910 Test #172: JacobianCell_Galerkin_AD_ArtificialViscosity_btest ...............................................   Passed    1.49 sec
        Start 173: JacobianCell_Galerkin_AD_btest
173/910 Test #173: JacobianCell_Galerkin_AD_btest ...................................................................   Passed    2.15 sec
        Start 174: JacobianCell_Galerkin_BDF_AD_btest
174/910 Test #174: JacobianCell_Galerkin_BDF_AD_btest ...............................................................   Passed    1.45 sec
        Start 175: JacobianCell_Galerkin_CR_btest
175/910 Test #175: JacobianCell_Galerkin_CR_btest ...................................................................   Passed    1.36 sec
        Start 176: JacobianCell_Galerkin_IRS_AD_btest
176/910 Test #176: JacobianCell_Galerkin_IRS_AD_btest ...............................................................   Passed    1.37 sec
        Start 177: JacobianCell_Galerkin_PTC_AD_btest
177/910 Test #177: JacobianCell_Galerkin_PTC_AD_btest ...............................................................   Passed    1.38 sec
        Start 178: JacobianCell_Galerkin_Stabilized_AD_btest
178/910 Test #178: JacobianCell_Galerkin_Stabilized_AD_btest ........................................................   Passed    2.51 sec
        Start 179: JacobianCell_Galerkin_Stabilized_NS_btest
179/910 Test #179: JacobianCell_Galerkin_Stabilized_NS_btest ........................................................   Passed    5.40 sec
        Start 180: JacobianFunctionalBoundaryTrace_Galerkin_HSM2D_btest
180/910 Test #180: JacobianFunctionalBoundaryTrace_Galerkin_HSM2D_btest .............................................   Passed    1.43 sec
        Start 181: JacobianFunctionalBoundaryTrace_WeightedResidual_Galerkin_btest
181/910 Test #181: JacobianFunctionalBoundaryTrace_WeightedResidual_Galerkin_btest ..................................   Passed    1.78 sec
        Start 182: JacobianFunctionalCell_Galerkin_btest
182/910 Test #182: JacobianFunctionalCell_Galerkin_btest ............................................................   Passed    1.55 sec
        Start 183: JacobianInteriorTrace_Galerkin_AD_btest
183/910 Test #183: JacobianInteriorTrace_Galerkin_AD_btest ..........................................................   Passed    1.64 sec
        Start 184: JacobianNonZeroPattern_Galerkin_Triangle_AD_btest
184/910 Test #184: JacobianNonZeroPattern_Galerkin_Triangle_AD_btest ................................................   Passed    1.47 sec
        Start 185: JacobianTranspose_Galerkin_Triangle_AD_btest
185/910 Test #185: JacobianTranspose_Galerkin_Triangle_AD_btest .....................................................   Passed    1.40 sec
        Start 186: ResidualBoundaryTrace_LinearScalar_mitLG_Galerkin_AD_btest
186/910 Test #186: ResidualBoundaryTrace_LinearScalar_mitLG_Galerkin_AD_btest .......................................   Passed    1.53 sec
        Start 187: ResidualBoundaryTrace_None_Galerkin_AD_btest
187/910 Test #187: ResidualBoundaryTrace_None_Galerkin_AD_btest .....................................................   Passed    1.32 sec
        Start 188: ResidualCell_Galerkin_AD_btest
188/910 Test #188: ResidualCell_Galerkin_AD_btest ...................................................................   Passed    1.44 sec
        Start 189: ResidualCell_Galerkin_BDF_AD_btest
189/910 Test #189: ResidualCell_Galerkin_BDF_AD_btest ...............................................................   Passed    1.44 sec
        Start 190: ResidualCell_Galerkin_CR_btest
190/910 Test #190: ResidualCell_Galerkin_CR_btest ...................................................................   Passed    1.35 sec
        Start 191: ResidualCell_Galerkin_HSM2D_btest
191/910 Test #191: ResidualCell_Galerkin_HSM2D_btest ................................................................   Passed    1.45 sec
        Start 192: ResidualCell_Galerkin_IRS_AD_btest
192/910 Test #192: ResidualCell_Galerkin_IRS_AD_btest ...............................................................   Passed    1.37 sec
        Start 193: ResidualCell_Galerkin_PTC_AD_btest
193/910 Test #193: ResidualCell_Galerkin_PTC_AD_btest ...............................................................   Passed    1.38 sec
        Start 194: ResidualCell_Galerkin_ShallowWater1D_btest
194/910 Test #194: ResidualCell_Galerkin_ShallowWater1D_btest .......................................................   Passed    1.36 sec
        Start 195: ResidualInteriorTrace_Galerkin_AD_btest
195/910 Test #195: ResidualInteriorTrace_Galerkin_AD_btest ..........................................................   Passed    1.37 sec
        Start 196: ResidualInteriorTrace_Galerkin_CR_btest
196/910 Test #196: ResidualInteriorTrace_Galerkin_CR_btest ..........................................................   Passed    1.35 sec
        Start 197: SolutionData_Galerkin_Stabilized_btest
197/910 Test #197: SolutionData_Galerkin_Stabilized_btest ...........................................................   Passed    1.58 sec
        Start 198: StabilizationMatrix_NS_btest
198/910 Test #198: StabilizationMatrix_NS_btest .....................................................................   Passed    1.34 sec
        Start 199: UpdateFraction_Euler_btest
199/910 Test #199: UpdateFraction_Euler_btest .......................................................................   Passed    1.36 sec
        Start 200: isValidStateCell_Euler_btest
200/910 Test #200: isValidStateCell_Euler_btest .....................................................................   Passed    1.37 sec
        Start 201: isValidStateInteriorTrace_Euler_btest
201/910 Test #201: isValidStateInteriorTrace_Euler_btest ............................................................   Passed    1.36 sec
        Start 202: AlgebraicEquationSet_GloballyConstrained_btest
202/910 Test #202: AlgebraicEquationSet_GloballyConstrained_btest ...................................................   Passed    1.56 sec
        Start 203: Ping_Euler_RotorSource_btest
203/910 Test #203: Ping_Euler_RotorSource_btest .....................................................................   Passed  170.48 sec
        Start 204: AlgebraicEquationSet_EDG_Triangle_AD_btest
204/910 Test #204: AlgebraicEquationSet_EDG_Triangle_AD_btest .......................................................   Passed    2.73 sec
        Start 205: AlgebraicEquationSet_HDGAdvective_Advection_btest
205/910 Test #205: AlgebraicEquationSet_HDGAdvective_Advection_btest ................................................   Passed    2.14 sec
        Start 206: AlgebraicEquationSet_HDGAdvective_Line_IBL_airfoilOnly_btest
206/910 Test #206: AlgebraicEquationSet_HDGAdvective_Line_IBL_airfoilOnly_btest .....................................   Passed    2.19 sec
        Start 207: AlgebraicEquationSet_HDG_BuckleyLeverett_ST_btest
207/910 Test #207: AlgebraicEquationSet_HDG_BuckleyLeverett_ST_btest ................................................   Passed    4.89 sec
        Start 208: AlgebraicEquationSet_HDG_Triangle_AD_btest
208/910 Test #208: AlgebraicEquationSet_HDG_Triangle_AD_btest .......................................................   Passed    3.90 sec
        Start 209: AlgebraicEquationSet_Hubtrace_HDGAdvective_IBL_btest
209/910 Test #209: AlgebraicEquationSet_Hubtrace_HDGAdvective_IBL_btest .............................................   Passed    6.27 sec
        Start 210: AlgebraicEquationSet_Local_HDG_Line_AD_btest
210/910 Test #210: AlgebraicEquationSet_Local_HDG_Line_AD_btest .....................................................   Passed    1.74 sec
        Start 211: AlgebraicEquationSet_Local_HDG_Triangle_AD_btest
211/910 Test #211: AlgebraicEquationSet_Local_HDG_Triangle_AD_btest .................................................   Passed    3.33 sec
        Start 212: AuxiliaryAdjoint_HDG_AD_btest
212/910 Test #212: AuxiliaryAdjoint_HDG_AD_btest ....................................................................   Passed    1.65 sec
        Start 213: AuxiliaryAdjoint_HDG_NS_btest
213/910 Test #213: AuxiliaryAdjoint_HDG_NS_btest ....................................................................   Passed    4.02 sec
        Start 214: DiscretizationHDG_btest
214/910 Test #214: DiscretizationHDG_btest ..........................................................................   Passed    1.29 sec
        Start 215: FunctionalBoundaryTrace_HDG_sansLG_btest
215/910 Test #215: FunctionalBoundaryTrace_HDG_sansLG_btest .........................................................   Passed    1.38 sec
        Start 216: FunctionalCell_HDG_btest
216/910 Test #216: FunctionalCell_HDG_btest .........................................................................   Passed    1.46 sec
        Start 217: FunctionalCellwise_HDG_btest
217/910 Test #217: FunctionalCellwise_HDG_btest .....................................................................   Passed    1.51 sec
        Start 218: IntegrandBoundaryTrace_Dirichlet_mitState_HDG_AD_btest
218/910 Test #218: IntegrandBoundaryTrace_Dirichlet_mitState_HDG_AD_btest ...........................................   Passed    1.38 sec
        Start 219: IntegrandBoundaryTrace_Flux_mitState_HDG_AD_btest
219/910 Test #219: IntegrandBoundaryTrace_Flux_mitState_HDG_AD_btest ................................................   Passed    1.35 sec
        Start 220: IntegrandBoundaryTrace_LinearScalar_mitLG_HDG_AD_btest
220/910 Test #220: IntegrandBoundaryTrace_LinearScalar_mitLG_HDG_AD_btest ...........................................   Passed    1.35 sec
        Start 221: IntegrandBoundaryTrace_LinearScalar_sansLG_HDG_AD_btest
221/910 Test #221: IntegrandBoundaryTrace_LinearScalar_sansLG_HDG_AD_btest ..........................................   Passed    1.35 sec
        Start 222: IntegrandBoundaryTrace_None_HDG_AD_btest
222/910 Test #222: IntegrandBoundaryTrace_None_HDG_AD_btest .........................................................   Passed    1.29 sec
        Start 223: IntegrandBoundaryTrace_Output_HDG_btest
223/910 Test #223: IntegrandBoundaryTrace_Output_HDG_btest ..........................................................   Passed    1.31 sec
        Start 224: IntegrandCell_HDG_AD_btest
224/910 Test #224: IntegrandCell_HDG_AD_btest .......................................................................   Passed    1.33 sec
        Start 225: IntegrandCell_HDG_NS_btest
225/910 Test #225: IntegrandCell_HDG_NS_btest .......................................................................   Passed    1.33 sec
        Start 226: IntegrandFunctor_HDG_HB_AD_btest
226/910 Test #226: IntegrandFunctor_HDG_HB_AD_btest .................................................................   Passed    1.31 sec
        Start 227: IntegrandFunctor_HDG_ST_AD_btest
227/910 Test #227: IntegrandFunctor_HDG_ST_AD_btest .................................................................   Passed    1.31 sec
        Start 228: IntegrandInteriorTrace_HDG_AD_btest
228/910 Test #228: IntegrandInteriorTrace_HDG_AD_btest ..............................................................   Passed    1.32 sec
        Start 229: IntegrandInteriorTrace_HDG_NS_btest
229/910 Test #229: IntegrandInteriorTrace_HDG_NS_btest ..............................................................   Passed    1.31 sec
        Start 230: JacobianBoundaryTrace_Dirichlet_mitState_HDG_AD_btest
230/910 Test #230: JacobianBoundaryTrace_Dirichlet_mitState_HDG_AD_btest ............................................   Passed    4.15 sec
        Start 231: JacobianBoundaryTrace_Flux_mitState_HDG_AD_btest
231/910 Test #231: JacobianBoundaryTrace_Flux_mitState_HDG_AD_btest .................................................   Passed    4.11 sec
        Start 232: JacobianBoundaryTrace_Flux_mitState_HDG_Euler_btest
232/910 Test #232: JacobianBoundaryTrace_Flux_mitState_HDG_Euler_btest ..............................................   Passed   27.20 sec
        Start 233: JacobianBoundaryTrace_LinearScalar_sansLG_HDG_AD_btest
233/910 Test #233: JacobianBoundaryTrace_LinearScalar_sansLG_HDG_AD_btest ...........................................   Passed    2.39 sec
        Start 234: JacobianCell_HDG_AD_btest
234/910 Test #234: JacobianCell_HDG_AD_btest ........................................................................   Passed    2.59 sec
        Start 235: JacobianCell_HDG_HB_AD_btest
235/910 Test #235: JacobianCell_HDG_HB_AD_btest .....................................................................   Passed    1.29 sec
        Start 236: JacobianFunctionalBoundaryTrace_HDG_sansLG_btest
236/910 Test #236: JacobianFunctionalBoundaryTrace_HDG_sansLG_btest .................................................   Passed    4.97 sec
        Start 237: JacobianFunctionalCell_HDG_btest
237/910 Test #237: JacobianFunctionalCell_HDG_btest .................................................................   Passed    1.37 sec
        Start 238: JacobianInteriorTrace_HDG_AD_btest
238/910 Test #238: JacobianInteriorTrace_HDG_AD_btest ...............................................................   Passed   23.23 sec
        Start 239: ResidualBoundaryTrace_Dirichlet_mitState_HDG_AD_btest
239/910 Test #239: ResidualBoundaryTrace_Dirichlet_mitState_HDG_AD_btest ............................................   Passed    1.32 sec
        Start 240: ResidualBoundaryTrace_Flux_mitState_HDG_AD_btest
240/910 Test #240: ResidualBoundaryTrace_Flux_mitState_HDG_AD_btest .................................................   Passed    1.30 sec
        Start 241: ResidualCell_HDG_AD_btest
241/910 Test #241: ResidualCell_HDG_AD_btest ........................................................................   Passed    1.30 sec
        Start 242: ResidualCell_HDG_HB_AD_btest
242/910 Test #242: ResidualCell_HDG_HB_AD_btest .....................................................................   Passed    1.27 sec
        Start 243: ResidualInteriorTrace_HDG_AD_btest
243/910 Test #243: ResidualInteriorTrace_HDG_AD_btest ...............................................................   Passed    1.29 sec
        Start 244: SetFieldCell_HDG_AuxiliaryVariable_AD_btest
244/910 Test #244: SetFieldCell_HDG_AuxiliaryVariable_AD_btest ......................................................   Passed    1.39 sec
        Start 245: isValidStateInteriorTrace_HDG_Euler_btest
245/910 Test #245: isValidStateInteriorTrace_HDG_Euler_btest ........................................................   Passed    1.28 sec
        Start 246: AlgebraicEquationSet_VMSD_Triangle_AD_btest
246/910 Test #246: AlgebraicEquationSet_VMSD_Triangle_AD_btest ......................................................   Passed    2.63 sec
        Start 247: AlgebraicEquationSet_VMSD_Triangle_SA_btest
247/910 Test #247: AlgebraicEquationSet_VMSD_Triangle_SA_btest ......................................................   Passed    5.09 sec
        Start 248: IntegrandBoundaryTrace_Flux_mitState_VMSD_AD_btest
248/910 Test #248: IntegrandBoundaryTrace_Flux_mitState_VMSD_AD_btest ...............................................   Passed    1.29 sec
        Start 249: IntegrandBoundaryTrace_Output_VMSD_btest
249/910 Test #249: IntegrandBoundaryTrace_Output_VMSD_btest .........................................................   Passed    1.28 sec
        Start 250: IntegrandCell_VMSD_AD_btest
250/910 Test #250: IntegrandCell_VMSD_AD_btest ......................................................................   Passed    1.26 sec
        Start 251: IntegrandCell_VMSD_Output_AD_btest
251/910 Test #251: IntegrandCell_VMSD_Output_AD_btest ...............................................................   Passed    1.26 sec
        Start 252: IntegrandTrace_VMSD_AD_btest
252/910 Test #252: IntegrandTrace_VMSD_AD_btest .....................................................................   Passed    1.27 sec
        Start 253: JacobianCell_VMSD_AD_btest
253/910 Test #253: JacobianCell_VMSD_AD_btest .......................................................................   Passed    1.30 sec
        Start 254: JacobianFunctionalCell_VMSD_AD_btest
254/910 Test #254: JacobianFunctionalCell_VMSD_AD_btest .............................................................   Passed    1.28 sec
        Start 255: ResidualCell_VMSD_AD_btest
255/910 Test #255: ResidualCell_VMSD_AD_btest .......................................................................   Passed    1.28 sec
        Start 256: AlgebraicEquationSet_VMSDBR2_Triangle_AD_btest
256/910 Test #256: AlgebraicEquationSet_VMSDBR2_Triangle_AD_btest ...................................................   Passed  147.30 sec
        Start 257: AlgebraicEquationSet_VMSDBR2_Triangle_SA_btest
257/910 Test #257: AlgebraicEquationSet_VMSDBR2_Triangle_SA_btest ...................................................   Passed   68.81 sec
        Start 258: IntegrandCell_VMSD_BR2_AD_btest
258/910 Test #258: IntegrandCell_VMSD_BR2_AD_btest ..................................................................   Passed    1.30 sec
        Start 259: IntegrandTrace_VMSD_BR2_AD_btest
259/910 Test #259: IntegrandTrace_VMSD_BR2_AD_btest .................................................................   Passed    1.31 sec
        Start 260: JacobianBoundaryTrace_Dirichlet_mitState_VMSDBR2_AD_btest
260/910 Test #260: JacobianBoundaryTrace_Dirichlet_mitState_VMSDBR2_AD_btest ........................................   Passed    1.41 sec
        Start 261: JacobianCell_VMSD_BR2_AD_btest
261/910 Test #261: JacobianCell_VMSD_BR2_AD_btest ...................................................................   Passed    3.55 sec
        Start 262: JacobianFunctionalBoundaryTrace_VMSDBR2_btest
262/910 Test #262: JacobianFunctionalBoundaryTrace_VMSDBR2_btest ....................................................   Passed    1.90 sec
        Start 263: ProjectL2_VMSD_BR2_Source_btest
263/910 Test #263: ProjectL2_VMSD_BR2_Source_btest ..................................................................   Passed    1.46 sec
        Start 264: SetFieldBoundaryTrace_VMSDBR2_LO_AD_Dirichlet_mitState_btest
264/910 Test #264: SetFieldBoundaryTrace_VMSDBR2_LO_AD_Dirichlet_mitState_btest .....................................   Passed    1.39 sec
        Start 265: JacobianCell_FV_TPFA_AD_btest
265/910 Test #265: JacobianCell_FV_TPFA_AD_btest ....................................................................   Passed    1.32 sec
        Start 266: JacobianInteriorTrace_FV_TPFA_AD_btest
266/910 Test #266: JacobianInteriorTrace_FV_TPFA_AD_btest ...........................................................   Passed    1.33 sec
        Start 267: ErrorEstimateBoundaryTrace_DGBR2_AD_btest
267/910 Test #267: ErrorEstimateBoundaryTrace_DGBR2_AD_btest ........................................................   Passed    1.33 sec
        Start 268: ErrorEstimateBoundaryTrace_Galerkin_AD_btest
268/910 Test #268: ErrorEstimateBoundaryTrace_Galerkin_AD_btest .....................................................   Passed    1.28 sec
        Start 269: ErrorEstimateBoundaryTrace_HDG_AD_btest
269/910 Test #269: ErrorEstimateBoundaryTrace_HDG_AD_btest ..........................................................   Passed    1.33 sec
        Start 270: ErrorEstimateCell_DGBR2_AD_btest
270/910 Test #270: ErrorEstimateCell_DGBR2_AD_btest .................................................................   Passed    1.30 sec
        Start 271: ErrorEstimateCell_DGBR2_LiftedQuantity_TwoPhaseAV_btest
271/910 Test #271: ErrorEstimateCell_DGBR2_LiftedQuantity_TwoPhaseAV_btest ..........................................   Passed    1.31 sec
        Start 272: ErrorEstimateCell_Galerkin_AD_btest
272/910 Test #272: ErrorEstimateCell_Galerkin_AD_btest ..............................................................   Passed    1.30 sec
        Start 273: ErrorEstimateCell_HDG_AD_btest
273/910 Test #273: ErrorEstimateCell_HDG_AD_btest ...................................................................   Passed    1.31 sec
        Start 274: ErrorEstimateCell_PrimalStrongForm_Galerkin_AD_btest
274/910 Test #274: ErrorEstimateCell_PrimalStrongForm_Galerkin_AD_btest .............................................   Passed    1.30 sec
        Start 275: ErrorEstimateCell_VMSD_AD_btest
275/910 Test #275: ErrorEstimateCell_VMSD_AD_btest ..................................................................   Passed    1.28 sec
        Start 276: ErrorEstimateInteriorTrace_DGBR2_AD_btest
276/910 Test #276: ErrorEstimateInteriorTrace_DGBR2_AD_btest ........................................................   Passed    1.32 sec
        Start 277: ErrorEstimateInteriorTrace_Galerkin_AD_btest
277/910 Test #277: ErrorEstimateInteriorTrace_Galerkin_AD_btest .....................................................   Passed    1.30 sec
        Start 278: ErrorEstimateInteriorTrace_HDG_AD_btest
278/910 Test #278: ErrorEstimateInteriorTrace_HDG_AD_btest ..........................................................   Passed    1.30 sec
        Start 279: ErrorEstimateInteriorTrace_PrimalStrongForm_Galerkin_AD_btest
279/910 Test #279: ErrorEstimateInteriorTrace_PrimalStrongForm_Galerkin_AD_btest ....................................   Passed    1.29 sec
        Start 280: ErrorEstimateNodal_Galerkin_AD_btest
280/910 Test #280: ErrorEstimateNodal_Galerkin_AD_btest .............................................................   Passed    1.44 sec
        Start 281: ErrorEstimate_Common_btest
281/910 Test #281: ErrorEstimate_Common_btest .......................................................................   Passed    1.30 sec
        Start 282: ErrorEstimate_DGBR2_AD_btest
282/910 Test #282: ErrorEstimate_DGBR2_AD_btest .....................................................................   Passed    1.38 sec
        Start 283: ErrorEstimate_Galerkin_AD_btest
283/910 Test #283: ErrorEstimate_Galerkin_AD_btest ..................................................................   Passed    1.31 sec
        Start 284: ErrorEstimate_HDG_AD_btest
284/910 Test #284: ErrorEstimate_HDG_AD_btest .......................................................................   Passed    1.32 sec
        Start 285: ErrorEstimate_L2_AD_btest
285/910 Test #285: ErrorEstimate_L2_AD_btest ........................................................................   Passed    1.41 sec
        Start 286: OutputCorrection_Galerkin_Stabilized_AD_btest
286/910 Test #286: OutputCorrection_Galerkin_Stabilized_AD_btest ....................................................   Passed    1.41 sec
        Start 287: DistanceFunction_btest
287/910 Test #287: DistanceFunction_btest ...........................................................................   Passed    1.44 sec
        Start 288: ElementCounter_btest
288/910 Test #288: ElementCounter_btest .............................................................................   Passed    1.36 sec
        Start 289: ElementalMassMatrix_btest
289/910 Test #289: ElementalMassMatrix_btest ........................................................................   Passed    1.72 sec
        Start 290: Field1D_CG_btest
290/910 Test #290: Field1D_CG_btest .................................................................................   Passed    1.31 sec
        Start 291: Field1D_DG_btest
291/910 Test #291: Field1D_DG_btest .................................................................................   Passed    1.30 sec
        Start 292: Field2D_CG_Quad_btest
292/910 Test #292: Field2D_CG_Quad_btest ............................................................................   Passed    1.31 sec
        Start 293: Field2D_CG_Triangle_btest
293/910 Test #293: Field2D_CG_Triangle_btest ........................................................................   Passed    1.68 sec
        Start 294: Field2D_DG_Quad_btest
294/910 Test #294: Field2D_DG_Quad_btest ............................................................................   Passed    1.33 sec
        Start 295: Field2D_DG_Triangle_btest
295/910 Test #295: Field2D_DG_Triangle_btest ........................................................................   Passed    1.40 sec
        Start 296: Field2D_EG_Triangle_btest
296/910 Test #296: Field2D_EG_Triangle_btest ........................................................................   Passed    1.36 sec
        Start 297: Field2D_HDG_btest
297/910 Test #297: Field2D_HDG_btest ................................................................................   Passed    1.33 sec
        Start 298: Field3D_CG_Hexahedron_btest
298/910 Test #298: Field3D_CG_Hexahedron_btest ......................................................................   Passed   11.45 sec
        Start 299: Field3D_CG_Tetrahedron_btest
299/910 Test #299: Field3D_CG_Tetrahedron_btest .....................................................................   Passed    2.64 sec
        Start 300: Field3D_HDG_btest
300/910 Test #300: Field3D_HDG_btest ................................................................................   Passed    1.33 sec
        Start 301: Field4D_CG_Pentatope_btest
301/910 Test #301: Field4D_CG_Pentatope_btest .......................................................................   Passed   17.32 sec
        Start 302: Field4D_DG_Pentatope_btest
302/910 Test #302: Field4D_DG_Pentatope_btest .......................................................................   Passed    7.02 sec
        Start 303: FieldAssociativityArea_Quad_btest
303/910 Test #303: FieldAssociativityArea_Quad_btest ................................................................   Passed    1.30 sec
        Start 304: FieldAssociativityArea_Triangle_btest
304/910 Test #304: FieldAssociativityArea_Triangle_btest ............................................................   Passed    1.29 sec
        Start 305: FieldAssociativityLine_btest
305/910 Test #305: FieldAssociativityLine_btest .....................................................................   Passed    1.30 sec
        Start 306: FieldAssociativitySpacetime_Pentatope_btest
306/910 Test #306: FieldAssociativitySpacetime_Pentatope_btest ......................................................   Passed    1.33 sec
        Start 307: FieldDataInvMassMatrix_Cell_btest
307/910 Test #307: FieldDataInvMassMatrix_Cell_btest ................................................................   Passed    1.46 sec
        Start 308: FieldDataMatrixD_CellLift_btest
308/910 Test #308: FieldDataMatrixD_CellLift_btest ..................................................................   Passed    1.31 sec
        Start 309: FieldDataMatrixD_Lift_BoundaryTrace_btest
309/910 Test #309: FieldDataMatrixD_Lift_BoundaryTrace_btest ........................................................   Passed    1.32 sec
        Start 310: FieldDataMatrixD_TraceLift_btest
310/910 Test #310: FieldDataMatrixD_TraceLift_btest .................................................................   Passed    1.33 sec
        Start 311: FieldLiftAssociativityArea_Triangle_btest
311/910 Test #311: FieldLiftAssociativityArea_Triangle_btest ........................................................   Passed    1.29 sec
        Start 312: FieldLiftAssociativityLine_btest
312/910 Test #312: FieldLiftAssociativityLine_btest .................................................................   Passed    1.29 sec
        Start 313: FieldLift_DG_btest
313/910 Test #313: FieldLift_DG_btest ...............................................................................   Passed    1.34 sec
        Start 314: FieldLinesearch_btest
314/910 Test #314: FieldLinesearch_btest ............................................................................   Passed    1.38 sec
        Start 315: FieldSequence_btest
315/910 Test #315: FieldSequence_btest ..............................................................................   Passed    1.34 sec
        Start 316: Field_DG_BoundaryTrace_matchAreaCell_btest
316/910 Test #316: Field_DG_BoundaryTrace_matchAreaCell_btest .......................................................   Passed    1.33 sec
        Start 317: Field_NodalView_btest
317/910 Test #317: Field_NodalView_btest ............................................................................   Passed    1.38 sec
        Start 318: Field_Tuple_btest
318/910 Test #318: Field_Tuple_btest ................................................................................   Passed    1.34 sec
        Start 319: FindElementFromX_btest
319/910 Test #319: FindElementFromX_btest ...........................................................................   Passed    1.37 sec
        Start 320: GenHField_CG_btest
320/910 Test #320: GenHField_CG_btest ...............................................................................   Passed    1.37 sec
        Start 321: GenHField_DG_btest
321/910 Test #321: GenHField_DG_btest ...............................................................................   Passed    1.34 sec
        Start 322: HField_CG_btest
322/910 Test #322: HField_CG_btest ..................................................................................   Passed    1.31 sec
        Start 323: HField_DG_btest
323/910 Test #323: HField_DG_btest ..................................................................................   Passed    1.35 sec
        Start 324: NormalField_btest
324/910 Test #324: NormalField_btest ................................................................................   Passed    9.29 sec
        Start 325: ProjectGlobalField_btest
325/910 Test #325: ProjectGlobalField_btest .........................................................................   Passed    2.44 sec
        Start 326: ProjectSolnCell_Continuous_btest
326/910 Test #326: ProjectSolnCell_Continuous_btest .................................................................   Passed    1.31 sec
        Start 327: ProjectSolnCell_Discontinuous_btest
327/910 Test #327: ProjectSolnCell_Discontinuous_btest ..............................................................   Passed    1.37 sec
        Start 328: Project_DG_to_CG_btest
328/910 Test #328: Project_DG_to_CG_btest ...........................................................................   Passed    2.11 sec
        Start 329: XField1D_Curved_btest
329/910 Test #329: XField1D_Curved_btest ............................................................................   Passed    1.28 sec
        Start 330: XField1D_Line_btest
330/910 Test #330: XField1D_Line_btest ..............................................................................   Passed    1.28 sec
        Start 331: XField2D_Curved_btest
331/910 Test #331: XField2D_Curved_btest ............................................................................   Passed    1.35 sec
        Start 332: XField2D_Curvilinear_btest
332/910 Test #332: XField2D_Curvilinear_btest .......................................................................   Passed    1.31 sec
        Start 333: XField2D_Line_Curved_btest
333/910 Test #333: XField2D_Line_Curved_btest .......................................................................   Passed    1.28 sec
        Start 334: XField2D_Line_btest
334/910 Test #334: XField2D_Line_btest ..............................................................................   Passed    1.29 sec
        Start 335: XField2D_Triangle_btest
335/910 Test #335: XField2D_Triangle_btest ..........................................................................   Passed    1.31 sec
        Start 336: XField3D_Curved_Hex_btest
336/910 Test #336: XField3D_Curved_Hex_btest ........................................................................   Passed   10.65 sec
        Start 337: XField3D_Curved_Tet_btest
337/910 Test #337: XField3D_Curved_Tet_btest ........................................................................   Passed    2.41 sec
        Start 338: XField3D_Triangle_btest
338/910 Test #338: XField3D_Triangle_btest ..........................................................................   Passed    1.33 sec
        Start 339: XFieldAssociativityArea_Triangle_btest
339/910 Test #339: XFieldAssociativityArea_Triangle_btest ...........................................................   Passed    1.31 sec
        Start 340: XField_BoundaryTrace_btest
340/910 Test #340: XField_BoundaryTrace_btest .......................................................................   Passed    1.31 sec
        Start 341: XField_CellToTrace_btest
341/910 Test #341: XField_CellToTrace_btest .........................................................................   Passed    1.29 sec
        Start 342: XField_Lagrange_Partition_btest
342/910 Test #342: XField_Lagrange_Partition_btest ..................................................................   Passed    1.35 sec
        Start 343: XField_Lagrange_btest
343/910 Test #343: XField_Lagrange_btest ............................................................................   Passed    1.37 sec
        Start 344: for_each_BoundaryFieldTraceGroup_Cell_btest
344/910 Test #344: for_each_BoundaryFieldTraceGroup_Cell_btest ......................................................   Passed    1.33 sec
        Start 345: for_each_InteriorFieldTraceGroup_Cell_btest
345/910 Test #345: for_each_InteriorFieldTraceGroup_Cell_btest ......................................................   Passed    1.33 sec
        Start 346: BoundingBox_btest
346/910 Test #346: BoundingBox_btest ................................................................................   Passed    1.27 sec
        Start 347: ElementArea_Quad_btest
347/910 Test #347: ElementArea_Quad_btest ...........................................................................   Passed    6.13 sec
        Start 348: ElementArea_Triangle_btest
348/910 Test #348: ElementArea_Triangle_btest .......................................................................   Passed   17.26 sec
        Start 349: ElementAssociativityArea_Quad_btest
349/910 Test #349: ElementAssociativityArea_Quad_btest ..............................................................   Passed    1.31 sec
        Start 350: ElementAssociativityArea_Triangle_btest
350/910 Test #350: ElementAssociativityArea_Triangle_btest ..........................................................   Passed    1.28 sec
        Start 351: ElementAssociativityLine_btest
351/910 Test #351: ElementAssociativityLine_btest ...................................................................   Passed    1.28 sec
        Start 352: ElementAssociativityNode_btest
352/910 Test #352: ElementAssociativityNode_btest ...................................................................   Passed    1.27 sec
        Start 353: ElementAssociativitySpacetime_Pentatope_btest
353/910 Test #353: ElementAssociativitySpacetime_Pentatope_btest ....................................................   Passed    1.37 sec
        Start 354: ElementAssociativityVolume_Hexahedron_btest
354/910 Test #354: ElementAssociativityVolume_Hexahedron_btest ......................................................   Passed    1.29 sec
        Start 355: ElementAssociativityVolume_Tetrahedron_btest
355/910 Test #355: ElementAssociativityVolume_Tetrahedron_btest .....................................................   Passed    1.27 sec
        Start 356: ElementIntegral_Functional_btest
356/910 Test #356: ElementIntegral_Functional_btest .................................................................   Passed    1.28 sec
        Start 357: ElementLine_btest
357/910 Test #357: ElementLine_btest ................................................................................   Passed    1.37 sec
        Start 358: ElementNode_btest
358/910 Test #358: ElementNode_btest ................................................................................   Passed    1.28 sec
        Start 359: ElementPointData_btest
359/910 Test #359: ElementPointData_btest ...........................................................................   Passed    1.31 sec
        Start 360: ElementProjection_L2_Line_btest
360/910 Test #360: ElementProjection_L2_Line_btest ..................................................................   Passed    1.29 sec
        Start 361: ElementProjection_L2_Pentatope_btest
361/910 Test #361: ElementProjection_L2_Pentatope_btest .............................................................   Passed    1.34 sec
        Start 362: ElementProjection_L2_Tet_btest
362/910 Test #362: ElementProjection_L2_Tet_btest ...................................................................   Passed    1.28 sec
        Start 363: ElementProjection_L2_Triangle_btest
363/910 Test #363: ElementProjection_L2_Triangle_btest ..............................................................   Passed    1.36 sec
        Start 364: ElementProjection_Specialization_L2_Triangle_btest
364/910 Test #364: ElementProjection_Specialization_L2_Triangle_btest ...............................................   Passed    1.29 sec
        Start 365: ElementSpacetime_Pentatope_btest
365/910 Test #365: ElementSpacetime_Pentatope_btest .................................................................   Passed    4.53 sec
        Start 366: ElementTuple_btest
366/910 Test #366: ElementTuple_btest ...............................................................................   Passed    1.30 sec
        Start 367: ElementVolume_Hexahedron_Cache_Hierarchical_btest
367/910 Test #367: ElementVolume_Hexahedron_Cache_Hierarchical_btest ................................................   Passed    7.30 sec
        Start 368: ElementVolume_Hexahedron_Cache_Lagrange_btest
368/910 Test #368: ElementVolume_Hexahedron_Cache_Lagrange_btest ....................................................   Passed  145.25 sec
        Start 369: ElementVolume_Hexahedron_Cache_Legendre_btest
369/910 Test #369: ElementVolume_Hexahedron_Cache_Legendre_btest ....................................................   Passed   68.03 sec
        Start 370: ElementVolume_Hexahedron_btest
370/910 Test #370: ElementVolume_Hexahedron_btest ...................................................................   Passed    1.35 sec
        Start 371: ElementVolume_Tetrahedron_btest
371/910 Test #371: ElementVolume_Tetrahedron_btest ..................................................................   Passed   17.69 sec
        Start 372: ElementXFieldAreaBase_Quad_btest
372/910 Test #372: ElementXFieldAreaBase_Quad_btest .................................................................   Passed    1.38 sec
        Start 373: ElementXFieldAreaBase_Triangle_btest
373/910 Test #373: ElementXFieldAreaBase_Triangle_btest .............................................................   Passed    1.30 sec
        Start 374: ElementXFieldArea_2D_Quad_btest
374/910 Test #374: ElementXFieldArea_2D_Quad_btest ..................................................................   Passed    1.34 sec
        Start 375: ElementXFieldArea_2D_Triangle_btest
375/910 Test #375: ElementXFieldArea_2D_Triangle_btest ..............................................................   Passed    1.28 sec
        Start 376: ElementXFieldArea_3D_Quad_btest
376/910 Test #376: ElementXFieldArea_3D_Quad_btest ..................................................................   Passed    1.27 sec
        Start 377: ElementXFieldArea_3D_Triangle_btest
377/910 Test #377: ElementXFieldArea_3D_Triangle_btest ..............................................................   Passed    1.29 sec
        Start 378: ElementXFieldLineBase_btest
378/910 Test #378: ElementXFieldLineBase_btest ......................................................................   Passed    1.27 sec
        Start 379: ElementXFieldLine_1D_btest
379/910 Test #379: ElementXFieldLine_1D_btest .......................................................................   Passed    1.31 sec
        Start 380: ElementXFieldLine_2D_btest
380/910 Test #380: ElementXFieldLine_2D_btest .......................................................................   Passed    1.26 sec
        Start 381: ElementXFieldSpacetime_Pentatope_btest
381/910 Test #381: ElementXFieldSpacetime_Pentatope_btest ...........................................................   Passed    1.37 sec
        Start 382: ElementXFieldVolume_4D_Tetrahedron_btest
382/910 Test #382: ElementXFieldVolume_4D_Tetrahedron_btest .........................................................   Passed    1.38 sec
        Start 383: ElementXFieldVolume_Hexahedron_btest
383/910 Test #383: ElementXFieldVolume_Hexahedron_btest .............................................................   Passed    1.34 sec
        Start 384: ElementXFieldVolume_Tetrahedron_btest
384/910 Test #384: ElementXFieldVolume_Tetrahedron_btest ............................................................   Passed    1.40 sec
        Start 385: RefCoordSolver_btest
385/910 Test #385: RefCoordSolver_btest .............................................................................   Passed    1.45 sec
        Start 386: ReferenceElementMesh_btest
386/910 Test #386: ReferenceElementMesh_btest .......................................................................   Passed    1.35 sec
        Start 387: UniqueElem_btest
387/910 Test #387: UniqueElem_btest .................................................................................   Passed    1.29 sec
        Start 388: Field1D_LocalPatch_Edge_CG_btest
388/910 Test #388: Field1D_LocalPatch_Edge_CG_btest .................................................................   Passed    1.35 sec
        Start 389: Field1D_LocalPatch_Element_DG_btest
389/910 Test #389: Field1D_LocalPatch_Element_DG_btest ..............................................................   Passed    1.39 sec
        Start 390: Field2D_LocalPatch_Edge_CG_btest
390/910 Test #390: Field2D_LocalPatch_Edge_CG_btest .................................................................   Passed    3.51 sec
        Start 391: Field2D_LocalPatch_Element_DG_btest
391/910 Test #391: Field2D_LocalPatch_Element_DG_btest ..............................................................   Passed    1.51 sec
        Start 392: Field3D_LocalPatch_Edge_CG_btest
392/910 Test #392: Field3D_LocalPatch_Edge_CG_btest .................................................................   Passed    9.72 sec
        Start 393: Field3D_LocalPatch_Element_DG_btest
393/910 Test #393: Field3D_LocalPatch_Element_DG_btest ..............................................................   Passed   18.30 sec
        Start 394: Field4D_LocalPatch_Edge_CG_btest
394/910 Test #394: Field4D_LocalPatch_Edge_CG_btest .................................................................   Passed    4.28 sec
        Start 395: Field4D_LocalPatch_Element_DG_btest
395/910 Test #395: Field4D_LocalPatch_Element_DG_btest ..............................................................   Passed   12.24 sec
        Start 396: XField1D_LocalPatch_Edge_CG_btest
396/910 Test #396: XField1D_LocalPatch_Edge_CG_btest ................................................................   Passed    1.30 sec
        Start 397: XField1D_LocalPatch_Element_CG_btest
397/910 Test #397: XField1D_LocalPatch_Element_CG_btest .............................................................   Passed    1.30 sec
        Start 398: XField1D_LocalPatch_Element_DG_btest
398/910 Test #398: XField1D_LocalPatch_Element_DG_btest .............................................................   Passed    1.29 sec
        Start 399: XField2D_LocalPatch_Edge_CG_btest
399/910 Test #399: XField2D_LocalPatch_Edge_CG_btest ................................................................   Passed    1.34 sec
        Start 400: XField2D_LocalPatch_Element_CG_btest
400/910 Test #400: XField2D_LocalPatch_Element_CG_btest .............................................................   Passed    1.39 sec
        Start 401: XField2D_LocalPatch_Element_DG_btest
401/910 Test #401: XField2D_LocalPatch_Element_DG_btest .............................................................   Passed    1.67 sec
        Start 402: XField3D_LocalPatch_Edge_CG_btest
402/910 Test #402: XField3D_LocalPatch_Edge_CG_btest ................................................................   Passed    2.57 sec
        Start 403: XField3D_LocalPatch_Element_CG_btest
403/910 Test #403: XField3D_LocalPatch_Element_CG_btest .............................................................   Passed    4.60 sec
        Start 404: XField3D_LocalPatch_Element_DG_btest
404/910 Test #404: XField3D_LocalPatch_Element_DG_btest .............................................................   Passed    2.34 sec
        Start 405: XField4D_LocalPatch_Element_CG_btest
405/910 Test #405: XField4D_LocalPatch_Element_CG_btest .............................................................   Passed    2.95 sec
        Start 406: XField4D_LocalPatch_Element_DG_btest
406/910 Test #406: XField4D_LocalPatch_Element_DG_btest .............................................................   Passed    1.83 sec
        Start 407: XField_LocalPatch_HighOrderTet_btest
407/910 Test #407: XField_LocalPatch_HighOrderTet_btest .............................................................   Passed   10.69 sec
        Start 408: XField_LocalPatch_HighOrderTriangle_btest
408/910 Test #408: XField_LocalPatch_HighOrderTriangle_btest ........................................................   Passed    2.33 sec
        Start 409: XField_LocalPatch_Line_btest
409/910 Test #409: XField_LocalPatch_Line_btest .....................................................................   Passed    1.29 sec
        Start 410: XField_LocalPatch_Pentatope_btest
410/910 Test #410: XField_LocalPatch_Pentatope_btest ................................................................   Passed   10.49 sec
        Start 411: XField_LocalPatch_Simplex_forCG_btest
411/910 Test #411: XField_LocalPatch_Simplex_forCG_btest ............................................................   Passed    3.69 sec
        Start 412: XField_LocalPatch_Simplex_forDG_btest
412/910 Test #412: XField_LocalPatch_Simplex_forDG_btest ............................................................   Passed    3.56 sec
        Start 413: XField_LocalPatch_Tet_btest
413/910 Test #413: XField_LocalPatch_Tet_btest ......................................................................   Passed    7.48 sec
        Start 414: XField_LocalPatch_Triangle_btest
414/910 Test #414: XField_LocalPatch_Triangle_btest .................................................................   Passed    1.46 sec
        Start 415: MatrixBlock_2x2_Decompose_LUP_btest
415/910 Test #415: MatrixBlock_2x2_Decompose_LUP_btest ..............................................................   Passed    1.34 sec
        Start 416: MatrixBlock_2x2_Decompose_LU_btest
416/910 Test #416: MatrixBlock_2x2_Decompose_LU_btest ...............................................................   Passed    1.32 sec
        Start 417: MatrixBlock_2x2_DenseMatrix_btest
417/910 Test #417: MatrixBlock_2x2_DenseMatrix_btest ................................................................   Passed    1.32 sec
        Start 418: MatrixBlock_2x2_InverseLUP_btest
418/910 Test #418: MatrixBlock_2x2_InverseLUP_btest .................................................................   Passed    1.29 sec
        Start 419: MatrixBlock_2x2_InverseLU_btest
419/910 Test #419: MatrixBlock_2x2_InverseLU_btest ..................................................................   Passed    1.29 sec
        Start 420: MatrixBlock_2x2_SparseMatrix_CRS_btest
420/910 Test #420: MatrixBlock_2x2_SparseMatrix_CRS_btest ...........................................................   Passed    1.33 sec
        Start 421: MatrixBlock_2x2_Transpose_btest
421/910 Test #421: MatrixBlock_2x2_Transpose_btest ..................................................................   Passed    1.33 sec
        Start 422: MatrixBlock_3x3_DenseMatrix_btest
422/910 Test #422: MatrixBlock_3x3_DenseMatrix_btest ................................................................   Passed    1.30 sec
        Start 423: MatrixBlock_3x3_SparseMatrix_CRS_btest
423/910 Test #423: MatrixBlock_3x3_SparseMatrix_CRS_btest ...........................................................   Passed    1.33 sec
        Start 424: MatrixBlock_4x4_SparseMatrix_CRS_btest
424/910 Test #424: MatrixBlock_4x4_SparseMatrix_CRS_btest ...........................................................   Passed    1.35 sec
        Start 425: VectorBlock_2_DenseVector_btest
425/910 Test #425: VectorBlock_2_DenseVector_btest ..................................................................   Passed    1.31 sec
        Start 426: VectorBlock_2_SparseVector_btest
426/910 Test #426: VectorBlock_2_SparseVector_btest .................................................................   Passed    1.27 sec
        Start 427: VectorBlock_3_DenseVector_btest
427/910 Test #427: VectorBlock_3_DenseVector_btest ..................................................................   Passed    1.27 sec
        Start 428: VectorBlock_4_btest
428/910 Test #428: VectorBlock_4_btest ..............................................................................   Passed    1.31 sec
        Start 429: DenseLinAlg_MatrixUtil_btest
429/910 Test #429: DenseLinAlg_MatrixUtil_btest .....................................................................   Passed    1.30 sec
        Start 430: MatrixDView_btest
430/910 Test #430: MatrixDView_btest ................................................................................   Passed    1.29 sec
        Start 431: MatrixD_Array_btest
431/910 Test #431: MatrixD_Array_btest ..............................................................................   Passed    1.29 sec
        Start 432: MatrixD_BlockView_btest
432/910 Test #432: MatrixD_BlockView_btest ..........................................................................   Passed    1.29 sec
        Start 433: MatrixD_Decompose_LUP_btest
433/910 Test #433: MatrixD_Decompose_LUP_btest ......................................................................   Passed    1.32 sec
        Start 434: MatrixD_Decompose_LU_btest
434/910 Test #434: MatrixD_Decompose_LU_btest .......................................................................   Passed    1.31 sec
        Start 435: MatrixD_Det_btest
435/910 Test #435: MatrixD_Det_btest ................................................................................   Passed    1.29 sec
        Start 436: MatrixD_Diag_btest
436/910 Test #436: MatrixD_Diag_btest ...............................................................................   Passed    1.31 sec
        Start 437: MatrixD_InverseLUP_btest
437/910 Test #437: MatrixD_InverseLUP_btest .........................................................................   Passed    1.32 sec
        Start 438: MatrixD_InverseLU_btest
438/910 Test #438: MatrixD_InverseLU_btest ..........................................................................   Passed    1.35 sec
        Start 439: MatrixD_InverseQR_btest
439/910 Test #439: MatrixD_InverseQR_btest ..........................................................................   Passed    1.31 sec
        Start 440: MatrixD_LAPACK_btest
440/910 Test #440: MatrixD_LAPACK_btest .............................................................................   Passed    1.31 sec
        Start 441: MatrixD_Mul_Native_btest
441/910 Test #441: MatrixD_Mul_Native_btest .........................................................................   Passed    1.30 sec
        Start 442: MatrixD_NonZeroPattern_btest
442/910 Test #442: MatrixD_NonZeroPattern_btest .....................................................................   Passed    1.27 sec
        Start 443: MatrixD_Transpose_btest
443/910 Test #443: MatrixD_Transpose_btest ..........................................................................   Passed    1.31 sec
        Start 444: MatrixD_Tuple_btest
444/910 Test #444: MatrixD_Tuple_btest ..............................................................................   Passed    1.27 sec
        Start 445: MatrixD_btest
445/910 Test #445: MatrixD_btest ....................................................................................   Passed    1.32 sec
        Start 446: MatrixD_of_MatrixS_btest
446/910 Test #446: MatrixD_of_MatrixS_btest .........................................................................   Passed    1.29 sec
        Start 447: MatrixS_Decompose_LUP_btest
447/910 Test #447: MatrixS_Decompose_LUP_btest ......................................................................   Passed    1.30 sec
        Start 448: MatrixS_Decompose_LU_btest
448/910 Test #448: MatrixS_Decompose_LU_btest .......................................................................   Passed    1.26 sec
        Start 449: MatrixS_Decompose_QR_btest
449/910 Test #449: MatrixS_Decompose_QR_btest .......................................................................   Passed    1.32 sec
        Start 450: MatrixS_Det_btest
450/910 Test #450: MatrixS_Det_btest ................................................................................   Passed    1.30 sec
        Start 451: MatrixS_Diag_btest
451/910 Test #451: MatrixS_Diag_btest ...............................................................................   Passed    1.28 sec
        Start 452: MatrixS_FrobNorm_btest
452/910 Test #452: MatrixS_FrobNorm_btest ...........................................................................   Passed    1.30 sec
        Start 453: MatrixS_InverseLUP_btest
453/910 Test #453: MatrixS_InverseLUP_btest .........................................................................   Passed    1.38 sec
        Start 454: MatrixS_InverseLU_btest
454/910 Test #454: MatrixS_InverseLU_btest ..........................................................................   Passed    1.32 sec
        Start 455: MatrixS_InverseQR_btest
455/910 Test #455: MatrixS_InverseQR_btest ..........................................................................   Passed    1.34 sec
        Start 456: MatrixS_LpNorm_btest
456/910 Test #456: MatrixS_LpNorm_btest .............................................................................   Passed    1.34 sec
        Start 457: MatrixS_MatrixUtil_btest
457/910 Test #457: MatrixS_MatrixUtil_btest .........................................................................   Passed    1.31 sec
        Start 458: MatrixS_Mul_Native_btest
458/910 Test #458: MatrixS_Mul_Native_btest .........................................................................   Passed    1.31 sec
        Start 459: MatrixS_SVD_btest
459/910 Test #459: MatrixS_SVD_btest ................................................................................   Passed    1.30 sec
        Start 460: MatrixS_SurrealD_btest
460/910 Test #460: MatrixS_SurrealD_btest ...........................................................................   Passed    1.28 sec
        Start 461: MatrixS_SurrealS_btest
461/910 Test #461: MatrixS_SurrealS_btest ...........................................................................   Passed    1.28 sec
        Start 462: MatrixS_Trace_btest
462/910 Test #462: MatrixS_Trace_btest ..............................................................................   Passed    1.27 sec
        Start 463: MatrixS_Transpose_btest
463/910 Test #463: MatrixS_Transpose_btest ..........................................................................   Passed    1.29 sec
        Start 464: MatrixS_btest
464/910 Test #464: MatrixS_btest ....................................................................................   Passed    1.28 sec
        Start 465: MatrixS_of_MatrixS_btest
465/910 Test #465: MatrixS_of_MatrixS_btest .........................................................................   Passed    1.33 sec
        Start 466: MatrixSymS_Decompose_Cholesky_btest
466/910 Test #466: MatrixSymS_Decompose_Cholesky_btest ..............................................................   Passed    1.28 sec
        Start 467: MatrixSymS_Decompose_LDLT_btest
467/910 Test #467: MatrixSymS_Decompose_LDLT_btest ..................................................................   Passed    1.29 sec
        Start 468: MatrixSymS_Eigen_btest
468/910 Test #468: MatrixSymS_Eigen_btest ...........................................................................   Passed    1.28 sec
        Start 469: MatrixSymS_Exp_btest
469/910 Test #469: MatrixSymS_Exp_btest .............................................................................   Passed    1.28 sec
        Start 470: MatrixSymS_InverseCholesky_btest
470/910 Test #470: MatrixSymS_InverseCholesky_btest .................................................................   Passed    1.35 sec
        Start 471: MatrixSymS_InverseLDLT_btest
471/910 Test #471: MatrixSymS_InverseLDLT_btest .....................................................................   Passed    1.36 sec
        Start 472: MatrixSymS_Log_btest
472/910 Test #472: MatrixSymS_Log_btest .............................................................................   Passed    1.29 sec
        Start 473: MatrixSymS_Pow_btest
473/910 Test #473: MatrixSymS_Pow_btest .............................................................................   Passed    1.28 sec
        Start 474: MatrixSymS_SurrealS_btest
474/910 Test #474: MatrixSymS_SurrealS_btest ........................................................................   Passed    1.28 sec
        Start 475: MatrixSymS_btest
475/910 Test #475: MatrixSymS_btest .................................................................................   Passed    1.28 sec
        Start 476: VectorD_DenseVectorSize_btest
476/910 Test #476: VectorD_DenseVectorSize_btest ....................................................................   Passed    1.28 sec
        Start 477: VectorD_btest
477/910 Test #477: VectorD_btest ....................................................................................   Passed    1.28 sec
        Start 478: VectorD_dot_btest
478/910 Test #478: VectorD_dot_btest ................................................................................   Passed    1.28 sec
        Start 479: VectorD_norm_btest
479/910 Test #479: VectorD_norm_btest ...............................................................................   Passed    1.27 sec
        Start 480: VectorS_InnerProduct_btest
480/910 Test #480: VectorS_InnerProduct_btest .......................................................................   Passed    1.31 sec
        Start 481: VectorS_OuterProduct_btest
481/910 Test #481: VectorS_OuterProduct_btest .......................................................................   Passed    1.27 sec
        Start 482: VectorS_SurrealD_btest
482/910 Test #482: VectorS_SurrealD_btest ...........................................................................   Passed    1.29 sec
        Start 483: VectorS_SurrealD_deriv_btest
483/910 Test #483: VectorS_SurrealD_deriv_btest .....................................................................   Passed    1.30 sec
        Start 484: VectorS_SurrealS_btest
484/910 Test #484: VectorS_SurrealS_btest ...........................................................................   Passed    1.27 sec
        Start 485: VectorS_SurrealS_deriv_btest
485/910 Test #485: VectorS_SurrealS_deriv_btest .....................................................................   Passed    1.30 sec
        Start 486: VectorS_btest
486/910 Test #486: VectorS_btest ....................................................................................   Passed    1.28 sec
        Start 487: VectorS_cross_btest
487/910 Test #487: VectorS_cross_btest ..............................................................................   Passed    1.30 sec
        Start 488: VectorS_dot_btest
488/910 Test #488: VectorS_dot_btest ................................................................................   Passed    1.32 sec
        Start 489: VectorS_norm_btest
489/910 Test #489: VectorS_norm_btest ...............................................................................   Passed    1.30 sec
        Start 490: FGMRES_btest
490/910 Test #490: FGMRES_btest .....................................................................................   Passed    1.30 sec
        Start 491: ILU0_btest
491/910 Test #491: ILU0_btest .......................................................................................   Passed    1.32 sec
        Start 492: LU_SGS_btest
492/910 Test #492: LU_SGS_btest .....................................................................................   Passed    1.32 sec
        Start 493: LinearSolver_btest
493/910 Test #493: LinearSolver_btest ...............................................................................   Passed    1.34 sec
        Start 494: MatrixD_SparseMatrix_CRS_MatrixD_MatrixS_btest
494/910 Test #494: MatrixD_SparseMatrix_CRS_MatrixD_MatrixS_btest ...................................................   Passed    1.30 sec
        Start 495: MatrixD_SparseMatrix_CRS_MatrixD_btest
495/910 Test #495: MatrixD_SparseMatrix_CRS_MatrixD_btest ...........................................................   Passed    1.32 sec
        Start 496: MatrixD_SparseMatrix_CRS_MatrixS_btest
496/910 Test #496: MatrixD_SparseMatrix_CRS_MatrixS_btest ...........................................................   Passed    1.39 sec
        Start 497: MatrixD_SparseMatrix_CRS_Real_btest
497/910 Test #497: MatrixD_SparseMatrix_CRS_Real_btest ..............................................................   Passed    1.31 sec
        Start 498: SparseMatrix_CRS_MatrixD_MatrixS_btest
498/910 Test #498: SparseMatrix_CRS_MatrixD_MatrixS_btest ...........................................................   Passed    1.31 sec
        Start 499: SparseMatrix_CRS_MatrixD_btest
499/910 Test #499: SparseMatrix_CRS_MatrixD_btest ...................................................................   Passed    1.31 sec
        Start 500: SparseMatrix_CRS_MatrixS_btest
500/910 Test #500: SparseMatrix_CRS_MatrixS_btest ...................................................................   Passed    1.33 sec
        Start 501: SparseMatrix_CRS_Real_btest
501/910 Test #501: SparseMatrix_CRS_Real_btest ......................................................................   Passed    1.33 sec
        Start 502: SparseMatrix_Diag_btest
502/910 Test #502: SparseMatrix_Diag_btest ..........................................................................   Passed    1.30 sec
        Start 503: SparseVector_Real_btest
503/910 Test #503: SparseVector_Real_btest ..........................................................................   Passed    1.32 sec
        Start 504: SparseVector_VectorD_VectorS_btest
504/910 Test #504: SparseVector_VectorD_VectorS_btest ...............................................................   Passed    1.34 sec
        Start 505: SparseVector_VectorD_btest
505/910 Test #505: SparseVector_VectorD_btest .......................................................................   Passed    1.29 sec
        Start 506: SparseVector_VectorS_btest
506/910 Test #506: SparseVector_VectorS_btest .......................................................................   Passed    1.29 sec
        Start 507: UMFPACK_btest
507/910 Test #507: UMFPACK_btest ....................................................................................   Passed    1.32 sec
        Start 508: VectorD_SparseVector_Real_btest
508/910 Test #508: VectorD_SparseVector_Real_btest ..................................................................   Passed    1.28 sec
        Start 509: VectorD_SparseVector_VectorD_btest
509/910 Test #509: VectorD_SparseVector_VectorD_btest ...............................................................   Passed    1.29 sec
        Start 510: VectorD_SparseVector_VectorS_btest
510/910 Test #510: VectorD_SparseVector_VectorS_btest ...............................................................   Passed    1.29 sec
        Start 511: PETSc_LinearSolver_btest
511/910 Test #511: PETSc_LinearSolver_btest .........................................................................   Passed    1.33 sec
        Start 512: PETSc_MDF_Ordering_btest
512/910 Test #512: PETSc_MDF_Ordering_btest .........................................................................   Passed    1.35 sec
        Start 513: PETSc_btest
513/910 Test #513: PETSc_btest ......................................................................................   Passed    1.33 sec
        Start 514: AFLR2_btest
514/910 Test #514: AFLR2_btest ......................................................................................   Passed    1.36 sec
        Start 515: AFLR3_btest
515/910 Test #515: AFLR3_btest ......................................................................................   Passed    7.11 sec
        Start 516: MetricAnalytical_btest
516/910 Test #516: MetricAnalytical_btest ...........................................................................   Passed    1.29 sec
        Start 517: MesherInterface_avro_btest
517/910 Test #517: MesherInterface_avro_btest .......................................................................   Passed   17.08 sec
        Start 518: XField3D_Wake_avro_btest
518/910 Test #518: XField3D_Wake_avro_btest .........................................................................   Passed    1.31 sec
        Start 519: XField_avro_btest
519/910 Test #519: XField_avro_btest ................................................................................   Passed    2.14 sec
        Start 520: CamberBlade_btest
520/910 Test #520: CamberBlade_btest ................................................................................   Passed    6.19 sec
        Start 521: CubicCamber_btest
521/910 Test #521: CubicCamber_btest ................................................................................   Passed    1.29 sec
        Start 522: EGApproximate_btest
522/910 Test #522: EGApproximate_btest ..............................................................................   Passed    1.29 sec
        Start 523: EGBody_btest
523/910 Test #523: EGBody_btest .....................................................................................   Passed    1.26 sec
        Start 524: EGContext_btest
524/910 Test #524: EGContext_btest ..................................................................................   Passed    1.29 sec
        Start 525: EGEdge_btest
525/910 Test #525: EGEdge_btest .....................................................................................   Passed    1.27 sec
        Start 526: EGFace_btest
526/910 Test #526: EGFace_btest .....................................................................................   Passed    1.27 sec
        Start 527: EGLine_btest
527/910 Test #527: EGLine_btest .....................................................................................   Passed    1.25 sec
        Start 528: EGLoop_btest
528/910 Test #528: EGLoop_btest .....................................................................................   Passed    1.28 sec
        Start 529: EGModel_btest
529/910 Test #529: EGModel_btest ....................................................................................   Passed    1.25 sec
        Start 530: EGNode_btest
530/910 Test #530: EGNode_btest .....................................................................................   Passed    1.25 sec
        Start 531: EGObject_btest
531/910 Test #531: EGObject_btest ...................................................................................   Passed    1.28 sec
        Start 532: Generated_btest
532/910 Test #532: Generated_btest ..................................................................................   Passed    1.27 sec
        Start 533: QuadCamber_btest
533/910 Test #533: QuadCamber_btest .................................................................................   Passed    1.26 sec
        Start 534: ThicknessNACA6_btest
534/910 Test #534: ThicknessNACA6_btest .............................................................................   Passed    1.27 sec
        Start 535: transform_btest
535/910 Test #535: transform_btest ..................................................................................   Passed    1.26 sec
        Start 536: EGTessEdge_btest
536/910 Test #536: EGTessEdge_btest .................................................................................   Passed    1.28 sec
        Start 537: EGTessModel_btest
537/910 Test #537: EGTessModel_btest ................................................................................   Passed    1.43 sec
        Start 538: EGTessellation_btest
538/910 Test #538: EGTessellation_btest .............................................................................   Passed    1.29 sec
        Start 539: MesherInterface_Embedding_btest
539/910 Test #539: MesherInterface_Embedding_btest ..................................................................   Passed    1.28 sec
        Start 540: MesherInterface_Epic_btest
540/910 Test #540: MesherInterface_Epic_btest .......................................................................   Passed    1.52 sec
        Start 541: WriteMeshMetric_Epic_btest
541/910 Test #541: WriteMeshMetric_Epic_btest .......................................................................   Passed    1.41 sec
        Start 542: WriteSolution_PX_btest
542/910 Test #542: WriteSolution_PX_btest ...........................................................................   Passed    1.41 sec
        Start 543: XField_PX_btest
543/910 Test #543: XField_PX_btest ..................................................................................   Passed    2.15 sec
        Start 544: EGTetGen_btest
544/910 Test #544: EGTetGen_btest ...................................................................................   Passed    2.16 sec
        Start 545: makeTetGenModel_btest
545/910 Test #545: makeTetGenModel_btest ............................................................................   Passed    8.18 sec
        Start 546: makeWakedAirfoil_btest
546/910 Test #546: makeWakedAirfoil_btest ...........................................................................   Passed    1.42 sec
        Start 547: MetricOps_btest
547/910 Test #547: MetricOps_btest ..................................................................................   Passed    1.25 sec
        Start 548: MesherInterface_Poitwise_btest
548/910 Test #548: MesherInterface_Poitwise_btest ...................................................................   Passed    1.31 sec
        Start 549: Write_PointwisePCD_btest
549/910 Test #549: Write_PointwisePCD_btest .........................................................................   Passed    1.32 sec
        Start 550: refine2D_btest
550/910 Test #550: refine2D_btest ...................................................................................   Passed   11.40 sec
        Start 551: refine3D_btest
551/910 Test #551: refine3D_btest ...................................................................................   Passed   59.58 sec
        Start 552: ReadSolution_libMeshb_btest
552/910 Test #552: ReadSolution_libMeshb_btest ......................................................................   Passed    1.36 sec
        Start 553: WriteMesh_libMeshb_btest
553/910 Test #553: WriteMesh_libMeshb_btest .........................................................................   Passed    1.33 sec
        Start 554: WriteSolution_libMeshb_btest
554/910 Test #554: WriteSolution_libMeshb_btest .....................................................................   Passed    1.35 sec
        Start 555: XField_libMeshb_btest
555/910 Test #555: XField_libMeshb_btest ............................................................................   Passed    1.37 sec
        Start 556: MesherInterface_FeFloa_btest
556/910 Test #556: MesherInterface_FeFloa_btest .....................................................................   Passed    1.36 sec
        Start 557: XField_gmsh_btest
557/910 Test #557: XField_gmsh_btest ................................................................................   Passed    5.13 sec
        Start 558: XField_ugrid_btest
558/910 Test #558: XField_ugrid_btest ...............................................................................   Passed    1.32 sec
        Start 559: XField1D_btest
559/910 Test #559: XField1D_btest ...................................................................................   Passed    1.25 sec
        Start 560: HalvingSearchLineUpdate_btest
560/910 Test #560: HalvingSearchLineUpdate_btest ....................................................................   Passed    1.29 sec
        Start 561: NewtonSolver_Parameters_btest
561/910 Test #561: NewtonSolver_Parameters_btest ....................................................................   Passed    1.29 sec
        Start 562: NewtonSolver_btest
562/910 Test #562: NewtonSolver_btest ...............................................................................   Passed    1.37 sec
        Start 563: ScalarGoldenSearchLineUpdate_btest
563/910 Test #563: ScalarGoldenSearchLineUpdate_btest ...............................................................   Passed    1.30 sec
        Start 564: PiecewiseConstSourcePanel_FlatPlate3D_btest
564/910 Test #564: PiecewiseConstSourcePanel_FlatPlate3D_btest ......................................................   Passed    1.36 sec
        Start 565: XfoilPanelEquationSet_btest
565/910 Test #565: XfoilPanelEquationSet_btest ......................................................................   Passed    1.30 sec
        Start 566: XfoilPanel_btest
566/910 Test #566: XfoilPanel_btest .................................................................................   Passed    1.30 sec
        Start 567: OutputCell_SolutionErrorL2_btest
567/910 Test #567: OutputCell_SolutionErrorL2_btest .................................................................   Passed    1.27 sec
        Start 568: OutputCell_SolutionErrorSquared_btest
568/910 Test #568: OutputCell_SolutionErrorSquared_btest ............................................................   Passed    1.25 sec
        Start 569: OutputCell_SolutionSquared_btest
569/910 Test #569: OutputCell_SolutionSquared_btest .................................................................   Passed    1.27 sec
        Start 570: OutputCell_Solution_btest
570/910 Test #570: OutputCell_Solution_btest ........................................................................   Passed    1.26 sec
        Start 571: OutputCell_WeightedSolution_btest
571/910 Test #571: OutputCell_WeightedSolution_btest ................................................................   Passed    1.26 sec
        Start 572: AdvectionDiffusion_Sensor_btest
572/910 Test #572: AdvectionDiffusion_Sensor_btest ..................................................................   Passed    1.26 sec
        Start 573: AdvectiveFlux1D_btest
573/910 Test #573: AdvectiveFlux1D_btest ............................................................................   Passed    1.30 sec
        Start 574: AdvectiveFlux2D_btest
574/910 Test #574: AdvectiveFlux2D_btest ............................................................................   Passed    1.28 sec
        Start 575: AdvectiveFlux3D_btest
575/910 Test #575: AdvectiveFlux3D_btest ............................................................................   Passed    1.25 sec
        Start 576: BCAdvectionDiffusion1D_btest
576/910 Test #576: BCAdvectionDiffusion1D_btest .....................................................................   Passed    1.29 sec
        Start 577: BCAdvectionDiffusion2D_btest
577/910 Test #577: BCAdvectionDiffusion2D_btest .....................................................................   Passed    1.29 sec
        Start 578: ForcingFunction1D_MMS_btest
578/910 Test #578: ForcingFunction1D_MMS_btest ......................................................................   Passed    1.26 sec
        Start 579: ForcingFunction2D_MMS_btest
579/910 Test #579: ForcingFunction2D_MMS_btest ......................................................................   Passed    1.26 sec
        Start 580: ForcingFunction2D_btest
580/910 Test #580: ForcingFunction2D_btest ..........................................................................   Passed    1.27 sec
        Start 581: ForcingFunction3D_MMS_btest
581/910 Test #581: ForcingFunction3D_MMS_btest ......................................................................   Passed    1.26 sec
        Start 582: ForcingFunction3D_btest
582/910 Test #582: ForcingFunction3D_btest ..........................................................................   Passed    1.26 sec
        Start 583: OutputAdvectionDiffusion_btest
583/910 Test #583: OutputAdvectionDiffusion_btest ...................................................................   Passed    1.27 sec
        Start 584: PDEAdvectionDiffusion1D_btest
584/910 Test #584: PDEAdvectionDiffusion1D_btest ....................................................................   Passed    1.27 sec
        Start 585: PDEAdvectionDiffusion2D_btest
585/910 Test #585: PDEAdvectionDiffusion2D_btest ....................................................................   Passed    1.29 sec
        Start 586: PDEAdvectionDiffusion3D_btest
586/910 Test #586: PDEAdvectionDiffusion3D_btest ....................................................................   Passed    1.28 sec
        Start 587: PDEAdvectionDiffusion_ArtificialViscosity2D_btest
587/910 Test #587: PDEAdvectionDiffusion_ArtificialViscosity2D_btest ................................................   Passed    1.27 sec
        Start 588: Source1D_btest
588/910 Test #588: Source1D_btest ...................................................................................   Passed    1.26 sec
        Start 589: Source2D_btest
589/910 Test #589: Source2D_btest ...................................................................................   Passed    1.31 sec
        Start 590: Source3D_btest
590/910 Test #590: Source3D_btest ...................................................................................   Passed    1.29 sec
        Start 591: ViscousFlux1D_btest
591/910 Test #591: ViscousFlux1D_btest ..............................................................................   Passed    1.25 sec
        Start 592: ViscousFlux2D_btest
592/910 Test #592: ViscousFlux2D_btest ..............................................................................   Passed    1.26 sec
        Start 593: ViscousFlux3D_btest
593/910 Test #593: ViscousFlux3D_btest ..............................................................................   Passed    1.28 sec
        Start 594: AVSensor_AdvectiveFlux1D_btest
594/910 Test #594: AVSensor_AdvectiveFlux1D_btest ...................................................................   Passed    1.26 sec
        Start 595: AVSensor_AdvectiveFlux2D_btest
595/910 Test #595: AVSensor_AdvectiveFlux2D_btest ...................................................................   Passed    1.26 sec
        Start 596: AVSensor_Source1D_Euler_btest
596/910 Test #596: AVSensor_Source1D_Euler_btest ....................................................................   Passed    1.28 sec
        Start 597: AVSensor_Source1D_btest
597/910 Test #597: AVSensor_Source1D_btest ..........................................................................   Passed    1.25 sec
        Start 598: AVSensor_Source2D_Euler_btest
598/910 Test #598: AVSensor_Source2D_Euler_btest ....................................................................   Passed    1.33 sec
        Start 599: AVSensor_Source2D_TwoPhase_btest
599/910 Test #599: AVSensor_Source2D_TwoPhase_btest .................................................................   Passed    1.25 sec
        Start 600: AVSensor_Source3D_Euler_btest
600/910 Test #600: AVSensor_Source3D_Euler_btest ....................................................................   Passed    1.45 sec
        Start 601: AVSensor_ViscousFlux1D_btest
601/910 Test #601: AVSensor_ViscousFlux1D_btest .....................................................................   Passed    1.28 sec
        Start 602: AVSensor_ViscousFlux2D_btest
602/910 Test #602: AVSensor_ViscousFlux2D_btest .....................................................................   Passed    1.30 sec
        Start 603: AVSensor_ViscousFlux3D_btest
603/910 Test #603: AVSensor_ViscousFlux3D_btest .....................................................................   Passed    1.28 sec
        Start 604: PDEmitAVSensor1D_btest
604/910 Test #604: PDEmitAVSensor1D_btest ...........................................................................   Passed    1.29 sec
        Start 605: PDEmitAVSensor2D_btest
605/910 Test #605: PDEmitAVSensor2D_btest ...........................................................................   Passed    1.27 sec
        Start 606: PDEmitAVSensor3D_btest
606/910 Test #606: PDEmitAVSensor3D_btest ...........................................................................   Passed    1.28 sec
        Start 607: ArrayFunction2D_btest
607/910 Test #607: ArrayFunction2D_btest ............................................................................   Passed    1.28 sec
        Start 608: ScalarFunction1D_btest
608/910 Test #608: ScalarFunction1D_btest ...........................................................................   Passed    1.28 sec
        Start 609: ScalarFunction2D_btest
609/910 Test #609: ScalarFunction2D_btest ...........................................................................   Passed    1.30 sec
        Start 610: ScalarFunction3D_btest
610/910 Test #610: ScalarFunction3D_btest ...........................................................................   Passed    1.27 sec
        Start 611: PDEEikonal_Distance2D_btest
611/910 Test #611: PDEEikonal_Distance2D_btest ......................................................................   Passed    1.27 sec
        Start 612: BCCauchyRiemann2D_btest
612/910 Test #612: BCCauchyRiemann2D_btest ..........................................................................   Passed    1.28 sec
        Start 613: PDECauchyRiemann2D_SurrealD_btest
613/910 Test #613: PDECauchyRiemann2D_SurrealD_btest ................................................................   Passed    1.28 sec
        Start 614: PDECauchyRiemann2D_SurrealS_btest
614/910 Test #614: PDECauchyRiemann2D_SurrealS_btest ................................................................   Passed    1.25 sec
        Start 615: PDECauchyRiemann2D_btest
615/910 Test #615: PDECauchyRiemann2D_btest .........................................................................   Passed    1.25 sec
        Start 616: BCFullPotential3D_btest
616/910 Test #616: BCFullPotential3D_btest ..........................................................................   Passed    1.27 sec
        Start 617: BCIncompressiblePotentialTwoField2D_sansLG_btest
617/910 Test #617: BCIncompressiblePotentialTwoField2D_sansLG_btest .................................................   Passed    1.31 sec
        Start 618: BCLinearizedIncompressiblePotential2D_btest
618/910 Test #618: BCLinearizedIncompressiblePotential2D_btest ......................................................   Passed    1.27 sec
        Start 619: BCLinearizedIncompressiblePotential2D_sansLG_btest
619/910 Test #619: BCLinearizedIncompressiblePotential2D_sansLG_btest ...............................................   Passed    1.27 sec
        Start 620: BCLinearizedIncompressiblePotential3D_btest
620/910 Test #620: BCLinearizedIncompressiblePotential3D_btest ......................................................   Passed    1.29 sec
        Start 621: LinearizedIncompressiblePotential3D_Circulation_btest
621/910 Test #621: LinearizedIncompressiblePotential3D_Circulation_btest ............................................   Passed    1.52 sec
        Start 622: LinearizedIncompressiblePotential3D_Trefftz_btest
622/910 Test #622: LinearizedIncompressiblePotential3D_Trefftz_btest ................................................   Passed    1.57 sec
        Start 623: OutputLIP3D_btest
623/910 Test #623: OutputLIP3D_btest ................................................................................   Passed    1.30 sec
        Start 624: PDEFullPotential3D_btest
624/910 Test #624: PDEFullPotential3D_btest .........................................................................   Passed    1.26 sec
        Start 625: PDEIncompressiblePotentialTwoField2D_btest
625/910 Test #625: PDEIncompressiblePotentialTwoField2D_btest .......................................................   Passed    1.27 sec
        Start 626: PDELinearizedIncompressiblePotential2D_btest
626/910 Test #626: PDELinearizedIncompressiblePotential2D_btest .....................................................   Passed    1.27 sec
        Start 627: PDELinearizedIncompressiblePotential3D_btest
627/910 Test #627: PDELinearizedIncompressiblePotential3D_btest .....................................................   Passed    1.26 sec
        Start 628: SolutionFunction2D_LIP_btest
628/910 Test #628: SolutionFunction2D_LIP_btest .....................................................................   Passed    1.26 sec
        Start 629: SolutionFunction3D_LIP_btest
629/910 Test #629: SolutionFunction3D_LIP_btest .....................................................................   Passed    1.26 sec
        Start 630: SolutionFunction_Potential2D_btest
630/910 Test #630: SolutionFunction_Potential2D_btest ...............................................................   Passed    1.28 sec
        Start 631: AlgebraicEquationSet_ProjectToQauxv_3D_btest
631/910 Test #631: AlgebraicEquationSet_ProjectToQauxv_3D_btest .....................................................   Passed    1.56 sec
        Start 632: AlgebraicEquationSet_ProjectToQauxv_PiecewiseConstSourcePanel_FlatPlate3D_Quad_btest
632/910 Test #632: AlgebraicEquationSet_ProjectToQauxv_PiecewiseConstSourcePanel_FlatPlate3D_Quad_btest .............   Passed    1.33 sec
        Start 633: AlgebraicEquationSet_ProjectToQauxv_PiecewiseConstSourcePanel_FlatPlate3D_Triangle_btest
633/910 Test #633: AlgebraicEquationSet_ProjectToQauxv_PiecewiseConstSourcePanel_FlatPlate3D_Triangle_btest .........   Passed    1.30 sec
        Start 634: BCIBL2D_btest
634/910 Test #634: BCIBL2D_btest ....................................................................................   Passed    1.28 sec
        Start 635: BCIBLUniField2D_btest
635/910 Test #635: BCIBLUniField2D_btest ............................................................................   Passed    1.27 sec
        Start 636: ElementProjectionIBLoutput_L2_btest
636/910 Test #636: ElementProjectionIBLoutput_L2_btest ..............................................................   Passed    1.29 sec
        Start 637: FluidModels_btest
637/910 Test #637: FluidModels_btest ................................................................................   Passed    1.28 sec
        Start 638: GetSolnDofCell_IBL_btest
638/910 Test #638: GetSolnDofCell_IBL_btest .........................................................................   Passed    1.31 sec
        Start 639: IBLMiscClosures_btest
639/910 Test #639: IBLMiscClosures_btest ............................................................................   Passed    1.26 sec
        Start 640: PDEIBL2D_btest
640/910 Test #640: PDEIBL2D_btest ...................................................................................   Passed    1.28 sec
        Start 641: PDEIBL2D_continued_btest
641/910 Test #641: PDEIBL2D_continued_btest .........................................................................   Passed    1.28 sec
        Start 642: PDEIBL3D_btest
642/910 Test #642: PDEIBL3D_btest ...................................................................................   Passed    1.26 sec
        Start 643: PDEIBLFourEqn3D_btest
643/910 Test #643: PDEIBLFourEqn3D_btest ............................................................................   Passed    1.29 sec
        Start 644: PDEIBLSplitAmpLag2D_btest
644/910 Test #644: PDEIBLSplitAmpLag2D_btest ........................................................................   Passed    1.28 sec
        Start 645: PDEIBLUniField2D_btest
645/910 Test #645: PDEIBLUniField2D_btest ...........................................................................   Passed    1.28 sec
        Start 646: ProjectToQauxi2D_btest
646/910 Test #646: ProjectToQauxi2D_btest ...........................................................................   Passed    1.28 sec
        Start 647: ProjectToQauxi3D_btest
647/910 Test #647: ProjectToQauxi3D_btest ...........................................................................   Passed    1.29 sec
        Start 648: QauxvInterpret2D_btest
648/910 Test #648: QauxvInterpret2D_btest ...........................................................................   Passed    1.25 sec
        Start 649: SecondaryVar2D_btest
649/910 Test #649: SecondaryVar2D_btest .............................................................................   Passed    1.27 sec
        Start 650: SetIBLoutputCellGroup_btest
650/910 Test #650: SetIBLoutputCellGroup_btest ......................................................................   Passed    1.32 sec
        Start 651: SetSolnDofCell_IBL_btest
651/910 Test #651: SetSolnDofCell_IBL_btest .........................................................................   Passed    1.30 sec
        Start 652: SetVelDofCell_IBL_btest
652/910 Test #652: SetVelDofCell_IBL_btest ..........................................................................   Passed    1.28 sec
        Start 653: SpaldingLawModified_btest
653/910 Test #653: SpaldingLawModified_btest ........................................................................   Passed    1.25 sec
        Start 654: ThicknessesCoefficients2D_CorrelationClosure_btest
654/910 Test #654: ThicknessesCoefficients2D_CorrelationClosure_btest ...............................................   Passed    1.29 sec
        Start 655: ThicknessesCoefficients2D_ProfileClosure_btest
655/910 Test #655: ThicknessesCoefficients2D_ProfileClosure_btest ...................................................   Passed    1.27 sec
        Start 656: VarInterpret2D_btest
656/910 Test #656: VarInterpret2D_btest .............................................................................   Passed    1.27 sec
        Start 657: VelocityProfile2D_btest
657/910 Test #657: VelocityProfile2D_btest ..........................................................................   Passed    1.26 sec
        Start 658: BCIncompressibleNavierStokes1DChannel_btest
658/910 Test #658: BCIncompressibleNavierStokes1DChannel_btest ......................................................   Passed    1.28 sec
        Start 659: BCIncompressibleRANSSA1DChannel_btest
659/910 Test #659: BCIncompressibleRANSSA1DChannel_btest ............................................................   Passed    1.28 sec
        Start 660: PDEIncompressibleNavierStokes1DChannel_btest
660/910 Test #660: PDEIncompressibleNavierStokes1DChannel_btest .....................................................   Passed    1.26 sec
        Start 661: PDEIncompressibleRANSSA1DChannel_btest
661/910 Test #661: PDEIncompressibleRANSSA1DChannel_btest ...........................................................   Passed    1.26 sec
        Start 662: SolutionFunction_IncompressibleRANSSA1DChannel_btest
662/910 Test #662: SolutionFunction_IncompressibleRANSSA1DChannel_btest .............................................   Passed    1.28 sec
        Start 663: BCLorenz_btest
663/910 Test #663: BCLorenz_btest ...................................................................................   Passed    1.27 sec
        Start 664: PDELorenz_btest
664/910 Test #664: PDELorenz_btest ..................................................................................   Passed    1.30 sec
        Start 665: BCEuler1D_btest
665/910 Test #665: BCEuler1D_btest ..................................................................................   Passed    1.28 sec
        Start 666: BCEuler2D_btest
666/910 Test #666: BCEuler2D_btest ..................................................................................   Passed    1.29 sec
        Start 667: BCEuler3D_mitLagrange_btest
667/910 Test #667: BCEuler3D_mitLagrange_btest ......................................................................   Passed    1.26 sec
        Start 668: BCEuler3D_mitState_btest
Build was aborted
[GNU C Compiler (gcc)ClangIntel Compiler (C, Fortran)Vera++] Skipping execution of recorder since overall result is 'ABORTED'
668/910 Test #668: BCEuler3D_mitState_btest .........................................................................Subprocess terminated***Exception:   0.96 sec

        Start 669: BCEulermitAVSensor1D_btest
make[3]: *** [test/unit/CMakeFiles/check_unit.dir/build.make:70: test/unit/CMakeFiles/check_unit] Terminated
make[2]: *** [CMakeFiles/Makefile2:16390: test/unit/CMakeFiles/check_unit.dir/all] Error 2
make[1]: *** [CMakeFiles/Makefile2:16397: test/unit/CMakeFiles/check_unit.dir/rule] Error 2
make: *** [Makefile:3195: check_unit] Error 2

real	765m9.149s
user	729m25.412s
sys	25m5.413s
+ status=1
++ find /jenkins/workspace/SANS_Nightly/builddir/undefined_gnu9/buildnode/reynolds/build/undefined_gnu9 -name Test.xml
+ mv /jenkins/workspace/SANS_Nightly/builddir/undefined_gnu9/buildnode/reynolds/build/Test_unit_memcheck.xml
mv: missing destination file operand after '/jenkins/workspace/SANS_Nightly/builddir/undefined_gnu9/buildnode/reynolds/build/Test_unit_memcheck.xml'
Try 'mv --help' for more information.
[Valgrind] Files to copy:
[Valgrind] Analysing valgrind results
[Valgrind] Ending the valgrind analysis.
INFO: Processing BoostTest-1.x (default)
INFO: [BoostTest-1.x (default)] - No test report file(s) were found with the pattern 'build/boosttest/*.xml' relative to '/jenkins/workspace/SANS_Nightly/builddir/undefined_gnu9/buildnode/reynolds' for the testing framework 'BoostTest-1.x (default)'.
Did you enter a pattern relative to (and within) the workspace directory?
Did you generate the result report(s) for 'BoostTest-1.x (default)'?"
WARNING: All test reports are empty.
INFO: Check 'Failed Tests' threshold.
INFO: Check 'Skipped Tests' threshold.
INFO: Setting the build status to SUCCESS
[PostBuildScript] - [INFO] Executing post build scripts.
[PostBuildScript] - [INFO] Node does not have the role MASTER. Did not execute build step #0.
[PostBuildScript] - [INFO] Node does not have the role MASTER. Did not execute build step #1.
[WS-CLEANUP] Deleting project workspace...
[WS-CLEANUP] Deferred wipeout is used...
[WS-CLEANUP] done
Finished: ABORTED