Console Output

Skipping 1,066 KB.. Full Log
      |                                              ^
[ 90%] Built target PDEEulermitAVDiffusion3D_RANSSA_btest_OBJECT
[ 90%] Linking CXX executable PDEEulermitAVDiffusion3D_RANSSA_btest
[ 90%] Built target PDEEulermitAVDiffusion3D_RANSSA_btest_build
[ 90%] Checking style of test/unit/pde/NS/PDEEulermitAVDiffusion3D_RotorSource_btest.cpp
[ 90%] Built target PDEEulermitAVDiffusion3D_RotorSource_btest_build_vera
[ 90%] Building CXX object test/unit/pde/NS/CMakeFiles/PDEEulermitAVDiffusion3D_RotorSource_btest_OBJECT.dir/PDEEulermitAVDiffusion3D_RotorSource_btest.cpp.o
In file included from /usr/include/boost/config/header_deprecated.hpp:18,
                 from /usr/include/boost/test/output_test_stream.hpp:13,
                 from /jenkins/workspace/SANS_Nightly/builddir/undefined_gnu9/buildnode/reynolds/test/SANS_prefix_btest.h:51,
                 from /jenkins/workspace/SANS_Nightly/builddir/undefined_gnu9/buildnode/reynolds/build/undefined_gnu9/test/cotire/SANS_PREFIX_BTEST_CXX_prefix.cxx:4,
                 from /jenkins/workspace/SANS_Nightly/builddir/undefined_gnu9/buildnode/reynolds/build/undefined_gnu9/test/cotire/SANS_PREFIX_BTEST_CXX_prefix.hxx:4:
/usr/include/boost/test/output_test_stream.hpp:14:1: note: #pragma message: This header is deprecated. Use This header is deprecated. Please use <boost/test/tools/output_test_stream.hpp> instead. instead.
   14 | BOOST_HEADER_DEPRECATED( "This header is deprecated. Please use <boost/test/tools/output_test_stream.hpp> instead." )
      | ^~~~~~~~~~~~~~~~~~~~~~~
In file included from /jenkins/workspace/SANS_Nightly/builddir/undefined_gnu9/buildnode/reynolds/test/unit/pde/NS/PDEEulermitAVDiffusion3D_RotorSource_btest.cpp:28:
/jenkins/workspace/SANS_Nightly/builddir/undefined_gnu9/buildnode/reynolds/src/pde/NS/PDEEulermitAVDiffusion3D.h:43:46: note: #pragma message: #undef USE_GRID_LAPLACIAN
   43 | #pragma message( "#undef USE_GRID_LAPLACIAN" )
      |                                              ^
[ 90%] Built target PDEEulermitAVDiffusion3D_RotorSource_btest_OBJECT
[ 90%] Linking CXX executable PDEEulermitAVDiffusion3D_RotorSource_btest
[ 90%] Built target PDEEulermitAVDiffusion3D_RotorSource_btest_build
[ 90%] Checking style of test/unit/pde/NS/PDEEulermitAVDiffusion3D_btest.cpp
[ 90%] Built target PDEEulermitAVDiffusion3D_btest_build_vera
[ 90%] Building CXX object test/unit/pde/NS/CMakeFiles/PDEEulermitAVDiffusion3D_btest_OBJECT.dir/PDEEulermitAVDiffusion3D_btest.cpp.o
In file included from /usr/include/boost/config/header_deprecated.hpp:18,
                 from /usr/include/boost/test/output_test_stream.hpp:13,
                 from /jenkins/workspace/SANS_Nightly/builddir/undefined_gnu9/buildnode/reynolds/test/SANS_prefix_btest.h:51,
                 from /jenkins/workspace/SANS_Nightly/builddir/undefined_gnu9/buildnode/reynolds/build/undefined_gnu9/test/cotire/SANS_PREFIX_BTEST_CXX_prefix.cxx:4,
                 from /jenkins/workspace/SANS_Nightly/builddir/undefined_gnu9/buildnode/reynolds/build/undefined_gnu9/test/cotire/SANS_PREFIX_BTEST_CXX_prefix.hxx:4:
/usr/include/boost/test/output_test_stream.hpp:14:1: note: #pragma message: This header is deprecated. Use This header is deprecated. Please use <boost/test/tools/output_test_stream.hpp> instead. instead.
   14 | BOOST_HEADER_DEPRECATED( "This header is deprecated. Please use <boost/test/tools/output_test_stream.hpp> instead." )
      | ^~~~~~~~~~~~~~~~~~~~~~~
In file included from /jenkins/workspace/SANS_Nightly/builddir/undefined_gnu9/buildnode/reynolds/test/unit/pde/NS/PDEEulermitAVDiffusion3D_btest.cpp:29:
/jenkins/workspace/SANS_Nightly/builddir/undefined_gnu9/buildnode/reynolds/src/pde/NS/PDEEulermitAVDiffusion3D.h:43:46: note: #pragma message: #undef USE_GRID_LAPLACIAN
   43 | #pragma message( "#undef USE_GRID_LAPLACIAN" )
      |                                              ^
[ 90%] Built target PDEEulermitAVDiffusion3D_btest_OBJECT
[ 90%] Linking CXX executable PDEEulermitAVDiffusion3D_btest
[ 90%] Built target PDEEulermitAVDiffusion3D_btest_build
[ 90%] Checking style of test/unit/pde/NS/PDENavierStokes1D_btest.cpp
[ 90%] Built target PDENavierStokes1D_btest_build_vera
[ 90%] Building CXX object test/unit/pde/NS/CMakeFiles/PDENavierStokes1D_btest_OBJECT.dir/PDENavierStokes1D_btest.cpp.o
In file included from /usr/include/boost/config/header_deprecated.hpp:18,
                 from /usr/include/boost/test/output_test_stream.hpp:13,
                 from /jenkins/workspace/SANS_Nightly/builddir/undefined_gnu9/buildnode/reynolds/test/SANS_prefix_btest.h:51,
                 from /jenkins/workspace/SANS_Nightly/builddir/undefined_gnu9/buildnode/reynolds/build/undefined_gnu9/test/cotire/SANS_PREFIX_BTEST_CXX_prefix.cxx:4,
                 from /jenkins/workspace/SANS_Nightly/builddir/undefined_gnu9/buildnode/reynolds/build/undefined_gnu9/test/cotire/SANS_PREFIX_BTEST_CXX_prefix.hxx:4:
/usr/include/boost/test/output_test_stream.hpp:14:1: note: #pragma message: This header is deprecated. Use This header is deprecated. Please use <boost/test/tools/output_test_stream.hpp> instead. instead.
   14 | BOOST_HEADER_DEPRECATED( "This header is deprecated. Please use <boost/test/tools/output_test_stream.hpp> instead." )
      | ^~~~~~~~~~~~~~~~~~~~~~~
[ 90%] Built target PDENavierStokes1D_btest_OBJECT
[ 90%] Linking CXX executable PDENavierStokes1D_btest
[ 90%] Built target PDENavierStokes1D_btest_build
[ 90%] Checking style of test/unit/pde/NS/PDENavierStokes2D_btest.cpp
[ 90%] Built target PDENavierStokes2D_btest_build_vera
[ 90%] Building CXX object test/unit/pde/NS/CMakeFiles/PDENavierStokes2D_btest_OBJECT.dir/PDENavierStokes2D_btest.cpp.o
In file included from /usr/include/boost/config/header_deprecated.hpp:18,
                 from /usr/include/boost/test/output_test_stream.hpp:13,
                 from /jenkins/workspace/SANS_Nightly/builddir/undefined_gnu9/buildnode/reynolds/test/SANS_prefix_btest.h:51,
                 from /jenkins/workspace/SANS_Nightly/builddir/undefined_gnu9/buildnode/reynolds/build/undefined_gnu9/test/cotire/SANS_PREFIX_BTEST_CXX_prefix.cxx:4,
                 from /jenkins/workspace/SANS_Nightly/builddir/undefined_gnu9/buildnode/reynolds/build/undefined_gnu9/test/cotire/SANS_PREFIX_BTEST_CXX_prefix.hxx:4:
/usr/include/boost/test/output_test_stream.hpp:14:1: note: #pragma message: This header is deprecated. Use This header is deprecated. Please use <boost/test/tools/output_test_stream.hpp> instead. instead.
   14 | BOOST_HEADER_DEPRECATED( "This header is deprecated. Please use <boost/test/tools/output_test_stream.hpp> instead." )
      | ^~~~~~~~~~~~~~~~~~~~~~~
[ 90%] Built target PDENavierStokes2D_btest_OBJECT
[ 90%] Linking CXX executable PDENavierStokes2D_btest
[ 90%] Built target PDENavierStokes2D_btest_build
[ 90%] Checking style of test/unit/pde/NS/PDENavierStokes3D_btest.cpp
[ 90%] Built target PDENavierStokes3D_btest_build_vera
[ 90%] Building CXX object test/unit/pde/NS/CMakeFiles/PDENavierStokes3D_btest_OBJECT.dir/PDENavierStokes3D_btest.cpp.o
In file included from /usr/include/boost/config/header_deprecated.hpp:18,
                 from /usr/include/boost/test/output_test_stream.hpp:13,
                 from /jenkins/workspace/SANS_Nightly/builddir/undefined_gnu9/buildnode/reynolds/test/SANS_prefix_btest.h:51,
                 from /jenkins/workspace/SANS_Nightly/builddir/undefined_gnu9/buildnode/reynolds/build/undefined_gnu9/test/cotire/SANS_PREFIX_BTEST_CXX_prefix.cxx:4,
                 from /jenkins/workspace/SANS_Nightly/builddir/undefined_gnu9/buildnode/reynolds/build/undefined_gnu9/test/cotire/SANS_PREFIX_BTEST_CXX_prefix.hxx:4:
/usr/include/boost/test/output_test_stream.hpp:14:1: note: #pragma message: This header is deprecated. Use This header is deprecated. Please use <boost/test/tools/output_test_stream.hpp> instead. instead.
   14 | BOOST_HEADER_DEPRECATED( "This header is deprecated. Please use <boost/test/tools/output_test_stream.hpp> instead." )
      | ^~~~~~~~~~~~~~~~~~~~~~~
[ 90%] Built target PDENavierStokes3D_btest_OBJECT
[ 90%] Linking CXX executable PDENavierStokes3D_btest
[ 90%] Built target PDENavierStokes3D_btest_build
[ 90%] Checking style of test/unit/pde/NS/PDERANSSA2D_btest.cpp
[ 90%] Built target PDERANSSA2D_btest_build_vera
[ 90%] Building CXX object test/unit/pde/NS/CMakeFiles/PDERANSSA2D_btest_OBJECT.dir/PDERANSSA2D_btest.cpp.o
In file included from /usr/include/boost/config/header_deprecated.hpp:18,
                 from /usr/include/boost/test/output_test_stream.hpp:13,
                 from /jenkins/workspace/SANS_Nightly/builddir/undefined_gnu9/buildnode/reynolds/test/SANS_prefix_btest.h:51,
                 from /jenkins/workspace/SANS_Nightly/builddir/undefined_gnu9/buildnode/reynolds/build/undefined_gnu9/test/cotire/SANS_PREFIX_BTEST_CXX_prefix.cxx:4,
                 from /jenkins/workspace/SANS_Nightly/builddir/undefined_gnu9/buildnode/reynolds/build/undefined_gnu9/test/cotire/SANS_PREFIX_BTEST_CXX_prefix.hxx:4:
/usr/include/boost/test/output_test_stream.hpp:14:1: note: #pragma message: This header is deprecated. Use This header is deprecated. Please use <boost/test/tools/output_test_stream.hpp> instead. instead.
   14 | BOOST_HEADER_DEPRECATED( "This header is deprecated. Please use <boost/test/tools/output_test_stream.hpp> instead." )
      | ^~~~~~~~~~~~~~~~~~~~~~~
[ 90%] Built target PDERANSSA2D_btest_OBJECT
[ 90%] Linking CXX executable PDERANSSA2D_btest
[ 90%] Built target PDERANSSA2D_btest_build
[ 90%] Checking style of test/unit/pde/NS/PDERANSSA3D_btest.cpp
[ 90%] Built target PDERANSSA3D_btest_build_vera
[ 90%] Building CXX object test/unit/pde/NS/CMakeFiles/PDERANSSA3D_btest_OBJECT.dir/PDERANSSA3D_btest.cpp.o
In file included from /usr/include/boost/config/header_deprecated.hpp:18,
                 from /usr/include/boost/test/output_test_stream.hpp:13,
                 from /jenkins/workspace/SANS_Nightly/builddir/undefined_gnu9/buildnode/reynolds/test/SANS_prefix_btest.h:51,
                 from /jenkins/workspace/SANS_Nightly/builddir/undefined_gnu9/buildnode/reynolds/build/undefined_gnu9/test/cotire/SANS_PREFIX_BTEST_CXX_prefix.cxx:4,
                 from /jenkins/workspace/SANS_Nightly/builddir/undefined_gnu9/buildnode/reynolds/build/undefined_gnu9/test/cotire/SANS_PREFIX_BTEST_CXX_prefix.hxx:4:
/usr/include/boost/test/output_test_stream.hpp:14:1: note: #pragma message: This header is deprecated. Use This header is deprecated. Please use <boost/test/tools/output_test_stream.hpp> instead. instead.
   14 | BOOST_HEADER_DEPRECATED( "This header is deprecated. Please use <boost/test/tools/output_test_stream.hpp> instead." )
      | ^~~~~~~~~~~~~~~~~~~~~~~
[ 90%] Built target PDERANSSA3D_btest_OBJECT
[ 90%] Linking CXX executable PDERANSSA3D_btest
[ 90%] Built target PDERANSSA3D_btest_build
[ 90%] Checking style of test/unit/pde/NS/Q1DConservative_btest.cpp
[ 90%] Built target Q1DConservative_btest_build_vera
[ 90%] Building CXX object test/unit/pde/NS/CMakeFiles/Q1DConservative_btest_OBJECT.dir/Q1DConservative_btest.cpp.o
In file included from /usr/include/boost/config/header_deprecated.hpp:18,
                 from /usr/include/boost/test/output_test_stream.hpp:13,
                 from /jenkins/workspace/SANS_Nightly/builddir/undefined_gnu9/buildnode/reynolds/test/SANS_prefix_btest.h:51,
                 from /jenkins/workspace/SANS_Nightly/builddir/undefined_gnu9/buildnode/reynolds/build/undefined_gnu9/test/cotire/SANS_PREFIX_BTEST_CXX_prefix.cxx:4,
                 from /jenkins/workspace/SANS_Nightly/builddir/undefined_gnu9/buildnode/reynolds/build/undefined_gnu9/test/cotire/SANS_PREFIX_BTEST_CXX_prefix.hxx:4:
/usr/include/boost/test/output_test_stream.hpp:14:1: note: #pragma message: This header is deprecated. Use This header is deprecated. Please use <boost/test/tools/output_test_stream.hpp> instead. instead.
   14 | BOOST_HEADER_DEPRECATED( "This header is deprecated. Please use <boost/test/tools/output_test_stream.hpp> instead." )
      | ^~~~~~~~~~~~~~~~~~~~~~~
[ 90%] Built target Q1DConservative_btest_OBJECT
[ 91%] Linking CXX executable Q1DConservative_btest
[ 91%] Built target Q1DConservative_btest_build
[ 91%] Checking style of test/unit/pde/NS/Q1DEntropy_btest.cpp
[ 91%] Built target Q1DEntropy_btest_build_vera
[ 91%] Building CXX object test/unit/pde/NS/CMakeFiles/Q1DEntropy_btest_OBJECT.dir/Q1DEntropy_btest.cpp.o
In file included from /usr/include/boost/config/header_deprecated.hpp:18,
                 from /usr/include/boost/test/output_test_stream.hpp:13,
                 from /jenkins/workspace/SANS_Nightly/builddir/undefined_gnu9/buildnode/reynolds/test/SANS_prefix_btest.h:51,
                 from /jenkins/workspace/SANS_Nightly/builddir/undefined_gnu9/buildnode/reynolds/build/undefined_gnu9/test/cotire/SANS_PREFIX_BTEST_CXX_prefix.cxx:4,
                 from /jenkins/workspace/SANS_Nightly/builddir/undefined_gnu9/buildnode/reynolds/build/undefined_gnu9/test/cotire/SANS_PREFIX_BTEST_CXX_prefix.hxx:4:
/usr/include/boost/test/output_test_stream.hpp:14:1: note: #pragma message: This header is deprecated. Use This header is deprecated. Please use <boost/test/tools/output_test_stream.hpp> instead. instead.
   14 | BOOST_HEADER_DEPRECATED( "This header is deprecated. Please use <boost/test/tools/output_test_stream.hpp> instead." )
      | ^~~~~~~~~~~~~~~~~~~~~~~
[ 91%] Built target Q1DEntropy_btest_OBJECT
[ 91%] Linking CXX executable Q1DEntropy_btest
[ 91%] Built target Q1DEntropy_btest_build
[ 91%] Checking style of test/unit/pde/NS/Q1DPrimitiveRhoPressure_btest.cpp
[ 91%] Built target Q1DPrimitiveRhoPressure_btest_build_vera
[ 91%] Building CXX object test/unit/pde/NS/CMakeFiles/Q1DPrimitiveRhoPressure_btest_OBJECT.dir/Q1DPrimitiveRhoPressure_btest.cpp.o
In file included from /usr/include/boost/config/header_deprecated.hpp:18,
                 from /usr/include/boost/test/output_test_stream.hpp:13,
                 from /jenkins/workspace/SANS_Nightly/builddir/undefined_gnu9/buildnode/reynolds/test/SANS_prefix_btest.h:51,
                 from /jenkins/workspace/SANS_Nightly/builddir/undefined_gnu9/buildnode/reynolds/build/undefined_gnu9/test/cotire/SANS_PREFIX_BTEST_CXX_prefix.cxx:4,
                 from /jenkins/workspace/SANS_Nightly/builddir/undefined_gnu9/buildnode/reynolds/build/undefined_gnu9/test/cotire/SANS_PREFIX_BTEST_CXX_prefix.hxx:4:
/usr/include/boost/test/output_test_stream.hpp:14:1: note: #pragma message: This header is deprecated. Use This header is deprecated. Please use <boost/test/tools/output_test_stream.hpp> instead. instead.
   14 | BOOST_HEADER_DEPRECATED( "This header is deprecated. Please use <boost/test/tools/output_test_stream.hpp> instead." )
      | ^~~~~~~~~~~~~~~~~~~~~~~
[ 91%] Built target Q1DPrimitiveRhoPressure_btest_OBJECT
[ 91%] Linking CXX executable Q1DPrimitiveRhoPressure_btest
[ 91%] Built target Q1DPrimitiveRhoPressure_btest_build
[ 91%] Checking style of test/unit/pde/NS/Q1DPrimitiveSurrogate_btest.cpp
[ 91%] Built target Q1DPrimitiveSurrogate_btest_build_vera
[ 91%] Building CXX object test/unit/pde/NS/CMakeFiles/Q1DPrimitiveSurrogate_btest_OBJECT.dir/Q1DPrimitiveSurrogate_btest.cpp.o
In file included from /usr/include/boost/config/header_deprecated.hpp:18,
                 from /usr/include/boost/test/output_test_stream.hpp:13,
                 from /jenkins/workspace/SANS_Nightly/builddir/undefined_gnu9/buildnode/reynolds/test/SANS_prefix_btest.h:51,
                 from /jenkins/workspace/SANS_Nightly/builddir/undefined_gnu9/buildnode/reynolds/build/undefined_gnu9/test/cotire/SANS_PREFIX_BTEST_CXX_prefix.cxx:4,
                 from /jenkins/workspace/SANS_Nightly/builddir/undefined_gnu9/buildnode/reynolds/build/undefined_gnu9/test/cotire/SANS_PREFIX_BTEST_CXX_prefix.hxx:4:
/usr/include/boost/test/output_test_stream.hpp:14:1: note: #pragma message: This header is deprecated. Use This header is deprecated. Please use <boost/test/tools/output_test_stream.hpp> instead. instead.
   14 | BOOST_HEADER_DEPRECATED( "This header is deprecated. Please use <boost/test/tools/output_test_stream.hpp> instead." )
      | ^~~~~~~~~~~~~~~~~~~~~~~
[ 91%] Built target Q1DPrimitiveSurrogate_btest_OBJECT
[ 91%] Linking CXX executable Q1DPrimitiveSurrogate_btest
[ 91%] Built target Q1DPrimitiveSurrogate_btest_build
[ 91%] Checking style of test/unit/pde/NS/Q2DConservative_btest.cpp
[ 91%] Built target Q2DConservative_btest_build_vera
[ 91%] Building CXX object test/unit/pde/NS/CMakeFiles/Q2DConservative_btest_OBJECT.dir/Q2DConservative_btest.cpp.o
In file included from /usr/include/boost/config/header_deprecated.hpp:18,
                 from /usr/include/boost/test/output_test_stream.hpp:13,
                 from /jenkins/workspace/SANS_Nightly/builddir/undefined_gnu9/buildnode/reynolds/test/SANS_prefix_btest.h:51,
                 from /jenkins/workspace/SANS_Nightly/builddir/undefined_gnu9/buildnode/reynolds/build/undefined_gnu9/test/cotire/SANS_PREFIX_BTEST_CXX_prefix.cxx:4,
                 from /jenkins/workspace/SANS_Nightly/builddir/undefined_gnu9/buildnode/reynolds/build/undefined_gnu9/test/cotire/SANS_PREFIX_BTEST_CXX_prefix.hxx:4:
/usr/include/boost/test/output_test_stream.hpp:14:1: note: #pragma message: This header is deprecated. Use This header is deprecated. Please use <boost/test/tools/output_test_stream.hpp> instead. instead.
   14 | BOOST_HEADER_DEPRECATED( "This header is deprecated. Please use <boost/test/tools/output_test_stream.hpp> instead." )
      | ^~~~~~~~~~~~~~~~~~~~~~~
[ 91%] Built target Q2DConservative_btest_OBJECT
[ 91%] Linking CXX executable Q2DConservative_btest
[ 91%] Built target Q2DConservative_btest_build
[ 91%] Checking style of test/unit/pde/NS/Q2DEntropy_btest.cpp
[ 91%] Built target Q2DEntropy_btest_build_vera
[ 91%] Building CXX object test/unit/pde/NS/CMakeFiles/Q2DEntropy_btest_OBJECT.dir/Q2DEntropy_btest.cpp.o
In file included from /usr/include/boost/config/header_deprecated.hpp:18,
                 from /usr/include/boost/test/output_test_stream.hpp:13,
                 from /jenkins/workspace/SANS_Nightly/builddir/undefined_gnu9/buildnode/reynolds/test/SANS_prefix_btest.h:51,
                 from /jenkins/workspace/SANS_Nightly/builddir/undefined_gnu9/buildnode/reynolds/build/undefined_gnu9/test/cotire/SANS_PREFIX_BTEST_CXX_prefix.cxx:4,
                 from /jenkins/workspace/SANS_Nightly/builddir/undefined_gnu9/buildnode/reynolds/build/undefined_gnu9/test/cotire/SANS_PREFIX_BTEST_CXX_prefix.hxx:4:
/usr/include/boost/test/output_test_stream.hpp:14:1: note: #pragma message: This header is deprecated. Use This header is deprecated. Please use <boost/test/tools/output_test_stream.hpp> instead. instead.
   14 | BOOST_HEADER_DEPRECATED( "This header is deprecated. Please use <boost/test/tools/output_test_stream.hpp> instead." )
      | ^~~~~~~~~~~~~~~~~~~~~~~
[ 91%] Built target Q2DEntropy_btest_OBJECT
[ 91%] Linking CXX executable Q2DEntropy_btest
[ 91%] Built target Q2DEntropy_btest_build
[ 91%] Checking style of test/unit/pde/NS/Q2DPrimitiveRhoPressure_btest.cpp
[ 91%] Built target Q2DPrimitiveRhoPressure_btest_build_vera
[ 91%] Building CXX object test/unit/pde/NS/CMakeFiles/Q2DPrimitiveRhoPressure_btest_OBJECT.dir/Q2DPrimitiveRhoPressure_btest.cpp.o
In file included from /usr/include/boost/config/header_deprecated.hpp:18,
                 from /usr/include/boost/test/output_test_stream.hpp:13,
                 from /jenkins/workspace/SANS_Nightly/builddir/undefined_gnu9/buildnode/reynolds/test/SANS_prefix_btest.h:51,
                 from /jenkins/workspace/SANS_Nightly/builddir/undefined_gnu9/buildnode/reynolds/build/undefined_gnu9/test/cotire/SANS_PREFIX_BTEST_CXX_prefix.cxx:4,
                 from /jenkins/workspace/SANS_Nightly/builddir/undefined_gnu9/buildnode/reynolds/build/undefined_gnu9/test/cotire/SANS_PREFIX_BTEST_CXX_prefix.hxx:4:
/usr/include/boost/test/output_test_stream.hpp:14:1: note: #pragma message: This header is deprecated. Use This header is deprecated. Please use <boost/test/tools/output_test_stream.hpp> instead. instead.
   14 | BOOST_HEADER_DEPRECATED( "This header is deprecated. Please use <boost/test/tools/output_test_stream.hpp> instead." )
      | ^~~~~~~~~~~~~~~~~~~~~~~
[ 91%] Built target Q2DPrimitiveRhoPressure_btest_OBJECT
[ 91%] Linking CXX executable Q2DPrimitiveRhoPressure_btest
[ 91%] Built target Q2DPrimitiveRhoPressure_btest_build
[ 91%] Checking style of test/unit/pde/NS/Q2DPrimitiveRhoTemperature_btest.cpp
[ 91%] Built target Q2DPrimitiveRhoTemperature_btest_build_vera
[ 91%] Building CXX object test/unit/pde/NS/CMakeFiles/Q2DPrimitiveRhoTemperature_btest_OBJECT.dir/Q2DPrimitiveRhoTemperature_btest.cpp.o
In file included from /usr/include/boost/config/header_deprecated.hpp:18,
                 from /usr/include/boost/test/output_test_stream.hpp:13,
                 from /jenkins/workspace/SANS_Nightly/builddir/undefined_gnu9/buildnode/reynolds/test/SANS_prefix_btest.h:51,
                 from /jenkins/workspace/SANS_Nightly/builddir/undefined_gnu9/buildnode/reynolds/build/undefined_gnu9/test/cotire/SANS_PREFIX_BTEST_CXX_prefix.cxx:4,
                 from /jenkins/workspace/SANS_Nightly/builddir/undefined_gnu9/buildnode/reynolds/build/undefined_gnu9/test/cotire/SANS_PREFIX_BTEST_CXX_prefix.hxx:4:
/usr/include/boost/test/output_test_stream.hpp:14:1: note: #pragma message: This header is deprecated. Use This header is deprecated. Please use <boost/test/tools/output_test_stream.hpp> instead. instead.
   14 | BOOST_HEADER_DEPRECATED( "This header is deprecated. Please use <boost/test/tools/output_test_stream.hpp> instead." )
      | ^~~~~~~~~~~~~~~~~~~~~~~
[ 91%] Built target Q2DPrimitiveRhoTemperature_btest_OBJECT
[ 91%] Linking CXX executable Q2DPrimitiveRhoTemperature_btest
[ 91%] Built target Q2DPrimitiveRhoTemperature_btest_build
[ 91%] Checking style of test/unit/pde/NS/Q2DPrimitiveSurrogate_btest.cpp
[ 91%] Built target Q2DPrimitiveSurrogate_btest_build_vera
[ 91%] Building CXX object test/unit/pde/NS/CMakeFiles/Q2DPrimitiveSurrogate_btest_OBJECT.dir/Q2DPrimitiveSurrogate_btest.cpp.o
In file included from /usr/include/boost/config/header_deprecated.hpp:18,
                 from /usr/include/boost/test/output_test_stream.hpp:13,
                 from /jenkins/workspace/SANS_Nightly/builddir/undefined_gnu9/buildnode/reynolds/test/SANS_prefix_btest.h:51,
                 from /jenkins/workspace/SANS_Nightly/builddir/undefined_gnu9/buildnode/reynolds/build/undefined_gnu9/test/cotire/SANS_PREFIX_BTEST_CXX_prefix.cxx:4,
                 from /jenkins/workspace/SANS_Nightly/builddir/undefined_gnu9/buildnode/reynolds/build/undefined_gnu9/test/cotire/SANS_PREFIX_BTEST_CXX_prefix.hxx:4:
/usr/include/boost/test/output_test_stream.hpp:14:1: note: #pragma message: This header is deprecated. Use This header is deprecated. Please use <boost/test/tools/output_test_stream.hpp> instead. instead.
   14 | BOOST_HEADER_DEPRECATED( "This header is deprecated. Please use <boost/test/tools/output_test_stream.hpp> instead." )
      | ^~~~~~~~~~~~~~~~~~~~~~~
[ 91%] Built target Q2DPrimitiveSurrogate_btest_OBJECT
[ 91%] Linking CXX executable Q2DPrimitiveSurrogate_btest
[ 91%] Built target Q2DPrimitiveSurrogate_btest_build
[ 91%] Checking style of test/unit/pde/NS/Q3DConservative_btest.cpp
[ 91%] Built target Q3DConservative_btest_build_vera
[ 91%] Building CXX object test/unit/pde/NS/CMakeFiles/Q3DConservative_btest_OBJECT.dir/Q3DConservative_btest.cpp.o
In file included from /usr/include/boost/config/header_deprecated.hpp:18,
                 from /usr/include/boost/test/output_test_stream.hpp:13,
                 from /jenkins/workspace/SANS_Nightly/builddir/undefined_gnu9/buildnode/reynolds/test/SANS_prefix_btest.h:51,
                 from /jenkins/workspace/SANS_Nightly/builddir/undefined_gnu9/buildnode/reynolds/build/undefined_gnu9/test/cotire/SANS_PREFIX_BTEST_CXX_prefix.cxx:4,
                 from /jenkins/workspace/SANS_Nightly/builddir/undefined_gnu9/buildnode/reynolds/build/undefined_gnu9/test/cotire/SANS_PREFIX_BTEST_CXX_prefix.hxx:4:
/usr/include/boost/test/output_test_stream.hpp:14:1: note: #pragma message: This header is deprecated. Use This header is deprecated. Please use <boost/test/tools/output_test_stream.hpp> instead. instead.
   14 | BOOST_HEADER_DEPRECATED( "This header is deprecated. Please use <boost/test/tools/output_test_stream.hpp> instead." )
      | ^~~~~~~~~~~~~~~~~~~~~~~
[ 91%] Built target Q3DConservative_btest_OBJECT
[ 91%] Linking CXX executable Q3DConservative_btest
[ 91%] Built target Q3DConservative_btest_build
[ 91%] Checking style of test/unit/pde/NS/Q3DEntropy_btest.cpp
[ 91%] Built target Q3DEntropy_btest_build_vera
[ 91%] Building CXX object test/unit/pde/NS/CMakeFiles/Q3DEntropy_btest_OBJECT.dir/Q3DEntropy_btest.cpp.o
In file included from /usr/include/boost/config/header_deprecated.hpp:18,
                 from /usr/include/boost/test/output_test_stream.hpp:13,
                 from /jenkins/workspace/SANS_Nightly/builddir/undefined_gnu9/buildnode/reynolds/test/SANS_prefix_btest.h:51,
                 from /jenkins/workspace/SANS_Nightly/builddir/undefined_gnu9/buildnode/reynolds/build/undefined_gnu9/test/cotire/SANS_PREFIX_BTEST_CXX_prefix.cxx:4,
                 from /jenkins/workspace/SANS_Nightly/builddir/undefined_gnu9/buildnode/reynolds/build/undefined_gnu9/test/cotire/SANS_PREFIX_BTEST_CXX_prefix.hxx:4:
/usr/include/boost/test/output_test_stream.hpp:14:1: note: #pragma message: This header is deprecated. Use This header is deprecated. Please use <boost/test/tools/output_test_stream.hpp> instead. instead.
   14 | BOOST_HEADER_DEPRECATED( "This header is deprecated. Please use <boost/test/tools/output_test_stream.hpp> instead." )
      | ^~~~~~~~~~~~~~~~~~~~~~~
In file included from /jenkins/workspace/SANS_Nightly/builddir/undefined_gnu9/buildnode/reynolds/test/unit/pde/NS/Q3DEntropy_btest.cpp:16:
/jenkins/workspace/SANS_Nightly/builddir/undefined_gnu9/buildnode/reynolds/src/pde/NS/Q3DEntropy.h: In member function ‘void SANS::Q3D<SANS::QTypeEntropy, PDETraitsSize>::evalSecondGradient(SANS::Q3D<SANS::QTypeEntropy, PDETraitsSize>::ArrayQ<T>&, SANS::Q3D<SANS::QTypeEntropy, PDETraitsSize>::ArrayQ<Tg>&, SANS::Q3D<SANS::QTypeEntropy, PDETraitsSize>::ArrayQ<Tg>&, SANS::Q3D<SANS::QTypeEntropy, PDETraitsSize>::ArrayQ<Tg>&, SANS::Q3D<SANS::QTypeEntropy, PDETraitsSize>::ArrayQ<Th>&, SANS::Q3D<SANS::QTypeEntropy, PDETraitsSize>::ArrayQ<Th>&, SANS::Q3D<SANS::QTypeEntropy, PDETraitsSize>::ArrayQ<Th>&, SANS::Q3D<SANS::QTypeEntropy, PDETraitsSize>::ArrayQ<Th>&, SANS::Q3D<SANS::QTypeEntropy, PDETraitsSize>::ArrayQ<Th>&, SANS::Q3D<SANS::QTypeEntropy, PDETraitsSize>::ArrayQ<Th>&, SANS::DLA::MatrixSymS<3, typename SANS::promote_Surreal<Tq, Tg, Th>::type>&, SANS::DLA::MatrixSymS<3, typename SANS::promote_Surreal<Tq, Tg, Th>::type>&, SANS::DLA::MatrixSymS<3, typename SANS::promote_Surreal<Tq, Tg, Th>::type>&, SANS::DLA::MatrixSymS<3, typename SANS::promote_Surreal<Tq, Tg, Th>::type>&, SANS::DLA::MatrixSymS<3, typename SANS::promote_Surreal<Tq, Tg, Th>::type>&) const [with Tq = double; Tg = double; Th = double; PDETraitsSize = SANS::TraitsSizeEuler]’:
/jenkins/workspace/SANS_Nightly/builddir/undefined_gnu9/buildnode/reynolds/src/pde/NS/Q3DEntropy.h:395:1: note: variable tracking size limit exceeded with ‘-fvar-tracking-assignments’, retrying without
  395 | Q3D<QTypeEntropy, PDETraitsSize>::evalSecondGradient(
      | ^~~~~~~~~~~~~~~~~~~~~~~~~~~~~~~~
[ 91%] Built target Q3DEntropy_btest_OBJECT
[ 91%] Linking CXX executable Q3DEntropy_btest
[ 91%] Built target Q3DEntropy_btest_build
[ 91%] Checking style of test/unit/pde/NS/Q3DPrimitiveRhoPressure_btest.cpp
[ 91%] Built target Q3DPrimitiveRhoPressure_btest_build_vera
[ 91%] Building CXX object test/unit/pde/NS/CMakeFiles/Q3DPrimitiveRhoPressure_btest_OBJECT.dir/Q3DPrimitiveRhoPressure_btest.cpp.o
In file included from /usr/include/boost/config/header_deprecated.hpp:18,
                 from /usr/include/boost/test/output_test_stream.hpp:13,
                 from /jenkins/workspace/SANS_Nightly/builddir/undefined_gnu9/buildnode/reynolds/test/SANS_prefix_btest.h:51,
                 from /jenkins/workspace/SANS_Nightly/builddir/undefined_gnu9/buildnode/reynolds/build/undefined_gnu9/test/cotire/SANS_PREFIX_BTEST_CXX_prefix.cxx:4,
                 from /jenkins/workspace/SANS_Nightly/builddir/undefined_gnu9/buildnode/reynolds/build/undefined_gnu9/test/cotire/SANS_PREFIX_BTEST_CXX_prefix.hxx:4:
/usr/include/boost/test/output_test_stream.hpp:14:1: note: #pragma message: This header is deprecated. Use This header is deprecated. Please use <boost/test/tools/output_test_stream.hpp> instead. instead.
   14 | BOOST_HEADER_DEPRECATED( "This header is deprecated. Please use <boost/test/tools/output_test_stream.hpp> instead." )
      | ^~~~~~~~~~~~~~~~~~~~~~~
[ 91%] Built target Q3DPrimitiveRhoPressure_btest_OBJECT
[ 91%] Linking CXX executable Q3DPrimitiveRhoPressure_btest
[ 91%] Built target Q3DPrimitiveRhoPressure_btest_build
[ 91%] Checking style of test/unit/pde/NS/Q3DPrimitiveRhoTemperature_btest.cpp
[ 91%] Built target Q3DPrimitiveRhoTemperature_btest_build_vera
[ 91%] Building CXX object test/unit/pde/NS/CMakeFiles/Q3DPrimitiveRhoTemperature_btest_OBJECT.dir/Q3DPrimitiveRhoTemperature_btest.cpp.o
In file included from /usr/include/boost/config/header_deprecated.hpp:18,
                 from /usr/include/boost/test/output_test_stream.hpp:13,
                 from /jenkins/workspace/SANS_Nightly/builddir/undefined_gnu9/buildnode/reynolds/test/SANS_prefix_btest.h:51,
                 from /jenkins/workspace/SANS_Nightly/builddir/undefined_gnu9/buildnode/reynolds/build/undefined_gnu9/test/cotire/SANS_PREFIX_BTEST_CXX_prefix.cxx:4,
                 from /jenkins/workspace/SANS_Nightly/builddir/undefined_gnu9/buildnode/reynolds/build/undefined_gnu9/test/cotire/SANS_PREFIX_BTEST_CXX_prefix.hxx:4:
/usr/include/boost/test/output_test_stream.hpp:14:1: note: #pragma message: This header is deprecated. Use This header is deprecated. Please use <boost/test/tools/output_test_stream.hpp> instead. instead.
   14 | BOOST_HEADER_DEPRECATED( "This header is deprecated. Please use <boost/test/tools/output_test_stream.hpp> instead." )
      | ^~~~~~~~~~~~~~~~~~~~~~~
[ 91%] Built target Q3DPrimitiveRhoTemperature_btest_OBJECT
[ 91%] Linking CXX executable Q3DPrimitiveRhoTemperature_btest
[ 91%] Built target Q3DPrimitiveRhoTemperature_btest_build
[ 91%] Checking style of test/unit/pde/NS/Q3DPrimitiveSurrogate_btest.cpp
[ 91%] Built target Q3DPrimitiveSurrogate_btest_build_vera
[ 91%] Building CXX object test/unit/pde/NS/CMakeFiles/Q3DPrimitiveSurrogate_btest_OBJECT.dir/Q3DPrimitiveSurrogate_btest.cpp.o
In file included from /usr/include/boost/config/header_deprecated.hpp:18,
                 from /usr/include/boost/test/output_test_stream.hpp:13,
                 from /jenkins/workspace/SANS_Nightly/builddir/undefined_gnu9/buildnode/reynolds/test/SANS_prefix_btest.h:51,
                 from /jenkins/workspace/SANS_Nightly/builddir/undefined_gnu9/buildnode/reynolds/build/undefined_gnu9/test/cotire/SANS_PREFIX_BTEST_CXX_prefix.cxx:4,
                 from /jenkins/workspace/SANS_Nightly/builddir/undefined_gnu9/buildnode/reynolds/build/undefined_gnu9/test/cotire/SANS_PREFIX_BTEST_CXX_prefix.hxx:4:
/usr/include/boost/test/output_test_stream.hpp:14:1: note: #pragma message: This header is deprecated. Use This header is deprecated. Please use <boost/test/tools/output_test_stream.hpp> instead. instead.
   14 | BOOST_HEADER_DEPRECATED( "This header is deprecated. Please use <boost/test/tools/output_test_stream.hpp> instead." )
      | ^~~~~~~~~~~~~~~~~~~~~~~
[ 91%] Built target Q3DPrimitiveSurrogate_btest_OBJECT
[ 91%] Linking CXX executable Q3DPrimitiveSurrogate_btest
[ 91%] Built target Q3DPrimitiveSurrogate_btest_build
[ 91%] Checking style of test/unit/pde/NS/QRANSSA2D_btest.cpp
[ 91%] Built target QRANSSA2D_btest_build_vera
[ 91%] Building CXX object test/unit/pde/NS/CMakeFiles/QRANSSA2D_btest_OBJECT.dir/QRANSSA2D_btest.cpp.o
In file included from /usr/include/boost/config/header_deprecated.hpp:18,
                 from /usr/include/boost/test/output_test_stream.hpp:13,
                 from /jenkins/workspace/SANS_Nightly/builddir/undefined_gnu9/buildnode/reynolds/test/SANS_prefix_btest.h:51,
                 from /jenkins/workspace/SANS_Nightly/builddir/undefined_gnu9/buildnode/reynolds/build/undefined_gnu9/test/cotire/SANS_PREFIX_BTEST_CXX_prefix.cxx:4,
                 from /jenkins/workspace/SANS_Nightly/builddir/undefined_gnu9/buildnode/reynolds/build/undefined_gnu9/test/cotire/SANS_PREFIX_BTEST_CXX_prefix.hxx:4:
/usr/include/boost/test/output_test_stream.hpp:14:1: note: #pragma message: This header is deprecated. Use This header is deprecated. Please use <boost/test/tools/output_test_stream.hpp> instead. instead.
   14 | BOOST_HEADER_DEPRECATED( "This header is deprecated. Please use <boost/test/tools/output_test_stream.hpp> instead." )
      | ^~~~~~~~~~~~~~~~~~~~~~~
[ 91%] Built target QRANSSA2D_btest_OBJECT
[ 91%] Linking CXX executable QRANSSA2D_btest
[ 91%] Built target QRANSSA2D_btest_build
[ 91%] Checking style of test/unit/pde/NS/QRANSSA3D_btest.cpp
[ 91%] Built target QRANSSA3D_btest_build_vera
[ 91%] Building CXX object test/unit/pde/NS/CMakeFiles/QRANSSA3D_btest_OBJECT.dir/QRANSSA3D_btest.cpp.o
In file included from /usr/include/boost/config/header_deprecated.hpp:18,
                 from /usr/include/boost/test/output_test_stream.hpp:13,
                 from /jenkins/workspace/SANS_Nightly/builddir/undefined_gnu9/buildnode/reynolds/test/SANS_prefix_btest.h:51,
                 from /jenkins/workspace/SANS_Nightly/builddir/undefined_gnu9/buildnode/reynolds/build/undefined_gnu9/test/cotire/SANS_PREFIX_BTEST_CXX_prefix.cxx:4,
                 from /jenkins/workspace/SANS_Nightly/builddir/undefined_gnu9/buildnode/reynolds/build/undefined_gnu9/test/cotire/SANS_PREFIX_BTEST_CXX_prefix.hxx:4:
/usr/include/boost/test/output_test_stream.hpp:14:1: note: #pragma message: This header is deprecated. Use This header is deprecated. Please use <boost/test/tools/output_test_stream.hpp> instead. instead.
   14 | BOOST_HEADER_DEPRECATED( "This header is deprecated. Please use <boost/test/tools/output_test_stream.hpp> instead." )
      | ^~~~~~~~~~~~~~~~~~~~~~~
[ 91%] Built target QRANSSA3D_btest_OBJECT
[ 91%] Linking CXX executable QRANSSA3D_btest
[ 91%] Built target QRANSSA3D_btest_build
[ 91%] Checking style of test/unit/pde/NS/Roe_btest.cpp
[ 91%] Built target Roe_btest_build_vera
[ 91%] Building CXX object test/unit/pde/NS/CMakeFiles/Roe_btest_OBJECT.dir/Roe_btest.cpp.o
In file included from /usr/include/boost/config/header_deprecated.hpp:18,
                 from /usr/include/boost/test/output_test_stream.hpp:13,
                 from /jenkins/workspace/SANS_Nightly/builddir/undefined_gnu9/buildnode/reynolds/test/SANS_prefix_btest.h:51,
                 from /jenkins/workspace/SANS_Nightly/builddir/undefined_gnu9/buildnode/reynolds/build/undefined_gnu9/test/cotire/SANS_PREFIX_BTEST_CXX_prefix.cxx:4,
                 from /jenkins/workspace/SANS_Nightly/builddir/undefined_gnu9/buildnode/reynolds/build/undefined_gnu9/test/cotire/SANS_PREFIX_BTEST_CXX_prefix.hxx:4:
/usr/include/boost/test/output_test_stream.hpp:14:1: note: #pragma message: This header is deprecated. Use This header is deprecated. Please use <boost/test/tools/output_test_stream.hpp> instead. instead.
   14 | BOOST_HEADER_DEPRECATED( "This header is deprecated. Please use <boost/test/tools/output_test_stream.hpp> instead." )
      | ^~~~~~~~~~~~~~~~~~~~~~~
[ 91%] Built target Roe_btest_OBJECT
[ 91%] Linking CXX executable Roe_btest
[ 91%] Built target Roe_btest_build
[ 91%] Checking style of test/unit/pde/NDConvert/BCNDConvert_btest.cpp
[ 91%] Built target BCNDConvert_btest_build_vera
[ 91%] Building CXX object test/unit/pde/NDConvert/CMakeFiles/BCNDConvert_btest_OBJECT.dir/BCNDConvert_btest.cpp.o
[ 91%] Built target BCNDConvert_btest_OBJECT
[ 91%] Linking CXX executable BCNDConvert_btest
[ 91%] Built target BCNDConvert_btest_build
[ 91%] Checking style of test/unit/pde/NDConvert/OutputNDConvert_btest.cpp
[ 91%] Built target OutputNDConvert_btest_build_vera
[ 91%] Building CXX object test/unit/pde/NDConvert/CMakeFiles/OutputNDConvert_btest_OBJECT.dir/OutputNDConvert_btest.cpp.o
[ 91%] Built target OutputNDConvert_btest_OBJECT
[ 91%] Linking CXX executable OutputNDConvert_btest
[ 91%] Built target OutputNDConvert_btest_build
[ 91%] Checking style of test/unit/pde/NDConvert/PDENDConvert1D_AD_ST_btest.cpp
[ 91%] Built target PDENDConvert1D_AD_ST_btest_build_vera
[ 91%] Building CXX object test/unit/pde/NDConvert/CMakeFiles/PDENDConvert1D_AD_ST_btest_OBJECT.dir/PDENDConvert1D_AD_ST_btest.cpp.o
[ 91%] Built target PDENDConvert1D_AD_ST_btest_OBJECT
[ 91%] Linking CXX executable PDENDConvert1D_AD_ST_btest
[ 91%] Built target PDENDConvert1D_AD_ST_btest_build
[ 91%] Checking style of test/unit/pde/NDConvert/PDENDConvert1D_AD_btest.cpp
[ 91%] Built target PDENDConvert1D_AD_btest_build_vera
[ 91%] Building CXX object test/unit/pde/NDConvert/CMakeFiles/PDENDConvert1D_AD_btest_OBJECT.dir/PDENDConvert1D_AD_btest.cpp.o
[ 91%] Built target PDENDConvert1D_AD_btest_OBJECT
[ 91%] Linking CXX executable PDENDConvert1D_AD_btest
[ 91%] Built target PDENDConvert1D_AD_btest_build
[ 91%] Checking style of test/unit/pde/NDConvert/PDENDConvert2D_AD_btest.cpp
[ 91%] Built target PDENDConvert2D_AD_btest_build_vera
[ 91%] Building CXX object test/unit/pde/NDConvert/CMakeFiles/PDENDConvert2D_AD_btest_OBJECT.dir/PDENDConvert2D_AD_btest.cpp.o
[ 91%] Built target PDENDConvert2D_AD_btest_OBJECT
[ 91%] Linking CXX executable PDENDConvert2D_AD_btest
[ 91%] Built target PDENDConvert2D_AD_btest_build
[ 91%] Checking style of test/unit/pde/NDConvert/PDENDConvert3D_AD_btest.cpp
[ 91%] Built target PDENDConvert3D_AD_btest_build_vera
[ 91%] Building CXX object test/unit/pde/NDConvert/CMakeFiles/PDENDConvert3D_AD_btest_OBJECT.dir/PDENDConvert3D_AD_btest.cpp.o
[ 91%] Built target PDENDConvert3D_AD_btest_OBJECT
[ 91%] Linking CXX executable PDENDConvert3D_AD_btest
[ 91%] Built target PDENDConvert3D_AD_btest_build
[ 91%] Checking style of test/unit/pde/NDConvert/SolnNDConvert1D_AD_btest.cpp
[ 91%] Built target SolnNDConvert1D_AD_btest_build_vera
[ 91%] Building CXX object test/unit/pde/NDConvert/CMakeFiles/SolnNDConvert1D_AD_btest_OBJECT.dir/SolnNDConvert1D_AD_btest.cpp.o
[ 91%] Built target SolnNDConvert1D_AD_btest_OBJECT
[ 91%] Linking CXX executable SolnNDConvert1D_AD_btest
[ 91%] Built target SolnNDConvert1D_AD_btest_build
[ 91%] Checking style of test/unit/pde/NDConvert/SolnNDConvert2D_AD_btest.cpp
[ 91%] Built target SolnNDConvert2D_AD_btest_build_vera
[ 91%] Building CXX object test/unit/pde/NDConvert/CMakeFiles/SolnNDConvert2D_AD_btest_OBJECT.dir/SolnNDConvert2D_AD_btest.cpp.o
[ 91%] Built target SolnNDConvert2D_AD_btest_OBJECT
[ 91%] Linking CXX executable SolnNDConvert2D_AD_btest
[ 91%] Built target SolnNDConvert2D_AD_btest_build
[ 91%] Checking style of test/unit/pde/NDConvert/SolnNDConvert3D_AD_btest.cpp
[ 91%] Built target SolnNDConvert3D_AD_btest_build_vera
[ 91%] Building CXX object test/unit/pde/NDConvert/CMakeFiles/SolnNDConvert3D_AD_btest_OBJECT.dir/SolnNDConvert3D_AD_btest.cpp.o
[ 91%] Built target SolnNDConvert3D_AD_btest_OBJECT
[ 91%] Linking CXX executable SolnNDConvert3D_AD_btest
[ 91%] Built target SolnNDConvert3D_AD_btest_build
[ 91%] Checking style of test/unit/pde/HSM/BCHSM2D_btest.cpp
[ 91%] Built target BCHSM2D_btest_build_vera
[ 91%] Building CXX object test/unit/pde/HSM/CMakeFiles/BCHSM2D_btest_OBJECT.dir/BCHSM2D_btest.cpp.o
In file included from /usr/include/boost/config/header_deprecated.hpp:18,
                 from /usr/include/boost/test/output_test_stream.hpp:13,
                 from /jenkins/workspace/SANS_Nightly/builddir/undefined_gnu9/buildnode/reynolds/test/SANS_prefix_btest.h:51,
                 from /jenkins/workspace/SANS_Nightly/builddir/undefined_gnu9/buildnode/reynolds/build/undefined_gnu9/test/cotire/SANS_PREFIX_BTEST_CXX_prefix.cxx:4,
                 from /jenkins/workspace/SANS_Nightly/builddir/undefined_gnu9/buildnode/reynolds/build/undefined_gnu9/test/cotire/SANS_PREFIX_BTEST_CXX_prefix.hxx:4:
/usr/include/boost/test/output_test_stream.hpp:14:1: note: #pragma message: This header is deprecated. Use This header is deprecated. Please use <boost/test/tools/output_test_stream.hpp> instead. instead.
   14 | BOOST_HEADER_DEPRECATED( "This header is deprecated. Please use <boost/test/tools/output_test_stream.hpp> instead." )
      | ^~~~~~~~~~~~~~~~~~~~~~~
[ 91%] Built target BCHSM2D_btest_OBJECT
[ 91%] Linking CXX executable BCHSM2D_btest
[ 91%] Built target BCHSM2D_btest_build
[ 91%] Checking style of test/unit/pde/HSM/HSMVariable_btest.cpp
[ 91%] Built target HSMVariable_btest_build_vera
[ 91%] Building CXX object test/unit/pde/HSM/CMakeFiles/HSMVariable_btest_OBJECT.dir/HSMVariable_btest.cpp.o
[ 91%] Built target HSMVariable_btest_OBJECT
[ 91%] Linking CXX executable HSMVariable_btest
[ 91%] Built target HSMVariable_btest_build
[ 91%] Checking style of test/unit/pde/HSM/PDEHSM2D_btest.cpp
[ 91%] Built target PDEHSM2D_btest_build_vera
[ 91%] Building CXX object test/unit/pde/HSM/CMakeFiles/PDEHSM2D_btest_OBJECT.dir/PDEHSM2D_btest.cpp.o
In file included from /usr/include/boost/config/header_deprecated.hpp:18,
                 from /usr/include/boost/test/output_test_stream.hpp:13,
                 from /jenkins/workspace/SANS_Nightly/builddir/undefined_gnu9/buildnode/reynolds/test/SANS_prefix_btest.h:51,
                 from /jenkins/workspace/SANS_Nightly/builddir/undefined_gnu9/buildnode/reynolds/build/undefined_gnu9/test/cotire/SANS_PREFIX_BTEST_CXX_prefix.cxx:4,
                 from /jenkins/workspace/SANS_Nightly/builddir/undefined_gnu9/buildnode/reynolds/build/undefined_gnu9/test/cotire/SANS_PREFIX_BTEST_CXX_prefix.hxx:4:
/usr/include/boost/test/output_test_stream.hpp:14:1: note: #pragma message: This header is deprecated. Use This header is deprecated. Please use <boost/test/tools/output_test_stream.hpp> instead. instead.
   14 | BOOST_HEADER_DEPRECATED( "This header is deprecated. Please use <boost/test/tools/output_test_stream.hpp> instead." )
      | ^~~~~~~~~~~~~~~~~~~~~~~
[ 91%] Built target PDEHSM2D_btest_OBJECT
[ 91%] Linking CXX executable PDEHSM2D_btest
[ 91%] Built target PDEHSM2D_btest_build
[ 91%] Checking style of test/unit/pde/HSM/PDEHSMKL_btest.cpp
[ 91%] Built target PDEHSMKL_btest_build_vera
[ 91%] Building CXX object test/unit/pde/HSM/CMakeFiles/PDEHSMKL_btest_OBJECT.dir/PDEHSMKL_btest.cpp.o
In file included from /usr/include/boost/config/header_deprecated.hpp:18,
                 from /usr/include/boost/test/output_test_stream.hpp:13,
                 from /jenkins/workspace/SANS_Nightly/builddir/undefined_gnu9/buildnode/reynolds/test/SANS_prefix_btest.h:51,
                 from /jenkins/workspace/SANS_Nightly/builddir/undefined_gnu9/buildnode/reynolds/build/undefined_gnu9/test/cotire/SANS_PREFIX_BTEST_CXX_prefix.cxx:4,
                 from /jenkins/workspace/SANS_Nightly/builddir/undefined_gnu9/buildnode/reynolds/build/undefined_gnu9/test/cotire/SANS_PREFIX_BTEST_CXX_prefix.hxx:4:
/usr/include/boost/test/output_test_stream.hpp:14:1: note: #pragma message: This header is deprecated. Use This header is deprecated. Please use <boost/test/tools/output_test_stream.hpp> instead. instead.
   14 | BOOST_HEADER_DEPRECATED( "This header is deprecated. Please use <boost/test/tools/output_test_stream.hpp> instead." )
      | ^~~~~~~~~~~~~~~~~~~~~~~
[ 91%] Built target PDEHSMKL_btest_OBJECT
[ 91%] Linking CXX executable PDEHSMKL_btest
[ 91%] Built target PDEHSMKL_btest_build
[ 91%] Checking style of test/unit/pde/HSM/VarLambda_btest.cpp
[ 91%] Built target VarLambda_btest_build_vera
[ 91%] Building CXX object test/unit/pde/HSM/CMakeFiles/VarLambda_btest_OBJECT.dir/VarLambda_btest.cpp.o
[ 91%] Built target VarLambda_btest_OBJECT
[ 91%] Linking CXX executable VarLambda_btest
[ 91%] Built target VarLambda_btest_build
[ 91%] Checking style of test/unit/pde/PorousMedia/BCBuckleyLeverett1D_btest.cpp
[ 91%] Built target BCBuckleyLeverett1D_btest_build_vera
[ 91%] Building CXX object test/unit/pde/PorousMedia/CMakeFiles/BCBuckleyLeverett1D_btest_OBJECT.dir/BCBuckleyLeverett1D_btest.cpp.o
In file included from /usr/include/boost/config/header_deprecated.hpp:18,
                 from /usr/include/boost/test/output_test_stream.hpp:13,
                 from /jenkins/workspace/SANS_Nightly/builddir/undefined_gnu9/buildnode/reynolds/test/SANS_prefix_btest.h:51,
                 from /jenkins/workspace/SANS_Nightly/builddir/undefined_gnu9/buildnode/reynolds/build/undefined_gnu9/test/cotire/SANS_PREFIX_BTEST_CXX_prefix.cxx:4,
                 from /jenkins/workspace/SANS_Nightly/builddir/undefined_gnu9/buildnode/reynolds/build/undefined_gnu9/test/cotire/SANS_PREFIX_BTEST_CXX_prefix.hxx:4:
/usr/include/boost/test/output_test_stream.hpp:14:1: note: #pragma message: This header is deprecated. Use This header is deprecated. Please use <boost/test/tools/output_test_stream.hpp> instead. instead.
   14 | BOOST_HEADER_DEPRECATED( "This header is deprecated. Please use <boost/test/tools/output_test_stream.hpp> instead." )
      | ^~~~~~~~~~~~~~~~~~~~~~~
[ 91%] Built target BCBuckleyLeverett1D_btest_OBJECT
[ 91%] Linking CXX executable BCBuckleyLeverett1D_btest
[ 91%] Built target BCBuckleyLeverett1D_btest_build
[ 91%] Checking style of test/unit/pde/PorousMedia/BCBuckleyLeverett_ArtificialViscosity1D_btest.cpp
[ 91%] Built target BCBuckleyLeverett_ArtificialViscosity1D_btest_build_vera
[ 91%] Building CXX object test/unit/pde/PorousMedia/CMakeFiles/BCBuckleyLeverett_ArtificialViscosity1D_btest_OBJECT.dir/BCBuckleyLeverett_ArtificialViscosity1D_btest.cpp.o
In file included from /usr/include/boost/config/header_deprecated.hpp:18,
                 from /usr/include/boost/test/output_test_stream.hpp:13,
                 from /jenkins/workspace/SANS_Nightly/builddir/undefined_gnu9/buildnode/reynolds/test/SANS_prefix_btest.h:51,
                 from /jenkins/workspace/SANS_Nightly/builddir/undefined_gnu9/buildnode/reynolds/build/undefined_gnu9/test/cotire/SANS_PREFIX_BTEST_CXX_prefix.cxx:4,
                 from /jenkins/workspace/SANS_Nightly/builddir/undefined_gnu9/buildnode/reynolds/build/undefined_gnu9/test/cotire/SANS_PREFIX_BTEST_CXX_prefix.hxx:4:
/usr/include/boost/test/output_test_stream.hpp:14:1: note: #pragma message: This header is deprecated. Use This header is deprecated. Please use <boost/test/tools/output_test_stream.hpp> instead. instead.
   14 | BOOST_HEADER_DEPRECATED( "This header is deprecated. Please use <boost/test/tools/output_test_stream.hpp> instead." )
      | ^~~~~~~~~~~~~~~~~~~~~~~
[ 91%] Built target BCBuckleyLeverett_ArtificialViscosity1D_btest_OBJECT
[ 91%] Linking CXX executable BCBuckleyLeverett_ArtificialViscosity1D_btest
[ 91%] Built target BCBuckleyLeverett_ArtificialViscosity1D_btest_build
[ 91%] Checking style of test/unit/pde/PorousMedia/BCTwoPhase1D_btest.cpp
[ 91%] Built target BCTwoPhase1D_btest_build_vera
[ 91%] Building CXX object test/unit/pde/PorousMedia/CMakeFiles/BCTwoPhase1D_btest_OBJECT.dir/BCTwoPhase1D_btest.cpp.o
In file included from /usr/include/boost/config/header_deprecated.hpp:18,
                 from /usr/include/boost/test/output_test_stream.hpp:13,
                 from /jenkins/workspace/SANS_Nightly/builddir/undefined_gnu9/buildnode/reynolds/test/SANS_prefix_btest.h:51,
                 from /jenkins/workspace/SANS_Nightly/builddir/undefined_gnu9/buildnode/reynolds/build/undefined_gnu9/test/cotire/SANS_PREFIX_BTEST_CXX_prefix.cxx:4,
                 from /jenkins/workspace/SANS_Nightly/builddir/undefined_gnu9/buildnode/reynolds/build/undefined_gnu9/test/cotire/SANS_PREFIX_BTEST_CXX_prefix.hxx:4:
/usr/include/boost/test/output_test_stream.hpp:14:1: note: #pragma message: This header is deprecated. Use This header is deprecated. Please use <boost/test/tools/output_test_stream.hpp> instead. instead.
   14 | BOOST_HEADER_DEPRECATED( "This header is deprecated. Please use <boost/test/tools/output_test_stream.hpp> instead." )
      | ^~~~~~~~~~~~~~~~~~~~~~~
[ 91%] Built target BCTwoPhase1D_btest_OBJECT
[ 91%] Linking CXX executable BCTwoPhase1D_btest
[ 91%] Built target BCTwoPhase1D_btest_build
[ 91%] Checking style of test/unit/pde/PorousMedia/BCTwoPhase2D_btest.cpp
[ 91%] Built target BCTwoPhase2D_btest_build_vera
[ 91%] Building CXX object test/unit/pde/PorousMedia/CMakeFiles/BCTwoPhase2D_btest_OBJECT.dir/BCTwoPhase2D_btest.cpp.o
In file included from /usr/include/boost/config/header_deprecated.hpp:18,
                 from /usr/include/boost/test/output_test_stream.hpp:13,
                 from /jenkins/workspace/SANS_Nightly/builddir/undefined_gnu9/buildnode/reynolds/test/SANS_prefix_btest.h:51,
                 from /jenkins/workspace/SANS_Nightly/builddir/undefined_gnu9/buildnode/reynolds/build/undefined_gnu9/test/cotire/SANS_PREFIX_BTEST_CXX_prefix.cxx:4,
                 from /jenkins/workspace/SANS_Nightly/builddir/undefined_gnu9/buildnode/reynolds/build/undefined_gnu9/test/cotire/SANS_PREFIX_BTEST_CXX_prefix.hxx:4:
/usr/include/boost/test/output_test_stream.hpp:14:1: note: #pragma message: This header is deprecated. Use This header is deprecated. Please use <boost/test/tools/output_test_stream.hpp> instead. instead.
   14 | BOOST_HEADER_DEPRECATED( "This header is deprecated. Please use <boost/test/tools/output_test_stream.hpp> instead." )
      | ^~~~~~~~~~~~~~~~~~~~~~~
[ 91%] Built target BCTwoPhase2D_btest_OBJECT
[ 91%] Linking CXX executable BCTwoPhase2D_btest
[ 91%] Built target BCTwoPhase2D_btest_build
[ 91%] Checking style of test/unit/pde/PorousMedia/BCTwoPhaseArtificialViscosity1D_btest.cpp
[ 91%] Built target BCTwoPhaseArtificialViscosity1D_btest_build_vera
[ 91%] Building CXX object test/unit/pde/PorousMedia/CMakeFiles/BCTwoPhaseArtificialViscosity1D_btest_OBJECT.dir/BCTwoPhaseArtificialViscosity1D_btest.cpp.o
In file included from /usr/include/boost/config/header_deprecated.hpp:18,
                 from /usr/include/boost/test/output_test_stream.hpp:13,
                 from /jenkins/workspace/SANS_Nightly/builddir/undefined_gnu9/buildnode/reynolds/test/SANS_prefix_btest.h:51,
                 from /jenkins/workspace/SANS_Nightly/builddir/undefined_gnu9/buildnode/reynolds/build/undefined_gnu9/test/cotire/SANS_PREFIX_BTEST_CXX_prefix.cxx:4,
                 from /jenkins/workspace/SANS_Nightly/builddir/undefined_gnu9/buildnode/reynolds/build/undefined_gnu9/test/cotire/SANS_PREFIX_BTEST_CXX_prefix.hxx:4:
/usr/include/boost/test/output_test_stream.hpp:14:1: note: #pragma message: This header is deprecated. Use This header is deprecated. Please use <boost/test/tools/output_test_stream.hpp> instead. instead.
   14 | BOOST_HEADER_DEPRECATED( "This header is deprecated. Please use <boost/test/tools/output_test_stream.hpp> instead." )
      | ^~~~~~~~~~~~~~~~~~~~~~~
In file included from /jenkins/workspace/SANS_Nightly/builddir/undefined_gnu9/buildnode/reynolds/test/unit/pde/PorousMedia/BCTwoPhaseArtificialViscosity1D_btest.cpp:31:
/jenkins/workspace/SANS_Nightly/builddir/undefined_gnu9/buildnode/reynolds/src/pde/ArtificialViscosity/AVSensor_ViscousFlux1D.h:26:46: note: #pragma message: #undef USE_GRID_LAPLACIAN
   26 | #pragma message( "#undef USE_GRID_LAPLACIAN" )
      |                                              ^
In file included from /jenkins/workspace/SANS_Nightly/builddir/undefined_gnu9/buildnode/reynolds/test/unit/pde/PorousMedia/BCTwoPhaseArtificialViscosity1D_btest.cpp:33:
/jenkins/workspace/SANS_Nightly/builddir/undefined_gnu9/buildnode/reynolds/src/pde/ArtificialViscosity/PDEmitAVSensor1D.h:38:46: note: #pragma message: #undef USE_GRID_LAPLACIAN
   38 | #pragma message( "#undef USE_GRID_LAPLACIAN" )
      |                                              ^
[ 91%] Built target BCTwoPhaseArtificialViscosity1D_btest_OBJECT
[ 91%] Linking CXX executable BCTwoPhaseArtificialViscosity1D_btest
[ 91%] Built target BCTwoPhaseArtificialViscosity1D_btest_build
[ 91%] Checking style of test/unit/pde/PorousMedia/BCTwoPhaseArtificialViscosity2D_btest.cpp
[ 91%] Built target BCTwoPhaseArtificialViscosity2D_btest_build_vera
[ 91%] Building CXX object test/unit/pde/PorousMedia/CMakeFiles/BCTwoPhaseArtificialViscosity2D_btest_OBJECT.dir/BCTwoPhaseArtificialViscosity2D_btest.cpp.o
In file included from /usr/include/boost/config/header_deprecated.hpp:18,
                 from /usr/include/boost/test/output_test_stream.hpp:13,
                 from /jenkins/workspace/SANS_Nightly/builddir/undefined_gnu9/buildnode/reynolds/test/SANS_prefix_btest.h:51,
                 from /jenkins/workspace/SANS_Nightly/builddir/undefined_gnu9/buildnode/reynolds/build/undefined_gnu9/test/cotire/SANS_PREFIX_BTEST_CXX_prefix.cxx:4,
                 from /jenkins/workspace/SANS_Nightly/builddir/undefined_gnu9/buildnode/reynolds/build/undefined_gnu9/test/cotire/SANS_PREFIX_BTEST_CXX_prefix.hxx:4:
/usr/include/boost/test/output_test_stream.hpp:14:1: note: #pragma message: This header is deprecated. Use This header is deprecated. Please use <boost/test/tools/output_test_stream.hpp> instead. instead.
   14 | BOOST_HEADER_DEPRECATED( "This header is deprecated. Please use <boost/test/tools/output_test_stream.hpp> instead." )
      | ^~~~~~~~~~~~~~~~~~~~~~~
In file included from /jenkins/workspace/SANS_Nightly/builddir/undefined_gnu9/buildnode/reynolds/src/pde/PorousMedia/BCTwoPhaseArtificialViscosity2D.h:25,
                 from /jenkins/workspace/SANS_Nightly/builddir/undefined_gnu9/buildnode/reynolds/test/unit/pde/PorousMedia/BCTwoPhaseArtificialViscosity2D_btest.cpp:21:
/jenkins/workspace/SANS_Nightly/builddir/undefined_gnu9/buildnode/reynolds/src/pde/PorousMedia/PDETwoPhase_ArtificialViscosity2D.h:32:46: note: #pragma message: #undef USE_GRID_LAPLACIAN
   32 | #pragma message( "#undef USE_GRID_LAPLACIAN" )
      |                                              ^
In file included from /jenkins/workspace/SANS_Nightly/builddir/undefined_gnu9/buildnode/reynolds/test/unit/pde/PorousMedia/BCTwoPhaseArtificialViscosity2D_btest.cpp:21:
/jenkins/workspace/SANS_Nightly/builddir/undefined_gnu9/buildnode/reynolds/src/pde/PorousMedia/BCTwoPhaseArtificialViscosity2D.h:32:46: note: #pragma message: #undef USE_GRID_LAPLACIAN
   32 | #pragma message( "#undef USE_GRID_LAPLACIAN" )
      |                                              ^
In file included from /jenkins/workspace/SANS_Nightly/builddir/undefined_gnu9/buildnode/reynolds/test/unit/pde/PorousMedia/BCTwoPhaseArtificialViscosity2D_btest.cpp:32:
/jenkins/workspace/SANS_Nightly/builddir/undefined_gnu9/buildnode/reynolds/src/pde/ArtificialViscosity/AVSensor_ViscousFlux2D.h:30:46: note: #pragma message: #undef USE_GRID_LAPLACIAN
   30 | #pragma message( "#undef USE_GRID_LAPLACIAN" )
      |                                              ^
In file included from /jenkins/workspace/SANS_Nightly/builddir/undefined_gnu9/buildnode/reynolds/src/pde/ArtificialViscosity/AVSensor_Source2D.h:26,
                 from /jenkins/workspace/SANS_Nightly/builddir/undefined_gnu9/buildnode/reynolds/test/unit/pde/PorousMedia/BCTwoPhaseArtificialViscosity2D_btest.cpp:33:
/jenkins/workspace/SANS_Nightly/builddir/undefined_gnu9/buildnode/reynolds/src/pde/ArtificialViscosity/PDEmitAVSensor2D.h:38:46: note: #pragma message: #undef USE_GRID_LAPLACIAN
   38 | #pragma message( "#undef USE_GRID_LAPLACIAN" )
      |                                              ^
In file included from /jenkins/workspace/SANS_Nightly/builddir/undefined_gnu9/buildnode/reynolds/test/unit/pde/PorousMedia/BCTwoPhaseArtificialViscosity2D_btest.cpp:33:
/jenkins/workspace/SANS_Nightly/builddir/undefined_gnu9/buildnode/reynolds/src/pde/ArtificialViscosity/AVSensor_Source2D.h:38:46: note: #pragma message: #undef USE_GRID_LAPLACIAN
   38 | #pragma message( "#undef USE_GRID_LAPLACIAN" )
      |                                              ^
[ 91%] Built target BCTwoPhaseArtificialViscosity2D_btest_OBJECT
[ 91%] Linking CXX executable BCTwoPhaseArtificialViscosity2D_btest
[ 91%] Built target BCTwoPhaseArtificialViscosity2D_btest_build
[ 91%] Checking style of test/unit/pde/PorousMedia/BCTwoPhaseLinearized1D_btest.cpp
[ 91%] Built target BCTwoPhaseLinearized1D_btest_build_vera
[ 91%] Building CXX object test/unit/pde/PorousMedia/CMakeFiles/BCTwoPhaseLinearized1D_btest_OBJECT.dir/BCTwoPhaseLinearized1D_btest.cpp.o
In file included from /usr/include/boost/config/header_deprecated.hpp:18,
                 from /usr/include/boost/test/output_test_stream.hpp:13,
                 from /jenkins/workspace/SANS_Nightly/builddir/undefined_gnu9/buildnode/reynolds/test/SANS_prefix_btest.h:51,
                 from /jenkins/workspace/SANS_Nightly/builddir/undefined_gnu9/buildnode/reynolds/build/undefined_gnu9/test/cotire/SANS_PREFIX_BTEST_CXX_prefix.cxx:4,
                 from /jenkins/workspace/SANS_Nightly/builddir/undefined_gnu9/buildnode/reynolds/build/undefined_gnu9/test/cotire/SANS_PREFIX_BTEST_CXX_prefix.hxx:4:
/usr/include/boost/test/output_test_stream.hpp:14:1: note: #pragma message: This header is deprecated. Use This header is deprecated. Please use <boost/test/tools/output_test_stream.hpp> instead. instead.
   14 | BOOST_HEADER_DEPRECATED( "This header is deprecated. Please use <boost/test/tools/output_test_stream.hpp> instead." )
      | ^~~~~~~~~~~~~~~~~~~~~~~
[ 91%] Built target BCTwoPhaseLinearized1D_btest_OBJECT
[ 91%] Linking CXX executable BCTwoPhaseLinearized1D_btest
[ 91%] Built target BCTwoPhaseLinearized1D_btest_build
[ 91%] Checking style of test/unit/pde/PorousMedia/CapillaryModel_btest.cpp
[ 91%] Built target CapillaryModel_btest_build_vera
[ 91%] Building CXX object test/unit/pde/PorousMedia/CMakeFiles/CapillaryModel_btest_OBJECT.dir/CapillaryModel_btest.cpp.o
In file included from /usr/include/boost/config/header_deprecated.hpp:18,
                 from /usr/include/boost/test/output_test_stream.hpp:13,
                 from /jenkins/workspace/SANS_Nightly/builddir/undefined_gnu9/buildnode/reynolds/test/SANS_prefix_btest.h:51,
                 from /jenkins/workspace/SANS_Nightly/builddir/undefined_gnu9/buildnode/reynolds/build/undefined_gnu9/test/cotire/SANS_PREFIX_BTEST_CXX_prefix.cxx:4,
                 from /jenkins/workspace/SANS_Nightly/builddir/undefined_gnu9/buildnode/reynolds/build/undefined_gnu9/test/cotire/SANS_PREFIX_BTEST_CXX_prefix.hxx:4:
/usr/include/boost/test/output_test_stream.hpp:14:1: note: #pragma message: This header is deprecated. Use This header is deprecated. Please use <boost/test/tools/output_test_stream.hpp> instead. instead.
   14 | BOOST_HEADER_DEPRECATED( "This header is deprecated. Please use <boost/test/tools/output_test_stream.hpp> instead." )
      | ^~~~~~~~~~~~~~~~~~~~~~~
[ 91%] Built target CapillaryModel_btest_OBJECT
[ 91%] Linking CXX executable CapillaryModel_btest
[ 91%] Built target CapillaryModel_btest_build
[ 91%] Checking style of test/unit/pde/PorousMedia/CartTable_btest.cpp
[ 91%] Built target CartTable_btest_build_vera
[ 91%] Building CXX object test/unit/pde/PorousMedia/CMakeFiles/CartTable_btest_OBJECT.dir/CartTable_btest.cpp.o
In file included from /usr/include/boost/config/header_deprecated.hpp:18,
                 from /usr/include/boost/test/output_test_stream.hpp:13,
                 from /jenkins/workspace/SANS_Nightly/builddir/undefined_gnu9/buildnode/reynolds/test/SANS_prefix_btest.h:51,
                 from /jenkins/workspace/SANS_Nightly/builddir/undefined_gnu9/buildnode/reynolds/build/undefined_gnu9/test/cotire/SANS_PREFIX_BTEST_CXX_prefix.cxx:4,
                 from /jenkins/workspace/SANS_Nightly/builddir/undefined_gnu9/buildnode/reynolds/build/undefined_gnu9/test/cotire/SANS_PREFIX_BTEST_CXX_prefix.hxx:4:
/usr/include/boost/test/output_test_stream.hpp:14:1: note: #pragma message: This header is deprecated. Use This header is deprecated. Please use <boost/test/tools/output_test_stream.hpp> instead. instead.
   14 | BOOST_HEADER_DEPRECATED( "This header is deprecated. Please use <boost/test/tools/output_test_stream.hpp> instead." )
      | ^~~~~~~~~~~~~~~~~~~~~~~
[ 91%] Built target CartTable_btest_OBJECT
[ 91%] Linking CXX executable CartTable_btest
[ 91%] Built target CartTable_btest_build
[ 91%] Checking style of test/unit/pde/PorousMedia/DensityModel_btest.cpp
[ 91%] Built target DensityModel_btest_build_vera
[ 91%] Building CXX object test/unit/pde/PorousMedia/CMakeFiles/DensityModel_btest_OBJECT.dir/DensityModel_btest.cpp.o
In file included from /usr/include/boost/config/header_deprecated.hpp:18,
                 from /usr/include/boost/test/output_test_stream.hpp:13,
                 from /jenkins/workspace/SANS_Nightly/builddir/undefined_gnu9/buildnode/reynolds/test/SANS_prefix_btest.h:51,
                 from /jenkins/workspace/SANS_Nightly/builddir/undefined_gnu9/buildnode/reynolds/build/undefined_gnu9/test/cotire/SANS_PREFIX_BTEST_CXX_prefix.cxx:4,
                 from /jenkins/workspace/SANS_Nightly/builddir/undefined_gnu9/buildnode/reynolds/build/undefined_gnu9/test/cotire/SANS_PREFIX_BTEST_CXX_prefix.hxx:4:
/usr/include/boost/test/output_test_stream.hpp:14:1: note: #pragma message: This header is deprecated. Use This header is deprecated. Please use <boost/test/tools/output_test_stream.hpp> instead. instead.
   14 | BOOST_HEADER_DEPRECATED( "This header is deprecated. Please use <boost/test/tools/output_test_stream.hpp> instead." )
      | ^~~~~~~~~~~~~~~~~~~~~~~
[ 91%] Built target DensityModel_btest_OBJECT
[ 91%] Linking CXX executable DensityModel_btest
[ 91%] Built target DensityModel_btest_build
[ 91%] Checking style of test/unit/pde/PorousMedia/OutputTwoPhase_btest.cpp
[ 91%] Built target OutputTwoPhase_btest_build_vera
[ 91%] Building CXX object test/unit/pde/PorousMedia/CMakeFiles/OutputTwoPhase_btest_OBJECT.dir/OutputTwoPhase_btest.cpp.o
[ 91%] Built target OutputTwoPhase_btest_OBJECT
[ 91%] Linking CXX executable OutputTwoPhase_btest
[ 91%] Built target OutputTwoPhase_btest_build
[ 91%] Checking style of test/unit/pde/PorousMedia/PDEBuckleyLeverett1D_btest.cpp
[ 91%] Built target PDEBuckleyLeverett1D_btest_build_vera
[ 91%] Building CXX object test/unit/pde/PorousMedia/CMakeFiles/PDEBuckleyLeverett1D_btest_OBJECT.dir/PDEBuckleyLeverett1D_btest.cpp.o
In file included from /usr/include/boost/config/header_deprecated.hpp:18,
                 from /usr/include/boost/test/output_test_stream.hpp:13,
                 from /jenkins/workspace/SANS_Nightly/builddir/undefined_gnu9/buildnode/reynolds/test/SANS_prefix_btest.h:51,
                 from /jenkins/workspace/SANS_Nightly/builddir/undefined_gnu9/buildnode/reynolds/build/undefined_gnu9/test/cotire/SANS_PREFIX_BTEST_CXX_prefix.cxx:4,
                 from /jenkins/workspace/SANS_Nightly/builddir/undefined_gnu9/buildnode/reynolds/build/undefined_gnu9/test/cotire/SANS_PREFIX_BTEST_CXX_prefix.hxx:4:
/usr/include/boost/test/output_test_stream.hpp:14:1: note: #pragma message: This header is deprecated. Use This header is deprecated. Please use <boost/test/tools/output_test_stream.hpp> instead. instead.
   14 | BOOST_HEADER_DEPRECATED( "This header is deprecated. Please use <boost/test/tools/output_test_stream.hpp> instead." )
      | ^~~~~~~~~~~~~~~~~~~~~~~
[ 91%] Built target PDEBuckleyLeverett1D_btest_OBJECT
[ 91%] Linking CXX executable PDEBuckleyLeverett1D_btest
[ 91%] Built target PDEBuckleyLeverett1D_btest_build
[ 91%] Checking style of test/unit/pde/PorousMedia/PDEBuckleyLeverett_ArtificialViscosity1D_btest.cpp
[ 91%] Built target PDEBuckleyLeverett_ArtificialViscosity1D_btest_build_vera
[ 91%] Building CXX object test/unit/pde/PorousMedia/CMakeFiles/PDEBuckleyLeverett_ArtificialViscosity1D_btest_OBJECT.dir/PDEBuckleyLeverett_ArtificialViscosity1D_btest.cpp.o
In file included from /usr/include/boost/config/header_deprecated.hpp:18,
                 from /usr/include/boost/test/output_test_stream.hpp:13,
                 from /jenkins/workspace/SANS_Nightly/builddir/undefined_gnu9/buildnode/reynolds/test/SANS_prefix_btest.h:51,
                 from /jenkins/workspace/SANS_Nightly/builddir/undefined_gnu9/buildnode/reynolds/build/undefined_gnu9/test/cotire/SANS_PREFIX_BTEST_CXX_prefix.cxx:4,
                 from /jenkins/workspace/SANS_Nightly/builddir/undefined_gnu9/buildnode/reynolds/build/undefined_gnu9/test/cotire/SANS_PREFIX_BTEST_CXX_prefix.hxx:4:
/usr/include/boost/test/output_test_stream.hpp:14:1: note: #pragma message: This header is deprecated. Use This header is deprecated. Please use <boost/test/tools/output_test_stream.hpp> instead. instead.
   14 | BOOST_HEADER_DEPRECATED( "This header is deprecated. Please use <boost/test/tools/output_test_stream.hpp> instead." )
      | ^~~~~~~~~~~~~~~~~~~~~~~
[ 91%] Built target PDEBuckleyLeverett_ArtificialViscosity1D_btest_OBJECT
[ 91%] Linking CXX executable PDEBuckleyLeverett_ArtificialViscosity1D_btest
[ 91%] Built target PDEBuckleyLeverett_ArtificialViscosity1D_btest_build
[ 91%] Checking style of test/unit/pde/PorousMedia/PDETwoPhase1D_btest.cpp
[ 91%] Built target PDETwoPhase1D_btest_build_vera
[ 91%] Building CXX object test/unit/pde/PorousMedia/CMakeFiles/PDETwoPhase1D_btest_OBJECT.dir/PDETwoPhase1D_btest.cpp.o
In file included from /usr/include/boost/config/header_deprecated.hpp:18,
                 from /usr/include/boost/test/output_test_stream.hpp:13,
                 from /jenkins/workspace/SANS_Nightly/builddir/undefined_gnu9/buildnode/reynolds/test/SANS_prefix_btest.h:51,
                 from /jenkins/workspace/SANS_Nightly/builddir/undefined_gnu9/buildnode/reynolds/build/undefined_gnu9/test/cotire/SANS_PREFIX_BTEST_CXX_prefix.cxx:4,
                 from /jenkins/workspace/SANS_Nightly/builddir/undefined_gnu9/buildnode/reynolds/build/undefined_gnu9/test/cotire/SANS_PREFIX_BTEST_CXX_prefix.hxx:4:
/usr/include/boost/test/output_test_stream.hpp:14:1: note: #pragma message: This header is deprecated. Use This header is deprecated. Please use <boost/test/tools/output_test_stream.hpp> instead. instead.
   14 | BOOST_HEADER_DEPRECATED( "This header is deprecated. Please use <boost/test/tools/output_test_stream.hpp> instead." )
      | ^~~~~~~~~~~~~~~~~~~~~~~
[ 91%] Built target PDETwoPhase1D_btest_OBJECT
[ 91%] Linking CXX executable PDETwoPhase1D_btest
[ 91%] Built target PDETwoPhase1D_btest_build
[ 91%] Checking style of test/unit/pde/PorousMedia/PDETwoPhase2D_btest.cpp
[ 91%] Built target PDETwoPhase2D_btest_build_vera
[ 91%] Building CXX object test/unit/pde/PorousMedia/CMakeFiles/PDETwoPhase2D_btest_OBJECT.dir/PDETwoPhase2D_btest.cpp.o
In file included from /usr/include/boost/config/header_deprecated.hpp:18,
                 from /usr/include/boost/test/output_test_stream.hpp:13,
                 from /jenkins/workspace/SANS_Nightly/builddir/undefined_gnu9/buildnode/reynolds/test/SANS_prefix_btest.h:51,
                 from /jenkins/workspace/SANS_Nightly/builddir/undefined_gnu9/buildnode/reynolds/build/undefined_gnu9/test/cotire/SANS_PREFIX_BTEST_CXX_prefix.cxx:4,
                 from /jenkins/workspace/SANS_Nightly/builddir/undefined_gnu9/buildnode/reynolds/build/undefined_gnu9/test/cotire/SANS_PREFIX_BTEST_CXX_prefix.hxx:4:
/usr/include/boost/test/output_test_stream.hpp:14:1: note: #pragma message: This header is deprecated. Use This header is deprecated. Please use <boost/test/tools/output_test_stream.hpp> instead. instead.
   14 | BOOST_HEADER_DEPRECATED( "This header is deprecated. Please use <boost/test/tools/output_test_stream.hpp> instead." )
      | ^~~~~~~~~~~~~~~~~~~~~~~
[ 91%] Built target PDETwoPhase2D_btest_OBJECT
[ 91%] Linking CXX executable PDETwoPhase2D_btest
[ 91%] Built target PDETwoPhase2D_btest_build
[ 91%] Checking style of test/unit/pde/PorousMedia/PDETwoPhaseLinearized1D_btest.cpp
[ 91%] Built target PDETwoPhaseLinearized1D_btest_build_vera
[ 91%] Building CXX object test/unit/pde/PorousMedia/CMakeFiles/PDETwoPhaseLinearized1D_btest_OBJECT.dir/PDETwoPhaseLinearized1D_btest.cpp.o
In file included from /usr/include/boost/config/header_deprecated.hpp:18,
                 from /usr/include/boost/test/output_test_stream.hpp:13,
                 from /jenkins/workspace/SANS_Nightly/builddir/undefined_gnu9/buildnode/reynolds/test/SANS_prefix_btest.h:51,
                 from /jenkins/workspace/SANS_Nightly/builddir/undefined_gnu9/buildnode/reynolds/build/undefined_gnu9/test/cotire/SANS_PREFIX_BTEST_CXX_prefix.cxx:4,
                 from /jenkins/workspace/SANS_Nightly/builddir/undefined_gnu9/buildnode/reynolds/build/undefined_gnu9/test/cotire/SANS_PREFIX_BTEST_CXX_prefix.hxx:4:
/usr/include/boost/test/output_test_stream.hpp:14:1: note: #pragma message: This header is deprecated. Use This header is deprecated. Please use <boost/test/tools/output_test_stream.hpp> instead. instead.
   14 | BOOST_HEADER_DEPRECATED( "This header is deprecated. Please use <boost/test/tools/output_test_stream.hpp> instead." )
      | ^~~~~~~~~~~~~~~~~~~~~~~
[ 91%] Built target PDETwoPhaseLinearized1D_btest_OBJECT
[ 91%] Linking CXX executable PDETwoPhaseLinearized1D_btest
[ 91%] Built target PDETwoPhaseLinearized1D_btest_build
[ 91%] Checking style of test/unit/pde/PorousMedia/PDETwoPhase_ArtificialViscosity1D_btest.cpp
[ 91%] Built target PDETwoPhase_ArtificialViscosity1D_btest_build_vera
[ 91%] Building CXX object test/unit/pde/PorousMedia/CMakeFiles/PDETwoPhase_ArtificialViscosity1D_btest_OBJECT.dir/PDETwoPhase_ArtificialViscosity1D_btest.cpp.o
In file included from /usr/include/boost/config/header_deprecated.hpp:18,
                 from /usr/include/boost/test/output_test_stream.hpp:13,
                 from /jenkins/workspace/SANS_Nightly/builddir/undefined_gnu9/buildnode/reynolds/test/SANS_prefix_btest.h:51,
                 from /jenkins/workspace/SANS_Nightly/builddir/undefined_gnu9/buildnode/reynolds/build/undefined_gnu9/test/cotire/SANS_PREFIX_BTEST_CXX_prefix.cxx:4,
                 from /jenkins/workspace/SANS_Nightly/builddir/undefined_gnu9/buildnode/reynolds/build/undefined_gnu9/test/cotire/SANS_PREFIX_BTEST_CXX_prefix.hxx:4:
/usr/include/boost/test/output_test_stream.hpp:14:1: note: #pragma message: This header is deprecated. Use This header is deprecated. Please use <boost/test/tools/output_test_stream.hpp> instead. instead.
   14 | BOOST_HEADER_DEPRECATED( "This header is deprecated. Please use <boost/test/tools/output_test_stream.hpp> instead." )
      | ^~~~~~~~~~~~~~~~~~~~~~~
[ 91%] Built target PDETwoPhase_ArtificialViscosity1D_btest_OBJECT
[ 91%] Linking CXX executable PDETwoPhase_ArtificialViscosity1D_btest
[ 91%] Built target PDETwoPhase_ArtificialViscosity1D_btest_build
[ 91%] Checking style of test/unit/pde/PorousMedia/PDETwoPhase_ArtificialViscosity2D_btest.cpp
[ 91%] Built target PDETwoPhase_ArtificialViscosity2D_btest_build_vera
[ 91%] Building CXX object test/unit/pde/PorousMedia/CMakeFiles/PDETwoPhase_ArtificialViscosity2D_btest_OBJECT.dir/PDETwoPhase_ArtificialViscosity2D_btest.cpp.o
In file included from /usr/include/boost/config/header_deprecated.hpp:18,
                 from /usr/include/boost/test/output_test_stream.hpp:13,
                 from /jenkins/workspace/SANS_Nightly/builddir/undefined_gnu9/buildnode/reynolds/test/SANS_prefix_btest.h:51,
                 from /jenkins/workspace/SANS_Nightly/builddir/undefined_gnu9/buildnode/reynolds/build/undefined_gnu9/test/cotire/SANS_PREFIX_BTEST_CXX_prefix.cxx:4,
                 from /jenkins/workspace/SANS_Nightly/builddir/undefined_gnu9/buildnode/reynolds/build/undefined_gnu9/test/cotire/SANS_PREFIX_BTEST_CXX_prefix.hxx:4:
/usr/include/boost/test/output_test_stream.hpp:14:1: note: #pragma message: This header is deprecated. Use This header is deprecated. Please use <boost/test/tools/output_test_stream.hpp> instead. instead.
   14 | BOOST_HEADER_DEPRECATED( "This header is deprecated. Please use <boost/test/tools/output_test_stream.hpp> instead." )
      | ^~~~~~~~~~~~~~~~~~~~~~~
In file included from /jenkins/workspace/SANS_Nightly/builddir/undefined_gnu9/buildnode/reynolds/test/unit/pde/PorousMedia/PDETwoPhase_ArtificialViscosity2D_btest.cpp:22:
/jenkins/workspace/SANS_Nightly/builddir/undefined_gnu9/buildnode/reynolds/src/pde/PorousMedia/PDETwoPhase_ArtificialViscosity2D.h:32:46: note: #pragma message: #undef USE_GRID_LAPLACIAN
   32 | #pragma message( "#undef USE_GRID_LAPLACIAN" )
      |                                              ^
[ 91%] Built target PDETwoPhase_ArtificialViscosity2D_btest_OBJECT
[ 91%] Linking CXX executable PDETwoPhase_ArtificialViscosity2D_btest
[ 91%] Built target PDETwoPhase_ArtificialViscosity2D_btest_build
[ 91%] Checking style of test/unit/pde/PorousMedia/PermeabilityModel2D_btest.cpp
[ 91%] Built target PermeabilityModel2D_btest_build_vera
[ 91%] Building CXX object test/unit/pde/PorousMedia/CMakeFiles/PermeabilityModel2D_btest_OBJECT.dir/PermeabilityModel2D_btest.cpp.o
In file included from /usr/include/boost/config/header_deprecated.hpp:18,
                 from /usr/include/boost/test/output_test_stream.hpp:13,
                 from /jenkins/workspace/SANS_Nightly/builddir/undefined_gnu9/buildnode/reynolds/test/SANS_prefix_btest.h:51,
                 from /jenkins/workspace/SANS_Nightly/builddir/undefined_gnu9/buildnode/reynolds/build/undefined_gnu9/test/cotire/SANS_PREFIX_BTEST_CXX_prefix.cxx:4,
                 from /jenkins/workspace/SANS_Nightly/builddir/undefined_gnu9/buildnode/reynolds/build/undefined_gnu9/test/cotire/SANS_PREFIX_BTEST_CXX_prefix.hxx:4:
/usr/include/boost/test/output_test_stream.hpp:14:1: note: #pragma message: This header is deprecated. Use This header is deprecated. Please use <boost/test/tools/output_test_stream.hpp> instead. instead.
   14 | BOOST_HEADER_DEPRECATED( "This header is deprecated. Please use <boost/test/tools/output_test_stream.hpp> instead." )
      | ^~~~~~~~~~~~~~~~~~~~~~~
[ 91%] Built target PermeabilityModel2D_btest_OBJECT
[ 91%] Linking CXX executable PermeabilityModel2D_btest
[ 91%] Built target PermeabilityModel2D_btest_build
[ 91%] Checking style of test/unit/pde/PorousMedia/PorosityModel_btest.cpp
[ 91%] Built target PorosityModel_btest_build_vera
[ 91%] Building CXX object test/unit/pde/PorousMedia/CMakeFiles/PorosityModel_btest_OBJECT.dir/PorosityModel_btest.cpp.o
In file included from /usr/include/boost/config/header_deprecated.hpp:18,
                 from /usr/include/boost/test/output_test_stream.hpp:13,
                 from /jenkins/workspace/SANS_Nightly/builddir/undefined_gnu9/buildnode/reynolds/test/SANS_prefix_btest.h:51,
                 from /jenkins/workspace/SANS_Nightly/builddir/undefined_gnu9/buildnode/reynolds/build/undefined_gnu9/test/cotire/SANS_PREFIX_BTEST_CXX_prefix.cxx:4,
                 from /jenkins/workspace/SANS_Nightly/builddir/undefined_gnu9/buildnode/reynolds/build/undefined_gnu9/test/cotire/SANS_PREFIX_BTEST_CXX_prefix.hxx:4:
/usr/include/boost/test/output_test_stream.hpp:14:1: note: #pragma message: This header is deprecated. Use This header is deprecated. Please use <boost/test/tools/output_test_stream.hpp> instead. instead.
   14 | BOOST_HEADER_DEPRECATED( "This header is deprecated. Please use <boost/test/tools/output_test_stream.hpp> instead." )
      | ^~~~~~~~~~~~~~~~~~~~~~~
[ 91%] Built target PorosityModel_btest_OBJECT
[ 91%] Linking CXX executable PorosityModel_btest
[ 91%] Built target PorosityModel_btest_build
[ 91%] Checking style of test/unit/pde/PorousMedia/Q1DPrimitive_Surrogate_pnSw_btest.cpp
[ 91%] Built target Q1DPrimitive_Surrogate_pnSw_btest_build_vera
[ 91%] Building CXX object test/unit/pde/PorousMedia/CMakeFiles/Q1DPrimitive_Surrogate_pnSw_btest_OBJECT.dir/Q1DPrimitive_Surrogate_pnSw_btest.cpp.o
[ 91%] Built target Q1DPrimitive_Surrogate_pnSw_btest_OBJECT
[ 91%] Linking CXX executable Q1DPrimitive_Surrogate_pnSw_btest
[ 91%] Built target Q1DPrimitive_Surrogate_pnSw_btest_build
[ 91%] Checking style of test/unit/pde/PorousMedia/Q1DPrimitive_Sw_btest.cpp
[ 91%] Built target Q1DPrimitive_Sw_btest_build_vera
[ 91%] Building CXX object test/unit/pde/PorousMedia/CMakeFiles/Q1DPrimitive_Sw_btest_OBJECT.dir/Q1DPrimitive_Sw_btest.cpp.o
[ 91%] Built target Q1DPrimitive_Sw_btest_OBJECT
[ 91%] Linking CXX executable Q1DPrimitive_Sw_btest
[ 91%] Built target Q1DPrimitive_Sw_btest_build
[ 91%] Checking style of test/unit/pde/PorousMedia/Q1DPrimitive_pnSw_btest.cpp
[ 91%] Built target Q1DPrimitive_pnSw_btest_build_vera
[ 91%] Building CXX object test/unit/pde/PorousMedia/CMakeFiles/Q1DPrimitive_pnSw_btest_OBJECT.dir/Q1DPrimitive_pnSw_btest.cpp.o
[ 91%] Built target Q1DPrimitive_pnSw_btest_OBJECT
[ 91%] Linking CXX executable Q1DPrimitive_pnSw_btest
[ 91%] Built target Q1DPrimitive_pnSw_btest_build
[ 91%] Checking style of test/unit/pde/PorousMedia/Q2DPrimitive_LogpnSw_btest.cpp
[ 91%] Built target Q2DPrimitive_LogpnSw_btest_build_vera
[ 91%] Building CXX object test/unit/pde/PorousMedia/CMakeFiles/Q2DPrimitive_LogpnSw_btest_OBJECT.dir/Q2DPrimitive_LogpnSw_btest.cpp.o
[ 91%] Built target Q2DPrimitive_LogpnSw_btest_OBJECT
[ 91%] Linking CXX executable Q2DPrimitive_LogpnSw_btest
[ 91%] Built target Q2DPrimitive_LogpnSw_btest_build
[ 91%] Checking style of test/unit/pde/PorousMedia/Q2DPrimitive_Surrogate_pnSw_btest.cpp
[ 91%] Built target Q2DPrimitive_Surrogate_pnSw_btest_build_vera
[ 91%] Building CXX object test/unit/pde/PorousMedia/CMakeFiles/Q2DPrimitive_Surrogate_pnSw_btest_OBJECT.dir/Q2DPrimitive_Surrogate_pnSw_btest.cpp.o
[ 91%] Built target Q2DPrimitive_Surrogate_pnSw_btest_OBJECT
[ 91%] Linking CXX executable Q2DPrimitive_Surrogate_pnSw_btest
[ 91%] Built target Q2DPrimitive_Surrogate_pnSw_btest_build
[ 91%] Checking style of test/unit/pde/PorousMedia/Q2DPrimitive_pnSw_btest.cpp
[ 91%] Built target Q2DPrimitive_pnSw_btest_build_vera
[ 91%] Building CXX object test/unit/pde/PorousMedia/CMakeFiles/Q2DPrimitive_pnSw_btest_OBJECT.dir/Q2DPrimitive_pnSw_btest.cpp.o
[ 91%] Built target Q2DPrimitive_pnSw_btest_OBJECT
[ 91%] Linking CXX executable Q2DPrimitive_pnSw_btest
[ 91%] Built target Q2DPrimitive_pnSw_btest_build
[ 91%] Checking style of test/unit/pde/PorousMedia/RelativePermeabilityModel_SurrealS1_btest.cpp
[ 91%] Built target RelativePermeabilityModel_SurrealS1_btest_build_vera
[ 91%] Building CXX object test/unit/pde/PorousMedia/CMakeFiles/RelativePermeabilityModel_SurrealS1_btest_OBJECT.dir/RelativePermeabilityModel_SurrealS1_btest.cpp.o
[ 91%] Built target RelativePermeabilityModel_SurrealS1_btest_OBJECT
[ 91%] Linking CXX executable RelativePermeabilityModel_SurrealS1_btest
[ 91%] Built target RelativePermeabilityModel_SurrealS1_btest_build
[ 91%] Checking style of test/unit/pde/PorousMedia/RelativePermeabilityModel_btest.cpp
[ 91%] Built target RelativePermeabilityModel_btest_build_vera
[ 91%] Building CXX object test/unit/pde/PorousMedia/CMakeFiles/RelativePermeabilityModel_btest_OBJECT.dir/RelativePermeabilityModel_btest.cpp.o
In file included from /usr/include/boost/config/header_deprecated.hpp:18,
                 from /usr/include/boost/test/output_test_stream.hpp:13,
                 from /jenkins/workspace/SANS_Nightly/builddir/undefined_gnu9/buildnode/reynolds/test/SANS_prefix_btest.h:51,
                 from /jenkins/workspace/SANS_Nightly/builddir/undefined_gnu9/buildnode/reynolds/build/undefined_gnu9/test/cotire/SANS_PREFIX_BTEST_CXX_prefix.cxx:4,
                 from /jenkins/workspace/SANS_Nightly/builddir/undefined_gnu9/buildnode/reynolds/build/undefined_gnu9/test/cotire/SANS_PREFIX_BTEST_CXX_prefix.hxx:4:
/usr/include/boost/test/output_test_stream.hpp:14:1: note: #pragma message: This header is deprecated. Use This header is deprecated. Please use <boost/test/tools/output_test_stream.hpp> instead. instead.
   14 | BOOST_HEADER_DEPRECATED( "This header is deprecated. Please use <boost/test/tools/output_test_stream.hpp> instead." )
      | ^~~~~~~~~~~~~~~~~~~~~~~
[ 91%] Built target RelativePermeabilityModel_btest_OBJECT
[ 91%] Linking CXX executable RelativePermeabilityModel_btest
[ 91%] Built target RelativePermeabilityModel_btest_build
[ 91%] Checking style of test/unit/pde/PorousMedia/Sensor_BuckleyLeverett1D_btest.cpp
[ 91%] Built target Sensor_BuckleyLeverett1D_btest_build_vera
[ 91%] Building CXX object test/unit/pde/PorousMedia/CMakeFiles/Sensor_BuckleyLeverett1D_btest_OBJECT.dir/Sensor_BuckleyLeverett1D_btest.cpp.o
In file included from /usr/include/boost/config/header_deprecated.hpp:18,
                 from /usr/include/boost/test/output_test_stream.hpp:13,
                 from /jenkins/workspace/SANS_Nightly/builddir/undefined_gnu9/buildnode/reynolds/test/SANS_prefix_btest.h:51,
                 from /jenkins/workspace/SANS_Nightly/builddir/undefined_gnu9/buildnode/reynolds/build/undefined_gnu9/test/cotire/SANS_PREFIX_BTEST_CXX_prefix.cxx:4,
                 from /jenkins/workspace/SANS_Nightly/builddir/undefined_gnu9/buildnode/reynolds/build/undefined_gnu9/test/cotire/SANS_PREFIX_BTEST_CXX_prefix.hxx:4:
/usr/include/boost/test/output_test_stream.hpp:14:1: note: #pragma message: This header is deprecated. Use This header is deprecated. Please use <boost/test/tools/output_test_stream.hpp> instead. instead.
   14 | BOOST_HEADER_DEPRECATED( "This header is deprecated. Please use <boost/test/tools/output_test_stream.hpp> instead." )
      | ^~~~~~~~~~~~~~~~~~~~~~~
[ 91%] Built target Sensor_BuckleyLeverett1D_btest_OBJECT
[ 91%] Linking CXX executable Sensor_BuckleyLeverett1D_btest
[ 91%] Built target Sensor_BuckleyLeverett1D_btest_build
[ 91%] Checking style of test/unit/pde/PorousMedia/Sensor_TwoPhase_btest.cpp
[ 91%] Built target Sensor_TwoPhase_btest_build_vera
[ 91%] Building CXX object test/unit/pde/PorousMedia/CMakeFiles/Sensor_TwoPhase_btest_OBJECT.dir/Sensor_TwoPhase_btest.cpp.o
In file included from /usr/include/boost/config/header_deprecated.hpp:18,
                 from /usr/include/boost/test/output_test_stream.hpp:13,
                 from /jenkins/workspace/SANS_Nightly/builddir/undefined_gnu9/buildnode/reynolds/test/SANS_prefix_btest.h:51,
                 from /jenkins/workspace/SANS_Nightly/builddir/undefined_gnu9/buildnode/reynolds/build/undefined_gnu9/test/cotire/SANS_PREFIX_BTEST_CXX_prefix.cxx:4,
                 from /jenkins/workspace/SANS_Nightly/builddir/undefined_gnu9/buildnode/reynolds/build/undefined_gnu9/test/cotire/SANS_PREFIX_BTEST_CXX_prefix.hxx:4:
/usr/include/boost/test/output_test_stream.hpp:14:1: note: #pragma message: This header is deprecated. Use This header is deprecated. Please use <boost/test/tools/output_test_stream.hpp> instead. instead.
   14 | BOOST_HEADER_DEPRECATED( "This header is deprecated. Please use <boost/test/tools/output_test_stream.hpp> instead." )
      | ^~~~~~~~~~~~~~~~~~~~~~~
[ 91%] Built target Sensor_TwoPhase_btest_OBJECT
[ 91%] Linking CXX executable Sensor_TwoPhase_btest
[ 91%] Built target Sensor_TwoPhase_btest_build
[ 91%] Checking style of test/unit/pde/PorousMedia/SolutionFunction_BuckleyLeverett1D_btest.cpp
[ 91%] Built target SolutionFunction_BuckleyLeverett1D_btest_build_vera
[ 91%] Building CXX object test/unit/pde/PorousMedia/CMakeFiles/SolutionFunction_BuckleyLeverett1D_btest_OBJECT.dir/SolutionFunction_BuckleyLeverett1D_btest.cpp.o
[ 91%] Built target SolutionFunction_BuckleyLeverett1D_btest_OBJECT
[ 91%] Linking CXX executable SolutionFunction_BuckleyLeverett1D_btest
[ 91%] Built target SolutionFunction_BuckleyLeverett1D_btest_build
[ 91%] Checking style of test/unit/pde/PorousMedia/SolutionFunction_TwoPhase2D_btest.cpp
[ 91%] Built target SolutionFunction_TwoPhase2D_btest_build_vera
[ 91%] Building CXX object test/unit/pde/PorousMedia/CMakeFiles/SolutionFunction_TwoPhase2D_btest_OBJECT.dir/SolutionFunction_TwoPhase2D_btest.cpp.o
[ 91%] Built target SolutionFunction_TwoPhase2D_btest_OBJECT
[ 91%] Linking CXX executable SolutionFunction_TwoPhase2D_btest
[ 91%] Built target SolutionFunction_TwoPhase2D_btest_build
[ 91%] Checking style of test/unit/pde/PorousMedia/SourceTwoPhase1D_btest.cpp
[ 91%] Built target SourceTwoPhase1D_btest_build_vera
[ 91%] Building CXX object test/unit/pde/PorousMedia/CMakeFiles/SourceTwoPhase1D_btest_OBJECT.dir/SourceTwoPhase1D_btest.cpp.o
[ 91%] Built target SourceTwoPhase1D_btest_OBJECT
[ 91%] Linking CXX executable SourceTwoPhase1D_btest
[ 91%] Built target SourceTwoPhase1D_btest_build
[ 91%] Checking style of test/unit/pde/PorousMedia/SourceTwoPhase2D_btest.cpp
[ 91%] Built target SourceTwoPhase2D_btest_build_vera
[ 91%] Building CXX object test/unit/pde/PorousMedia/CMakeFiles/SourceTwoPhase2D_btest_OBJECT.dir/SourceTwoPhase2D_btest.cpp.o
[ 91%] Built target SourceTwoPhase2D_btest_OBJECT
[ 91%] Linking CXX executable SourceTwoPhase2D_btest
[ 91%] Built target SourceTwoPhase2D_btest_build
[ 91%] Checking style of test/unit/pde/PorousMedia/ViscosityModel_btest.cpp
[ 91%] Built target ViscosityModel_btest_build_vera
[ 91%] Building CXX object test/unit/pde/PorousMedia/CMakeFiles/ViscosityModel_btest_OBJECT.dir/ViscosityModel_btest.cpp.o
In file included from /usr/include/boost/config/header_deprecated.hpp:18,
                 from /usr/include/boost/test/output_test_stream.hpp:13,
                 from /jenkins/workspace/SANS_Nightly/builddir/undefined_gnu9/buildnode/reynolds/test/SANS_prefix_btest.h:51,
                 from /jenkins/workspace/SANS_Nightly/builddir/undefined_gnu9/buildnode/reynolds/build/undefined_gnu9/test/cotire/SANS_PREFIX_BTEST_CXX_prefix.cxx:4,
                 from /jenkins/workspace/SANS_Nightly/builddir/undefined_gnu9/buildnode/reynolds/build/undefined_gnu9/test/cotire/SANS_PREFIX_BTEST_CXX_prefix.hxx:4:
/usr/include/boost/test/output_test_stream.hpp:14:1: note: #pragma message: This header is deprecated. Use This header is deprecated. Please use <boost/test/tools/output_test_stream.hpp> instead. instead.
   14 | BOOST_HEADER_DEPRECATED( "This header is deprecated. Please use <boost/test/tools/output_test_stream.hpp> instead." )
      | ^~~~~~~~~~~~~~~~~~~~~~~
[ 91%] Built target ViscosityModel_btest_OBJECT
[ 91%] Linking CXX executable ViscosityModel_btest
[ 91%] Built target ViscosityModel_btest_build
[ 91%] Checking style of test/unit/pde/sansBOOM/AtmosphereStandard_btest.cpp
[ 91%] Built target AtmosphereStandard_btest_build_vera
[ 91%] Checking style of src/pde/sansBOOM/AtmosphereStandard.h
[ 91%] Checking style of src/pde/sansBOOM/BCsansBOOM.cpp
[ 91%] Checking style of src/pde/sansBOOM/BCsansBOOM.h
[ 91%] Checking style of src/pde/sansBOOM/ICsansBOOM.h
[ 91%] Checking style of src/pde/sansBOOM/OutputsansBOOM.h
[ 91%] Checking style of src/pde/sansBOOM/PDEsansBOOM.h
[ 91%] Checking style of src/pde/sansBOOM/Traits_sansBOOM.h
[ 91%] Checking style of src/pde/sansBOOM/ICsansBOOM.cpp
[ 91%] Built target sansBOOMLib_vera
[ 91%] Generating CXX unity source src/pde/sansBOOM/cotire/sansBOOMLib_CXX_unity.cxx
[ 91%] Generating CXX prefix source src/pde/sansBOOM/cotire/sansBOOMLib_CXX_prefix.cxx
[ 91%] Generating CXX prefix header src/pde/sansBOOM/cotire/sansBOOMLib_CXX_prefix.hxx
[ 91%] Building CXX precompiled header src/pde/sansBOOM/cotire/sansBOOMLib_CXX_prefix.hxx.gch
Scanning dependencies of target sansBOOMLib
[ 91%] Building CXX object src/pde/sansBOOM/CMakeFiles/sansBOOMLib.dir/BCsansBOOM.cpp.o
[ 91%] Building CXX object src/pde/sansBOOM/CMakeFiles/sansBOOMLib.dir/ICsansBOOM.cpp.o
[ 91%] Linking CXX static library libsansBOOMLib.a
[ 91%] Built target sansBOOMLib
[ 91%] Building CXX object test/unit/pde/sansBOOM/CMakeFiles/AtmosphereStandard_btest_OBJECT.dir/AtmosphereStandard_btest.cpp.o
In file included from /usr/include/boost/config/header_deprecated.hpp:18,
                 from /usr/include/boost/test/output_test_stream.hpp:13,
                 from /jenkins/workspace/SANS_Nightly/builddir/undefined_gnu9/buildnode/reynolds/test/SANS_prefix_btest.h:51,
                 from /jenkins/workspace/SANS_Nightly/builddir/undefined_gnu9/buildnode/reynolds/build/undefined_gnu9/test/cotire/SANS_PREFIX_BTEST_CXX_prefix.cxx:4,
                 from /jenkins/workspace/SANS_Nightly/builddir/undefined_gnu9/buildnode/reynolds/build/undefined_gnu9/test/cotire/SANS_PREFIX_BTEST_CXX_prefix.hxx:4:
/usr/include/boost/test/output_test_stream.hpp:14:1: note: #pragma message: This header is deprecated. Use This header is deprecated. Please use <boost/test/tools/output_test_stream.hpp> instead. instead.
   14 | BOOST_HEADER_DEPRECATED( "This header is deprecated. Please use <boost/test/tools/output_test_stream.hpp> instead." )
      | ^~~~~~~~~~~~~~~~~~~~~~~
[ 91%] Built target AtmosphereStandard_btest_OBJECT
[ 91%] Linking CXX executable AtmosphereStandard_btest
[ 91%] Built target AtmosphereStandard_btest_build
[ 91%] Checking style of test/unit/pde/sansBOOM/BCsansBOOM_btest.cpp
[ 91%] Built target BCsansBOOM_btest_build_vera
[ 91%] Building CXX object test/unit/pde/sansBOOM/CMakeFiles/BCsansBOOM_btest_OBJECT.dir/BCsansBOOM_btest.cpp.o
In file included from /usr/include/boost/config/header_deprecated.hpp:18,
                 from /usr/include/boost/test/output_test_stream.hpp:13,
                 from /jenkins/workspace/SANS_Nightly/builddir/undefined_gnu9/buildnode/reynolds/test/SANS_prefix_btest.h:51,
                 from /jenkins/workspace/SANS_Nightly/builddir/undefined_gnu9/buildnode/reynolds/build/undefined_gnu9/test/cotire/SANS_PREFIX_BTEST_CXX_prefix.cxx:4,
                 from /jenkins/workspace/SANS_Nightly/builddir/undefined_gnu9/buildnode/reynolds/build/undefined_gnu9/test/cotire/SANS_PREFIX_BTEST_CXX_prefix.hxx:4:
/usr/include/boost/test/output_test_stream.hpp:14:1: note: #pragma message: This header is deprecated. Use This header is deprecated. Please use <boost/test/tools/output_test_stream.hpp> instead. instead.
   14 | BOOST_HEADER_DEPRECATED( "This header is deprecated. Please use <boost/test/tools/output_test_stream.hpp> instead." )
      | ^~~~~~~~~~~~~~~~~~~~~~~
[ 91%] Built target BCsansBOOM_btest_OBJECT
[ 91%] Linking CXX executable BCsansBOOM_btest
[ 91%] Built target BCsansBOOM_btest_build
[ 91%] Checking style of test/unit/pde/sansBOOM/ICsansBOOM_btest.cpp
[ 91%] Built target ICsansBOOM_btest_build_vera
[ 91%] Building CXX object test/unit/pde/sansBOOM/CMakeFiles/ICsansBOOM_btest_OBJECT.dir/ICsansBOOM_btest.cpp.o
In file included from /usr/include/boost/config/header_deprecated.hpp:18,
                 from /usr/include/boost/test/output_test_stream.hpp:13,
                 from /jenkins/workspace/SANS_Nightly/builddir/undefined_gnu9/buildnode/reynolds/test/SANS_prefix_btest.h:51,
                 from /jenkins/workspace/SANS_Nightly/builddir/undefined_gnu9/buildnode/reynolds/build/undefined_gnu9/test/cotire/SANS_PREFIX_BTEST_CXX_prefix.cxx:4,
                 from /jenkins/workspace/SANS_Nightly/builddir/undefined_gnu9/buildnode/reynolds/build/undefined_gnu9/test/cotire/SANS_PREFIX_BTEST_CXX_prefix.hxx:4:
/usr/include/boost/test/output_test_stream.hpp:14:1: note: #pragma message: This header is deprecated. Use This header is deprecated. Please use <boost/test/tools/output_test_stream.hpp> instead. instead.
   14 | BOOST_HEADER_DEPRECATED( "This header is deprecated. Please use <boost/test/tools/output_test_stream.hpp> instead." )
      | ^~~~~~~~~~~~~~~~~~~~~~~
[ 91%] Built target ICsansBOOM_btest_OBJECT
[ 91%] Linking CXX executable ICsansBOOM_btest
[ 91%] Built target ICsansBOOM_btest_build
[ 91%] Checking style of test/unit/pde/sansBOOM/OutputsansBOOM_btest.cpp
[ 91%] Built target OutputsansBOOM_btest_build_vera
[ 91%] Building CXX object test/unit/pde/sansBOOM/CMakeFiles/OutputsansBOOM_btest_OBJECT.dir/OutputsansBOOM_btest.cpp.o
In file included from /usr/include/boost/config/header_deprecated.hpp:18,
                 from /usr/include/boost/test/output_test_stream.hpp:13,
                 from /jenkins/workspace/SANS_Nightly/builddir/undefined_gnu9/buildnode/reynolds/test/SANS_prefix_btest.h:51,
                 from /jenkins/workspace/SANS_Nightly/builddir/undefined_gnu9/buildnode/reynolds/build/undefined_gnu9/test/cotire/SANS_PREFIX_BTEST_CXX_prefix.cxx:4,
                 from /jenkins/workspace/SANS_Nightly/builddir/undefined_gnu9/buildnode/reynolds/build/undefined_gnu9/test/cotire/SANS_PREFIX_BTEST_CXX_prefix.hxx:4:
/usr/include/boost/test/output_test_stream.hpp:14:1: note: #pragma message: This header is deprecated. Use This header is deprecated. Please use <boost/test/tools/output_test_stream.hpp> instead. instead.
   14 | BOOST_HEADER_DEPRECATED( "This header is deprecated. Please use <boost/test/tools/output_test_stream.hpp> instead." )
      | ^~~~~~~~~~~~~~~~~~~~~~~
[ 91%] Built target OutputsansBOOM_btest_OBJECT
[ 91%] Linking CXX executable OutputsansBOOM_btest
[ 91%] Built target OutputsansBOOM_btest_build
[ 91%] Checking style of test/unit/pde/sansBOOM/PDEsansBOOM_btest.cpp
[ 91%] Built target PDEsansBOOM_btest_build_vera
[ 91%] Building CXX object test/unit/pde/sansBOOM/CMakeFiles/PDEsansBOOM_btest_OBJECT.dir/PDEsansBOOM_btest.cpp.o
In file included from /usr/include/boost/config/header_deprecated.hpp:18,
                 from /usr/include/boost/test/output_test_stream.hpp:13,
                 from /jenkins/workspace/SANS_Nightly/builddir/undefined_gnu9/buildnode/reynolds/test/SANS_prefix_btest.h:51,
                 from /jenkins/workspace/SANS_Nightly/builddir/undefined_gnu9/buildnode/reynolds/build/undefined_gnu9/test/cotire/SANS_PREFIX_BTEST_CXX_prefix.cxx:4,
                 from /jenkins/workspace/SANS_Nightly/builddir/undefined_gnu9/buildnode/reynolds/build/undefined_gnu9/test/cotire/SANS_PREFIX_BTEST_CXX_prefix.hxx:4:
/usr/include/boost/test/output_test_stream.hpp:14:1: note: #pragma message: This header is deprecated. Use This header is deprecated. Please use <boost/test/tools/output_test_stream.hpp> instead. instead.
   14 | BOOST_HEADER_DEPRECATED( "This header is deprecated. Please use <boost/test/tools/output_test_stream.hpp> instead." )
      | ^~~~~~~~~~~~~~~~~~~~~~~
[ 91%] Built target PDEsansBOOM_btest_OBJECT
[ 91%] Linking CXX executable PDEsansBOOM_btest
[ 91%] Built target PDEsansBOOM_btest_build
[ 91%] Checking style of test/unit/pde/Sensor/BCSensorParameter1D_btest.cpp
[ 91%] Built target BCSensorParameter1D_btest_build_vera
[ 91%] Building CXX object test/unit/pde/Sensor/CMakeFiles/BCSensorParameter1D_btest_OBJECT.dir/BCSensorParameter1D_btest.cpp.o
In file included from /jenkins/workspace/SANS_Nightly/builddir/undefined_gnu9/buildnode/reynolds/src/pde/Sensor/BCSensorParameter1D.h:20,
                 from /jenkins/workspace/SANS_Nightly/builddir/undefined_gnu9/buildnode/reynolds/test/unit/pde/Sensor/BCSensorParameter1D_btest.cpp:14:
/jenkins/workspace/SANS_Nightly/builddir/undefined_gnu9/buildnode/reynolds/src/pde/Sensor/Sensor_ViscousFlux1D.h:25:46: note: #pragma message: #undef USE_GRID_LAPLACIAN
   25 | #pragma message( "#undef USE_GRID_LAPLACIAN" )
      |                                              ^
[ 91%] Built target BCSensorParameter1D_btest_OBJECT
[ 91%] Linking CXX executable BCSensorParameter1D_btest
[ 91%] Built target BCSensorParameter1D_btest_build
[ 91%] Checking style of test/unit/pde/Sensor/BCSensorParameter2D_btest.cpp
[ 91%] Built target BCSensorParameter2D_btest_build_vera
[ 91%] Building CXX object test/unit/pde/Sensor/CMakeFiles/BCSensorParameter2D_btest_OBJECT.dir/BCSensorParameter2D_btest.cpp.o
In file included from /jenkins/workspace/SANS_Nightly/builddir/undefined_gnu9/buildnode/reynolds/test/unit/pde/Sensor/BCSensorParameter2D_btest.cpp:16:
/jenkins/workspace/SANS_Nightly/builddir/undefined_gnu9/buildnode/reynolds/src/pde/Sensor/Sensor_ViscousFlux2D.h:26:46: note: #pragma message: #undef USE_GRID_LAPLACIAN
   26 | #pragma message( "#undef USE_GRID_LAPLACIAN" )
      |                                              ^
[ 91%] Built target BCSensorParameter2D_btest_OBJECT
[ 91%] Linking CXX executable BCSensorParameter2D_btest
[ 91%] Built target BCSensorParameter2D_btest_build
[ 93%] Checking style of test/unit/pde/Sensor/PDESensorParameter1D_btest.cpp
[ 93%] Built target PDESensorParameter1D_btest_build_vera
[ 93%] Building CXX object test/unit/pde/Sensor/CMakeFiles/PDESensorParameter1D_btest_OBJECT.dir/PDESensorParameter1D_btest.cpp.o
In file included from /usr/include/boost/config/header_deprecated.hpp:18,
                 from /usr/include/boost/test/output_test_stream.hpp:13,
                 from /jenkins/workspace/SANS_Nightly/builddir/undefined_gnu9/buildnode/reynolds/test/SANS_prefix_btest.h:51,
                 from /jenkins/workspace/SANS_Nightly/builddir/undefined_gnu9/buildnode/reynolds/build/undefined_gnu9/test/cotire/SANS_PREFIX_BTEST_CXX_prefix.cxx:4,
                 from /jenkins/workspace/SANS_Nightly/builddir/undefined_gnu9/buildnode/reynolds/build/undefined_gnu9/test/cotire/SANS_PREFIX_BTEST_CXX_prefix.hxx:4:
/usr/include/boost/test/output_test_stream.hpp:14:1: note: #pragma message: This header is deprecated. Use This header is deprecated. Please use <boost/test/tools/output_test_stream.hpp> instead. instead.
   14 | BOOST_HEADER_DEPRECATED( "This header is deprecated. Please use <boost/test/tools/output_test_stream.hpp> instead." )
      | ^~~~~~~~~~~~~~~~~~~~~~~
In file included from /jenkins/workspace/SANS_Nightly/builddir/undefined_gnu9/buildnode/reynolds/src/pde/Sensor/PDESensorParameter1D.h:18,
                 from /jenkins/workspace/SANS_Nightly/builddir/undefined_gnu9/buildnode/reynolds/test/unit/pde/Sensor/PDESensorParameter1D_btest.cpp:21:
/jenkins/workspace/SANS_Nightly/builddir/undefined_gnu9/buildnode/reynolds/src/pde/Sensor/Sensor_ViscousFlux1D.h:25:46: note: #pragma message: #undef USE_GRID_LAPLACIAN
   25 | #pragma message( "#undef USE_GRID_LAPLACIAN" )
      |                                              ^
[ 93%] Built target PDESensorParameter1D_btest_OBJECT
[ 93%] Linking CXX executable PDESensorParameter1D_btest
[ 93%] Built target PDESensorParameter1D_btest_build
[ 93%] Checking style of test/unit/pde/Sensor/PDESensorParameter2D_btest.cpp
[ 93%] Built target PDESensorParameter2D_btest_build_vera
[ 93%] Building CXX object test/unit/pde/Sensor/CMakeFiles/PDESensorParameter2D_btest_OBJECT.dir/PDESensorParameter2D_btest.cpp.o
In file included from /usr/include/boost/config/header_deprecated.hpp:18,
                 from /usr/include/boost/test/output_test_stream.hpp:13,
                 from /jenkins/workspace/SANS_Nightly/builddir/undefined_gnu9/buildnode/reynolds/test/SANS_prefix_btest.h:51,
                 from /jenkins/workspace/SANS_Nightly/builddir/undefined_gnu9/buildnode/reynolds/build/undefined_gnu9/test/cotire/SANS_PREFIX_BTEST_CXX_prefix.cxx:4,
                 from /jenkins/workspace/SANS_Nightly/builddir/undefined_gnu9/buildnode/reynolds/build/undefined_gnu9/test/cotire/SANS_PREFIX_BTEST_CXX_prefix.hxx:4:
/usr/include/boost/test/output_test_stream.hpp:14:1: note: #pragma message: This header is deprecated. Use This header is deprecated. Please use <boost/test/tools/output_test_stream.hpp> instead. instead.
   14 | BOOST_HEADER_DEPRECATED( "This header is deprecated. Please use <boost/test/tools/output_test_stream.hpp> instead." )
      | ^~~~~~~~~~~~~~~~~~~~~~~
In file included from /jenkins/workspace/SANS_Nightly/builddir/undefined_gnu9/buildnode/reynolds/src/pde/Sensor/PDESensorParameter2D.h:18,
                 from /jenkins/workspace/SANS_Nightly/builddir/undefined_gnu9/buildnode/reynolds/test/unit/pde/Sensor/PDESensorParameter2D_btest.cpp:21:
/jenkins/workspace/SANS_Nightly/builddir/undefined_gnu9/buildnode/reynolds/src/pde/Sensor/Sensor_ViscousFlux2D.h:26:46: note: #pragma message: #undef USE_GRID_LAPLACIAN
   26 | #pragma message( "#undef USE_GRID_LAPLACIAN" )
      |                                              ^
[ 93%] Built target PDESensorParameter2D_btest_OBJECT
[ 93%] Linking CXX executable PDESensorParameter2D_btest
[ 93%] Built target PDESensorParameter2D_btest_build
[ 93%] Checking style of test/unit/pde/Sensor/Sensor_AdvectiveFlux1D_btest.cpp
[ 93%] Built target Sensor_AdvectiveFlux1D_btest_build_vera
[ 93%] Building CXX object test/unit/pde/Sensor/CMakeFiles/Sensor_AdvectiveFlux1D_btest_OBJECT.dir/Sensor_AdvectiveFlux1D_btest.cpp.o
In file included from /usr/include/boost/config/header_deprecated.hpp:18,
                 from /usr/include/boost/test/output_test_stream.hpp:13,
                 from /jenkins/workspace/SANS_Nightly/builddir/undefined_gnu9/buildnode/reynolds/test/SANS_prefix_btest.h:51,
                 from /jenkins/workspace/SANS_Nightly/builddir/undefined_gnu9/buildnode/reynolds/build/undefined_gnu9/test/cotire/SANS_PREFIX_BTEST_CXX_prefix.cxx:4,
                 from /jenkins/workspace/SANS_Nightly/builddir/undefined_gnu9/buildnode/reynolds/build/undefined_gnu9/test/cotire/SANS_PREFIX_BTEST_CXX_prefix.hxx:4:
/usr/include/boost/test/output_test_stream.hpp:14:1: note: #pragma message: This header is deprecated. Use This header is deprecated. Please use <boost/test/tools/output_test_stream.hpp> instead. instead.
   14 | BOOST_HEADER_DEPRECATED( "This header is deprecated. Please use <boost/test/tools/output_test_stream.hpp> instead." )
      | ^~~~~~~~~~~~~~~~~~~~~~~
[ 93%] Built target Sensor_AdvectiveFlux1D_btest_OBJECT
[ 93%] Linking CXX executable Sensor_AdvectiveFlux1D_btest
[ 93%] Built target Sensor_AdvectiveFlux1D_btest_build
[ 93%] Checking style of test/unit/pde/Sensor/Sensor_AdvectiveFlux2D_btest.cpp
[ 93%] Built target Sensor_AdvectiveFlux2D_btest_build_vera
[ 93%] Building CXX object test/unit/pde/Sensor/CMakeFiles/Sensor_AdvectiveFlux2D_btest_OBJECT.dir/Sensor_AdvectiveFlux2D_btest.cpp.o
In file included from /usr/include/boost/config/header_deprecated.hpp:18,
                 from /usr/include/boost/test/output_test_stream.hpp:13,
                 from /jenkins/workspace/SANS_Nightly/builddir/undefined_gnu9/buildnode/reynolds/test/SANS_prefix_btest.h:51,
                 from /jenkins/workspace/SANS_Nightly/builddir/undefined_gnu9/buildnode/reynolds/build/undefined_gnu9/test/cotire/SANS_PREFIX_BTEST_CXX_prefix.cxx:4,
                 from /jenkins/workspace/SANS_Nightly/builddir/undefined_gnu9/buildnode/reynolds/build/undefined_gnu9/test/cotire/SANS_PREFIX_BTEST_CXX_prefix.hxx:4:
/usr/include/boost/test/output_test_stream.hpp:14:1: note: #pragma message: This header is deprecated. Use This header is deprecated. Please use <boost/test/tools/output_test_stream.hpp> instead. instead.
   14 | BOOST_HEADER_DEPRECATED( "This header is deprecated. Please use <boost/test/tools/output_test_stream.hpp> instead." )
      | ^~~~~~~~~~~~~~~~~~~~~~~
[ 93%] Built target Sensor_AdvectiveFlux2D_btest_OBJECT
[ 93%] Linking CXX executable Sensor_AdvectiveFlux2D_btest
[ 93%] Built target Sensor_AdvectiveFlux2D_btest_build
[ 93%] Checking style of test/unit/pde/Sensor/Sensor_DiffusionMatrix1D_btest.cpp
[ 93%] Built target Sensor_DiffusionMatrix1D_btest_build_vera
[ 93%] Building CXX object test/unit/pde/Sensor/CMakeFiles/Sensor_DiffusionMatrix1D_btest_OBJECT.dir/Sensor_DiffusionMatrix1D_btest.cpp.o
In file included from /usr/include/boost/config/header_deprecated.hpp:18,
                 from /usr/include/boost/test/output_test_stream.hpp:13,
                 from /jenkins/workspace/SANS_Nightly/builddir/undefined_gnu9/buildnode/reynolds/test/SANS_prefix_btest.h:51,
                 from /jenkins/workspace/SANS_Nightly/builddir/undefined_gnu9/buildnode/reynolds/build/undefined_gnu9/test/cotire/SANS_PREFIX_BTEST_CXX_prefix.cxx:4,
                 from /jenkins/workspace/SANS_Nightly/builddir/undefined_gnu9/buildnode/reynolds/build/undefined_gnu9/test/cotire/SANS_PREFIX_BTEST_CXX_prefix.hxx:4:
/usr/include/boost/test/output_test_stream.hpp:14:1: note: #pragma message: This header is deprecated. Use This header is deprecated. Please use <boost/test/tools/output_test_stream.hpp> instead. instead.
   14 | BOOST_HEADER_DEPRECATED( "This header is deprecated. Please use <boost/test/tools/output_test_stream.hpp> instead." )
      | ^~~~~~~~~~~~~~~~~~~~~~~
In file included from /jenkins/workspace/SANS_Nightly/builddir/undefined_gnu9/buildnode/reynolds/test/unit/pde/Sensor/Sensor_DiffusionMatrix1D_btest.cpp:18:
/jenkins/workspace/SANS_Nightly/builddir/undefined_gnu9/buildnode/reynolds/src/pde/Sensor/Sensor_ViscousFlux1D.h:25:46: note: #pragma message: #undef USE_GRID_LAPLACIAN
   25 | #pragma message( "#undef USE_GRID_LAPLACIAN" )
      |                                              ^
[ 93%] Built target Sensor_DiffusionMatrix1D_btest_OBJECT
[ 93%] Linking CXX executable Sensor_DiffusionMatrix1D_btest
[ 93%] Built target Sensor_DiffusionMatrix1D_btest_build
[ 93%] Checking style of test/unit/pde/Sensor/Sensor_DiffusionMatrix2D_btest.cpp
[ 93%] Built target Sensor_DiffusionMatrix2D_btest_build_vera
[ 93%] Building CXX object test/unit/pde/Sensor/CMakeFiles/Sensor_DiffusionMatrix2D_btest_OBJECT.dir/Sensor_DiffusionMatrix2D_btest.cpp.o
In file included from /usr/include/boost/config/header_deprecated.hpp:18,
                 from /usr/include/boost/test/output_test_stream.hpp:13,
                 from /jenkins/workspace/SANS_Nightly/builddir/undefined_gnu9/buildnode/reynolds/test/SANS_prefix_btest.h:51,
                 from /jenkins/workspace/SANS_Nightly/builddir/undefined_gnu9/buildnode/reynolds/build/undefined_gnu9/test/cotire/SANS_PREFIX_BTEST_CXX_prefix.cxx:4,
                 from /jenkins/workspace/SANS_Nightly/builddir/undefined_gnu9/buildnode/reynolds/build/undefined_gnu9/test/cotire/SANS_PREFIX_BTEST_CXX_prefix.hxx:4:
/usr/include/boost/test/output_test_stream.hpp:14:1: note: #pragma message: This header is deprecated. Use This header is deprecated. Please use <boost/test/tools/output_test_stream.hpp> instead. instead.
   14 | BOOST_HEADER_DEPRECATED( "This header is deprecated. Please use <boost/test/tools/output_test_stream.hpp> instead." )
      | ^~~~~~~~~~~~~~~~~~~~~~~
In file included from /jenkins/workspace/SANS_Nightly/builddir/undefined_gnu9/buildnode/reynolds/test/unit/pde/Sensor/Sensor_DiffusionMatrix2D_btest.cpp:18:
/jenkins/workspace/SANS_Nightly/builddir/undefined_gnu9/buildnode/reynolds/src/pde/Sensor/Sensor_ViscousFlux2D.h:26:46: note: #pragma message: #undef USE_GRID_LAPLACIAN
   26 | #pragma message( "#undef USE_GRID_LAPLACIAN" )
      |                                              ^
[ 93%] Built target Sensor_DiffusionMatrix2D_btest_OBJECT
[ 93%] Linking CXX executable Sensor_DiffusionMatrix2D_btest
[ 93%] Built target Sensor_DiffusionMatrix2D_btest_build
[ 93%] Checking style of test/unit/pde/Sensor/Source1D_JumpSensor_btest.cpp
[ 93%] Built target Source1D_JumpSensor_btest_build_vera
[ 93%] Building CXX object test/unit/pde/Sensor/CMakeFiles/Source1D_JumpSensor_btest_OBJECT.dir/Source1D_JumpSensor_btest.cpp.o
[ 93%] Built target Source1D_JumpSensor_btest_OBJECT
[ 93%] Linking CXX executable Source1D_JumpSensor_btest
[ 93%] Built target Source1D_JumpSensor_btest_build
[ 93%] Checking style of test/unit/pde/Sensor/Source2D_JumpSensor_btest.cpp
[ 93%] Built target Source2D_JumpSensor_btest_build_vera
[ 93%] Building CXX object test/unit/pde/Sensor/CMakeFiles/Source2D_JumpSensor_btest_OBJECT.dir/Source2D_JumpSensor_btest.cpp.o
[ 93%] Built target Source2D_JumpSensor_btest_OBJECT
[ 93%] Linking CXX executable Source2D_JumpSensor_btest
[ 93%] Built target Source2D_JumpSensor_btest_build
[ 93%] Checking style of test/unit/pde/ShallowWater/BCShallowWater1D_btest.cpp
[ 93%] Built target BCShallowWater1D_btest_build_vera
[ 93%] Building CXX object test/unit/pde/ShallowWater/CMakeFiles/BCShallowWater1D_btest_OBJECT.dir/BCShallowWater1D_btest.cpp.o
[ 93%] Built target BCShallowWater1D_btest_OBJECT
[ 93%] Linking CXX executable BCShallowWater1D_btest
[ 93%] Built target BCShallowWater1D_btest_build
[ 93%] Checking style of test/unit/pde/ShallowWater/BCShallowWater2D_btest.cpp
[ 93%] Built target BCShallowWater2D_btest_build_vera
[ 93%] Building CXX object test/unit/pde/ShallowWater/CMakeFiles/BCShallowWater2D_btest_OBJECT.dir/BCShallowWater2D_btest.cpp.o
[ 93%] Built target BCShallowWater2D_btest_OBJECT
[ 93%] Linking CXX executable BCShallowWater2D_btest
[ 93%] Built target BCShallowWater2D_btest_build
[ 93%] Checking style of test/unit/pde/ShallowWater/BCShallowWater2D_manifold_btest.cpp
[ 93%] Built target BCShallowWater2D_manifold_btest_build_vera
[ 93%] Building CXX object test/unit/pde/ShallowWater/CMakeFiles/BCShallowWater2D_manifold_btest_OBJECT.dir/BCShallowWater2D_manifold_btest.cpp.o
[ 93%] Built target BCShallowWater2D_manifold_btest_OBJECT
[ 93%] Linking CXX executable BCShallowWater2D_manifold_btest
[ 93%] Built target BCShallowWater2D_manifold_btest_build
[ 93%] Checking style of test/unit/pde/ShallowWater/OutputShallowWater1D_btest.cpp
[ 93%] Built target OutputShallowWater1D_btest_build_vera
[ 93%] Building CXX object test/unit/pde/ShallowWater/CMakeFiles/OutputShallowWater1D_btest_OBJECT.dir/OutputShallowWater1D_btest.cpp.o
[ 93%] Built target OutputShallowWater1D_btest_OBJECT
[ 93%] Linking CXX executable OutputShallowWater1D_btest
[ 93%] Built target OutputShallowWater1D_btest_build
[ 93%] Checking style of test/unit/pde/ShallowWater/OutputShallowWater2D_btest.cpp
[ 93%] Built target OutputShallowWater2D_btest_build_vera
[ 93%] Building CXX object test/unit/pde/ShallowWater/CMakeFiles/OutputShallowWater2D_btest_OBJECT.dir/OutputShallowWater2D_btest.cpp.o
[ 93%] Built target OutputShallowWater2D_btest_OBJECT
[ 93%] Linking CXX executable OutputShallowWater2D_btest
[ 93%] Built target OutputShallowWater2D_btest_build
[ 93%] Checking style of test/unit/pde/ShallowWater/PDEShallowWater1D_btest.cpp
[ 93%] Built target PDEShallowWater1D_btest_build_vera
[ 93%] Building CXX object test/unit/pde/ShallowWater/CMakeFiles/PDEShallowWater1D_btest_OBJECT.dir/PDEShallowWater1D_btest.cpp.o
[ 93%] Built target PDEShallowWater1D_btest_OBJECT
[ 93%] Linking CXX executable PDEShallowWater1D_btest
[ 93%] Built target PDEShallowWater1D_btest_build
[ 93%] Checking style of test/unit/pde/ShallowWater/PDEShallowWater2D_btest.cpp
[ 93%] Built target PDEShallowWater2D_btest_build_vera
[ 93%] Building CXX object test/unit/pde/ShallowWater/CMakeFiles/PDEShallowWater2D_btest_OBJECT.dir/PDEShallowWater2D_btest.cpp.o
[ 93%] Built target PDEShallowWater2D_btest_OBJECT
[ 93%] Linking CXX executable PDEShallowWater2D_btest
[ 93%] Built target PDEShallowWater2D_btest_build
[ 93%] Checking style of test/unit/pde/ShallowWater/PDEShallowWater2D_manifold_btest.cpp
[ 93%] Built target PDEShallowWater2D_manifold_btest_build_vera
[ 93%] Building CXX object test/unit/pde/ShallowWater/CMakeFiles/PDEShallowWater2D_manifold_btest_OBJECT.dir/PDEShallowWater2D_manifold_btest.cpp.o
[ 93%] Built target PDEShallowWater2D_manifold_btest_OBJECT
[ 93%] Linking CXX executable PDEShallowWater2D_manifold_btest
[ 93%] Built target PDEShallowWater2D_manifold_btest_build
[ 93%] Checking style of test/unit/pde/ShallowWater/ShallowWaterSolution1D_btest.cpp
[ 93%] Built target ShallowWaterSolution1D_btest_build_vera
[ 93%] Building CXX object test/unit/pde/ShallowWater/CMakeFiles/ShallowWaterSolution1D_btest_OBJECT.dir/ShallowWaterSolution1D_btest.cpp.o
[ 93%] Built target ShallowWaterSolution1D_btest_OBJECT
[ 93%] Linking CXX executable ShallowWaterSolution1D_btest
[ 93%] Built target ShallowWaterSolution1D_btest_build
[ 93%] Checking style of test/unit/pde/ShallowWater/ShallowWaterSolution2D_btest.cpp
[ 93%] Built target ShallowWaterSolution2D_btest_build_vera
[ 93%] Building CXX object test/unit/pde/ShallowWater/CMakeFiles/ShallowWaterSolution2D_btest_OBJECT.dir/ShallowWaterSolution2D_btest.cpp.o
[ 93%] Built target ShallowWaterSolution2D_btest_OBJECT
[ 93%] Linking CXX executable ShallowWaterSolution2D_btest
[ 93%] Built target ShallowWaterSolution2D_btest_build
[ 93%] Checking style of test/unit/pde/ShallowWater/ShallowWaterSolution2D_manifold_btest.cpp
[ 93%] Built target ShallowWaterSolution2D_manifold_btest_build_vera
[ 93%] Building CXX object test/unit/pde/ShallowWater/CMakeFiles/ShallowWaterSolution2D_manifold_btest_OBJECT.dir/ShallowWaterSolution2D_manifold_btest.cpp.o
[ 93%] Built target ShallowWaterSolution2D_manifold_btest_OBJECT
[ 93%] Linking CXX executable ShallowWaterSolution2D_manifold_btest
[ 93%] Built target ShallowWaterSolution2D_manifold_btest_build
[ 93%] Checking style of test/unit/pde/ShallowWater/ShallowWaterVarInterp1D_btest.cpp
[ 93%] Built target ShallowWaterVarInterp1D_btest_build_vera
[ 93%] Building CXX object test/unit/pde/ShallowWater/CMakeFiles/ShallowWaterVarInterp1D_btest_OBJECT.dir/ShallowWaterVarInterp1D_btest.cpp.o
[ 93%] Built target ShallowWaterVarInterp1D_btest_OBJECT
[ 93%] Linking CXX executable ShallowWaterVarInterp1D_btest
[ 93%] Built target ShallowWaterVarInterp1D_btest_build
[ 93%] Checking style of test/unit/pde/ShallowWater/ShallowWaterVarInterp2D_btest.cpp
[ 93%] Built target ShallowWaterVarInterp2D_btest_build_vera
[ 93%] Building CXX object test/unit/pde/ShallowWater/CMakeFiles/ShallowWaterVarInterp2D_btest_OBJECT.dir/ShallowWaterVarInterp2D_btest.cpp.o
[ 93%] Built target ShallowWaterVarInterp2D_btest_OBJECT
[ 93%] Linking CXX executable ShallowWaterVarInterp2D_btest
[ 93%] Built target ShallowWaterVarInterp2D_btest_build
[ 93%] Checking style of test/unit/pde/ShallowWater/ShallowWaterVarInterp2D_manifold_btest.cpp
[ 93%] Built target ShallowWaterVarInterp2D_manifold_btest_build_vera
[ 93%] Building CXX object test/unit/pde/ShallowWater/CMakeFiles/ShallowWaterVarInterp2D_manifold_btest_OBJECT.dir/ShallowWaterVarInterp2D_manifold_btest.cpp.o
[ 93%] Built target ShallowWaterVarInterp2D_manifold_btest_OBJECT
[ 93%] Linking CXX executable ShallowWaterVarInterp2D_manifold_btest
[ 93%] Built target ShallowWaterVarInterp2D_manifold_btest_build
[ 93%] Checking style of test/unit/pde/Stokes/PDEStokes2D_btest.cpp
[ 93%] Built target PDEStokes2D_btest_build_vera
[ 93%] Checking style of src/pde/Stokes/BCStokes2D.cpp
[ 93%] Checking style of src/pde/Stokes/BCStokes2D.h
[ 93%] Checking style of src/pde/Stokes/OutputStokes2D.h
[ 93%] Checking style of src/pde/Stokes/PDEStokes2D.h
[ 93%] Checking style of src/pde/Stokes/SolutionFunction_Stokes2D.h
[ 93%] Checking style of src/pde/Stokes/TraitsStokes.h
[ 93%] Checking style of src/pde/Stokes/SolutionFunction_Stokes2D.cpp
[ 93%] Built target StokesLib_vera
[ 93%] Generating CXX unity source src/pde/Stokes/cotire/StokesLib_CXX_unity.cxx
[ 93%] Generating CXX prefix source src/pde/Stokes/cotire/StokesLib_CXX_prefix.cxx
[ 93%] Generating CXX prefix header src/pde/Stokes/cotire/StokesLib_CXX_prefix.hxx
[ 93%] Building CXX precompiled header src/pde/Stokes/cotire/StokesLib_CXX_prefix.hxx.gch
Scanning dependencies of target StokesLib
[ 93%] Building CXX object src/pde/Stokes/CMakeFiles/StokesLib.dir/BCStokes2D.cpp.o
[ 93%] Building CXX object src/pde/Stokes/CMakeFiles/StokesLib.dir/SolutionFunction_Stokes2D.cpp.o
[ 93%] Linking CXX static library libStokesLib.a
[ 93%] Built target StokesLib
[ 93%] Building CXX object test/unit/pde/Stokes/CMakeFiles/PDEStokes2D_btest_OBJECT.dir/PDEStokes2D_btest.cpp.o
In file included from /usr/include/boost/config/header_deprecated.hpp:18,
                 from /usr/include/boost/test/output_test_stream.hpp:13,
                 from /jenkins/workspace/SANS_Nightly/builddir/undefined_gnu9/buildnode/reynolds/test/SANS_prefix_btest.h:51,
                 from /jenkins/workspace/SANS_Nightly/builddir/undefined_gnu9/buildnode/reynolds/build/undefined_gnu9/test/cotire/SANS_PREFIX_BTEST_CXX_prefix.cxx:4,
                 from /jenkins/workspace/SANS_Nightly/builddir/undefined_gnu9/buildnode/reynolds/build/undefined_gnu9/test/cotire/SANS_PREFIX_BTEST_CXX_prefix.hxx:4:
/usr/include/boost/test/output_test_stream.hpp:14:1: note: #pragma message: This header is deprecated. Use This header is deprecated. Please use <boost/test/tools/output_test_stream.hpp> instead. instead.
   14 | BOOST_HEADER_DEPRECATED( "This header is deprecated. Please use <boost/test/tools/output_test_stream.hpp> instead." )
      | ^~~~~~~~~~~~~~~~~~~~~~~
[ 93%] Built target PDEStokes2D_btest_OBJECT
[ 93%] Linking CXX executable PDEStokes2D_btest
[ 93%] Built target PDEStokes2D_btest_build
[ 93%] Checking style of test/unit/pde/TCNE/BCTCNEEuler1D_btest.cpp
[ 93%] Built target BCTCNEEuler1D_btest_build_vera
[ 93%] Checking style of src/pde/TCNE/BCTCNEEuler1D.cpp
[ 93%] Checking style of src/pde/TCNE/BCTCNEEuler1D.h
[ 93%] Checking style of src/pde/TCNE/BCTCNEEuler1D_mitState.h
[ 93%] Checking style of src/pde/TCNE/PDETCNEEuler1D.h
[ 93%] Checking style of src/pde/TCNE/Q1DTCNEConservative.h
[ 93%] Checking style of src/pde/TCNE/TCNEChemistryDataImport.h
[ 93%] Checking style of src/pde/TCNE/TCNEChemistryModels.h
[ 93%] Checking style of src/pde/TCNE/TCNEGasModel_CurveFit.h
[ 93%] Checking style of src/pde/TCNE/TCNEGasModel_Perfect.h
[ 93%] Checking style of src/pde/TCNE/TCNEGasModel_StatMech.h
[ 93%] Checking style of src/pde/TCNE/TCNEVariable1D.h
[ 93%] Checking style of src/pde/TCNE/TraitsTCNEEuler.h
[ 93%] Checking style of src/pde/TCNE/Q1DTCNEConservative.cpp
[ 93%] Checking style of src/pde/TCNE/TCNEChemistryDataImport.cpp
[ 93%] Checking style of src/pde/TCNE/TCNEChemistryModels.cpp
[ 95%] Checking style of src/pde/TCNE/TCNEGasModel_CurveFit.cpp
[ 95%] Checking style of src/pde/TCNE/TCNEGasModel_Perfect.cpp
[ 95%] Checking style of src/pde/TCNE/TCNEGasModel_StatMech.cpp
[ 95%] Checking style of src/pde/TCNE/TCNEVariable1D.cpp
[ 95%] Built target TCNELib_vera
[ 95%] Generating CXX unity source src/pde/TCNE/cotire/TCNELib_CXX_unity.cxx
[ 95%] Generating CXX prefix source src/pde/TCNE/cotire/TCNELib_CXX_prefix.cxx
[ 95%] Generating CXX prefix header src/pde/TCNE/cotire/TCNELib_CXX_prefix.hxx
[ 95%] Building CXX precompiled header src/pde/TCNE/cotire/TCNELib_CXX_prefix.hxx.gch
Scanning dependencies of target TCNELib
[ 95%] Building CXX object src/pde/TCNE/CMakeFiles/TCNELib.dir/BCTCNEEuler1D.cpp.o
[ 95%] Building CXX object src/pde/TCNE/CMakeFiles/TCNELib.dir/Q1DTCNEConservative.cpp.o
[ 95%] Building CXX object src/pde/TCNE/CMakeFiles/TCNELib.dir/TCNEGasModel_Perfect.cpp.o
[ 95%] Building CXX object src/pde/TCNE/CMakeFiles/TCNELib.dir/TCNEGasModel_CurveFit.cpp.o
[ 95%] Building CXX object src/pde/TCNE/CMakeFiles/TCNELib.dir/TCNEGasModel_StatMech.cpp.o
[ 95%] Building CXX object src/pde/TCNE/CMakeFiles/TCNELib.dir/TCNEVariable1D.cpp.o
[ 95%] Building CXX object src/pde/TCNE/CMakeFiles/TCNELib.dir/TCNEChemistryDataImport.cpp.o
[ 95%] Building CXX object src/pde/TCNE/CMakeFiles/TCNELib.dir/TCNEChemistryModels.cpp.o
[ 95%] Linking CXX static library libTCNELib.a
[ 95%] Built target TCNELib
[ 95%] Building CXX object test/unit/pde/TCNE/CMakeFiles/BCTCNEEuler1D_btest_OBJECT.dir/BCTCNEEuler1D_btest.cpp.o
In file included from /usr/include/boost/config/header_deprecated.hpp:18,
                 from /usr/include/boost/test/output_test_stream.hpp:13,
                 from /jenkins/workspace/SANS_Nightly/builddir/undefined_gnu9/buildnode/reynolds/test/SANS_prefix_btest.h:51,
                 from /jenkins/workspace/SANS_Nightly/builddir/undefined_gnu9/buildnode/reynolds/build/undefined_gnu9/test/cotire/SANS_PREFIX_BTEST_CXX_prefix.cxx:4,
                 from /jenkins/workspace/SANS_Nightly/builddir/undefined_gnu9/buildnode/reynolds/build/undefined_gnu9/test/cotire/SANS_PREFIX_BTEST_CXX_prefix.hxx:4:
/usr/include/boost/test/output_test_stream.hpp:14:1: note: #pragma message: This header is deprecated. Use This header is deprecated. Please use <boost/test/tools/output_test_stream.hpp> instead. instead.
   14 | BOOST_HEADER_DEPRECATED( "This header is deprecated. Please use <boost/test/tools/output_test_stream.hpp> instead." )
      | ^~~~~~~~~~~~~~~~~~~~~~~
[ 95%] Built target BCTCNEEuler1D_btest_OBJECT
[ 95%] Linking CXX executable BCTCNEEuler1D_btest
[ 95%] Built target BCTCNEEuler1D_btest_build
[ 95%] Checking style of test/unit/pde/TCNE/PDETCNEEuler1D_btest.cpp
[ 95%] Built target PDETCNEEuler1D_btest_build_vera
[ 95%] Building CXX object test/unit/pde/TCNE/CMakeFiles/PDETCNEEuler1D_btest_OBJECT.dir/PDETCNEEuler1D_btest.cpp.o
In file included from /usr/include/boost/config/header_deprecated.hpp:18,
                 from /usr/include/boost/test/output_test_stream.hpp:13,
                 from /jenkins/workspace/SANS_Nightly/builddir/undefined_gnu9/buildnode/reynolds/test/SANS_prefix_btest.h:51,
                 from /jenkins/workspace/SANS_Nightly/builddir/undefined_gnu9/buildnode/reynolds/build/undefined_gnu9/test/cotire/SANS_PREFIX_BTEST_CXX_prefix.cxx:4,
                 from /jenkins/workspace/SANS_Nightly/builddir/undefined_gnu9/buildnode/reynolds/build/undefined_gnu9/test/cotire/SANS_PREFIX_BTEST_CXX_prefix.hxx:4:
/usr/include/boost/test/output_test_stream.hpp:14:1: note: #pragma message: This header is deprecated. Use This header is deprecated. Please use <boost/test/tools/output_test_stream.hpp> instead. instead.
   14 | BOOST_HEADER_DEPRECATED( "This header is deprecated. Please use <boost/test/tools/output_test_stream.hpp> instead." )
      | ^~~~~~~~~~~~~~~~~~~~~~~
[ 95%] Built target PDETCNEEuler1D_btest_OBJECT
[ 95%] Linking CXX executable PDETCNEEuler1D_btest
[ 95%] Built target PDETCNEEuler1D_btest_build
[ 95%] Checking style of test/unit/pde/TCNE/Q1DTCNEConservative_btest.cpp
[ 95%] Built target Q1DTCNEConservative_btest_build_vera
[ 95%] Building CXX object test/unit/pde/TCNE/CMakeFiles/Q1DTCNEConservative_btest_OBJECT.dir/Q1DTCNEConservative_btest.cpp.o
In file included from /usr/include/boost/config/header_deprecated.hpp:18,
                 from /usr/include/boost/test/output_test_stream.hpp:13,
                 from /jenkins/workspace/SANS_Nightly/builddir/undefined_gnu9/buildnode/reynolds/test/SANS_prefix_btest.h:51,
                 from /jenkins/workspace/SANS_Nightly/builddir/undefined_gnu9/buildnode/reynolds/build/undefined_gnu9/test/cotire/SANS_PREFIX_BTEST_CXX_prefix.cxx:4,
                 from /jenkins/workspace/SANS_Nightly/builddir/undefined_gnu9/buildnode/reynolds/build/undefined_gnu9/test/cotire/SANS_PREFIX_BTEST_CXX_prefix.hxx:4:
/usr/include/boost/test/output_test_stream.hpp:14:1: note: #pragma message: This header is deprecated. Use This header is deprecated. Please use <boost/test/tools/output_test_stream.hpp> instead. instead.
   14 | BOOST_HEADER_DEPRECATED( "This header is deprecated. Please use <boost/test/tools/output_test_stream.hpp> instead." )
      | ^~~~~~~~~~~~~~~~~~~~~~~
[ 95%] Built target Q1DTCNEConservative_btest_OBJECT
[ 95%] Linking CXX executable Q1DTCNEConservative_btest
[ 95%] Built target Q1DTCNEConservative_btest_build
[ 95%] Checking style of test/unit/pde/TCNE/TCNEChemistryDataImport_btest.cpp
[ 95%] Built target TCNEChemistryDataImport_btest_build_vera
[ 95%] Building CXX object test/unit/pde/TCNE/CMakeFiles/TCNEChemistryDataImport_btest_OBJECT.dir/TCNEChemistryDataImport_btest.cpp.o
[ 95%] Built target TCNEChemistryDataImport_btest_OBJECT
[ 95%] Linking CXX executable TCNEChemistryDataImport_btest
[ 95%] Built target TCNEChemistryDataImport_btest_build
[ 95%] Checking style of test/unit/pde/TCNE/TCNEChemistryModels_btest.cpp
[ 95%] Built target TCNEChemistryModels_btest_build_vera
[ 95%] Building CXX object test/unit/pde/TCNE/CMakeFiles/TCNEChemistryModels_btest_OBJECT.dir/TCNEChemistryModels_btest.cpp.o
In file included from /usr/include/boost/config/header_deprecated.hpp:18,
                 from /usr/include/boost/test/output_test_stream.hpp:13,
                 from /jenkins/workspace/SANS_Nightly/builddir/undefined_gnu9/buildnode/reynolds/test/SANS_prefix_btest.h:51,
                 from /jenkins/workspace/SANS_Nightly/builddir/undefined_gnu9/buildnode/reynolds/build/undefined_gnu9/test/cotire/SANS_PREFIX_BTEST_CXX_prefix.cxx:4,
                 from /jenkins/workspace/SANS_Nightly/builddir/undefined_gnu9/buildnode/reynolds/build/undefined_gnu9/test/cotire/SANS_PREFIX_BTEST_CXX_prefix.hxx:4:
/usr/include/boost/test/output_test_stream.hpp:14:1: note: #pragma message: This header is deprecated. Use This header is deprecated. Please use <boost/test/tools/output_test_stream.hpp> instead. instead.
   14 | BOOST_HEADER_DEPRECATED( "This header is deprecated. Please use <boost/test/tools/output_test_stream.hpp> instead." )
      | ^~~~~~~~~~~~~~~~~~~~~~~
[ 95%] Built target TCNEChemistryModels_btest_OBJECT
[ 95%] Linking CXX executable TCNEChemistryModels_btest
[ 95%] Built target TCNEChemistryModels_btest_build
[ 95%] Checking style of test/unit/pde/TCNE/TCNEGasModel_StatMech_btest.cpp
[ 95%] Built target TCNEGasModel_StatMech_btest_build_vera
[ 95%] Building CXX object test/unit/pde/TCNE/CMakeFiles/TCNEGasModel_StatMech_btest_OBJECT.dir/TCNEGasModel_StatMech_btest.cpp.o
[ 95%] Built target TCNEGasModel_StatMech_btest_OBJECT
[ 95%] Linking CXX executable TCNEGasModel_StatMech_btest
[ 95%] Built target TCNEGasModel_StatMech_btest_build
[ 95%] Checking style of test/unit/pde/TCNE/TCNEVariable1D_btest.cpp
[ 95%] Built target TCNEVariable1D_btest_build_vera
[ 95%] Building CXX object test/unit/pde/TCNE/CMakeFiles/TCNEVariable1D_btest_OBJECT.dir/TCNEVariable1D_btest.cpp.o
[ 95%] Built target TCNEVariable1D_btest_OBJECT
[ 95%] Linking CXX executable TCNEVariable1D_btest
[ 95%] Built target TCNEVariable1D_btest_build
[ 96%] Checking style of test/unit/Python/Parameters_btest.cpp
[ 96%] Built target Parameters_btest_build_vera
[ 96%] Building CXX object test/unit/Python/CMakeFiles/Parameters_btest_OBJECT.dir/Parameters_btest.cpp.o
In file included from /usr/include/boost/test/unit_test.hpp:19,
                 from /jenkins/workspace/SANS_Nightly/builddir/undefined_gnu9/buildnode/reynolds/test/SANS_prefix_btest.h:50,
                 from /jenkins/workspace/SANS_Nightly/builddir/undefined_gnu9/buildnode/reynolds/build/undefined_gnu9/test/cotire/SANS_PREFIX_BTEST_CXX_prefix.cxx:4,
                 from /jenkins/workspace/SANS_Nightly/builddir/undefined_gnu9/buildnode/reynolds/build/undefined_gnu9/test/cotire/SANS_PREFIX_BTEST_CXX_prefix.hxx:4:
/jenkins/workspace/SANS_Nightly/builddir/undefined_gnu9/buildnode/reynolds/test/unit/Python/Parameters_btest.cpp: In member function ‘void Python::Test1Param_test::test_method()’:
/jenkins/workspace/SANS_Nightly/builddir/undefined_gnu9/buildnode/reynolds/test/unit/Python/Parameters_btest.cpp:251:23: note: variable tracking size limit exceeded with ‘-fvar-tracking-assignments’, retrying without
  251 | BOOST_AUTO_TEST_CASE( Test1Param_test )
      |                       ^~~~~~~~~~~~~~~
[ 96%] Built target Parameters_btest_OBJECT
[ 96%] Linking CXX executable Parameters_btest
[ 96%] Built target Parameters_btest_build
[ 96%] Checking style of test/unit/Python/PyDict_btest.cpp
[ 96%] Built target PyDict_btest_build_vera
[ 96%] Building CXX object test/unit/Python/CMakeFiles/PyDict_btest_OBJECT.dir/PyDict_btest.cpp.o
[ 96%] Built target PyDict_btest_OBJECT
[ 96%] Linking CXX executable PyDict_btest
[ 96%] Built target PyDict_btest_build
[ 96%] Checking style of test/unit/Quadrature/QuadratureArea_Quad_btest.cpp
[ 96%] Built target QuadratureArea_Quad_btest_build_vera
[ 96%] Building CXX object test/unit/Quadrature/CMakeFiles/QuadratureArea_Quad_btest_OBJECT.dir/QuadratureArea_Quad_btest.cpp.o
In file included from /usr/include/boost/config/header_deprecated.hpp:18,
                 from /usr/include/boost/test/output_test_stream.hpp:13,
                 from /jenkins/workspace/SANS_Nightly/builddir/undefined_gnu9/buildnode/reynolds/test/SANS_prefix_btest.h:51,
                 from /jenkins/workspace/SANS_Nightly/builddir/undefined_gnu9/buildnode/reynolds/build/undefined_gnu9/test/cotire/SANS_PREFIX_BTEST_CXX_prefix.cxx:4,
                 from /jenkins/workspace/SANS_Nightly/builddir/undefined_gnu9/buildnode/reynolds/build/undefined_gnu9/test/cotire/SANS_PREFIX_BTEST_CXX_prefix.hxx:4:
/usr/include/boost/test/output_test_stream.hpp:14:1: note: #pragma message: This header is deprecated. Use This header is deprecated. Please use <boost/test/tools/output_test_stream.hpp> instead. instead.
   14 | BOOST_HEADER_DEPRECATED( "This header is deprecated. Please use <boost/test/tools/output_test_stream.hpp> instead." )
      | ^~~~~~~~~~~~~~~~~~~~~~~
[ 96%] Built target QuadratureArea_Quad_btest_OBJECT
[ 96%] Linking CXX executable QuadratureArea_Quad_btest
[ 96%] Built target QuadratureArea_Quad_btest_build
[ 96%] Checking style of test/unit/Quadrature/QuadratureArea_Triangle_btest.cpp
[ 96%] Built target QuadratureArea_Triangle_btest_build_vera
[ 96%] Building CXX object test/unit/Quadrature/CMakeFiles/QuadratureArea_Triangle_btest_OBJECT.dir/QuadratureArea_Triangle_btest.cpp.o
In file included from /usr/include/boost/config/header_deprecated.hpp:18,
                 from /usr/include/boost/test/output_test_stream.hpp:13,
                 from /jenkins/workspace/SANS_Nightly/builddir/undefined_gnu9/buildnode/reynolds/test/SANS_prefix_btest.h:51,
                 from /jenkins/workspace/SANS_Nightly/builddir/undefined_gnu9/buildnode/reynolds/build/undefined_gnu9/test/cotire/SANS_PREFIX_BTEST_CXX_prefix.cxx:4,
                 from /jenkins/workspace/SANS_Nightly/builddir/undefined_gnu9/buildnode/reynolds/build/undefined_gnu9/test/cotire/SANS_PREFIX_BTEST_CXX_prefix.hxx:4:
/usr/include/boost/test/output_test_stream.hpp:14:1: note: #pragma message: This header is deprecated. Use This header is deprecated. Please use <boost/test/tools/output_test_stream.hpp> instead. instead.
   14 | BOOST_HEADER_DEPRECATED( "This header is deprecated. Please use <boost/test/tools/output_test_stream.hpp> instead." )
      | ^~~~~~~~~~~~~~~~~~~~~~~
[ 96%] Built target QuadratureArea_Triangle_btest_OBJECT
[ 96%] Linking CXX executable QuadratureArea_Triangle_btest
[ 96%] Built target QuadratureArea_Triangle_btest_build
[ 96%] Checking style of test/unit/Quadrature/QuadratureLine_btest.cpp
[ 96%] Built target QuadratureLine_btest_build_vera
[ 96%] Building CXX object test/unit/Quadrature/CMakeFiles/QuadratureLine_btest_OBJECT.dir/QuadratureLine_btest.cpp.o
In file included from /usr/include/boost/config/header_deprecated.hpp:18,
                 from /usr/include/boost/test/output_test_stream.hpp:13,
                 from /jenkins/workspace/SANS_Nightly/builddir/undefined_gnu9/buildnode/reynolds/test/SANS_prefix_btest.h:51,
                 from /jenkins/workspace/SANS_Nightly/builddir/undefined_gnu9/buildnode/reynolds/build/undefined_gnu9/test/cotire/SANS_PREFIX_BTEST_CXX_prefix.cxx:4,
                 from /jenkins/workspace/SANS_Nightly/builddir/undefined_gnu9/buildnode/reynolds/build/undefined_gnu9/test/cotire/SANS_PREFIX_BTEST_CXX_prefix.hxx:4:
/usr/include/boost/test/output_test_stream.hpp:14:1: note: #pragma message: This header is deprecated. Use This header is deprecated. Please use <boost/test/tools/output_test_stream.hpp> instead. instead.
   14 | BOOST_HEADER_DEPRECATED( "This header is deprecated. Please use <boost/test/tools/output_test_stream.hpp> instead." )
      | ^~~~~~~~~~~~~~~~~~~~~~~
[ 96%] Built target QuadratureLine_btest_OBJECT
[ 96%] Linking CXX executable QuadratureLine_btest
[ 96%] Built target QuadratureLine_btest_build
[ 96%] Checking style of test/unit/Quadrature/QuadratureSpacetime_Pentatope_Stroud_btest.cpp
[ 96%] Built target QuadratureSpacetime_Pentatope_Stroud_btest_build_vera
[ 96%] Building CXX object test/unit/Quadrature/CMakeFiles/QuadratureSpacetime_Pentatope_Stroud_btest_OBJECT.dir/QuadratureSpacetime_Pentatope_Stroud_btest.cpp.o
In file included from /usr/include/boost/config/header_deprecated.hpp:18,
                 from /usr/include/boost/test/output_test_stream.hpp:13,
                 from /jenkins/workspace/SANS_Nightly/builddir/undefined_gnu9/buildnode/reynolds/test/SANS_prefix_btest.h:51,
                 from /jenkins/workspace/SANS_Nightly/builddir/undefined_gnu9/buildnode/reynolds/build/undefined_gnu9/test/cotire/SANS_PREFIX_BTEST_CXX_prefix.cxx:4,
                 from /jenkins/workspace/SANS_Nightly/builddir/undefined_gnu9/buildnode/reynolds/build/undefined_gnu9/test/cotire/SANS_PREFIX_BTEST_CXX_prefix.hxx:4:
/usr/include/boost/test/output_test_stream.hpp:14:1: note: #pragma message: This header is deprecated. Use This header is deprecated. Please use <boost/test/tools/output_test_stream.hpp> instead. instead.
   14 | BOOST_HEADER_DEPRECATED( "This header is deprecated. Please use <boost/test/tools/output_test_stream.hpp> instead." )
      | ^~~~~~~~~~~~~~~~~~~~~~~
[ 96%] Built target QuadratureSpacetime_Pentatope_Stroud_btest_OBJECT
[ 96%] Linking CXX executable QuadratureSpacetime_Pentatope_Stroud_btest
[ 96%] Built target QuadratureSpacetime_Pentatope_Stroud_btest_build
[ 96%] Checking style of test/unit/Quadrature/QuadratureSpacetime_Pentatope_btest.cpp
[ 96%] Built target QuadratureSpacetime_Pentatope_btest_build_vera
[ 96%] Building CXX object test/unit/Quadrature/CMakeFiles/QuadratureSpacetime_Pentatope_btest_OBJECT.dir/QuadratureSpacetime_Pentatope_btest.cpp.o
In file included from /usr/include/boost/config/header_deprecated.hpp:18,
                 from /usr/include/boost/test/output_test_stream.hpp:13,
                 from /jenkins/workspace/SANS_Nightly/builddir/undefined_gnu9/buildnode/reynolds/test/SANS_prefix_btest.h:51,
                 from /jenkins/workspace/SANS_Nightly/builddir/undefined_gnu9/buildnode/reynolds/build/undefined_gnu9/test/cotire/SANS_PREFIX_BTEST_CXX_prefix.cxx:4,
                 from /jenkins/workspace/SANS_Nightly/builddir/undefined_gnu9/buildnode/reynolds/build/undefined_gnu9/test/cotire/SANS_PREFIX_BTEST_CXX_prefix.hxx:4:
/usr/include/boost/test/output_test_stream.hpp:14:1: note: #pragma message: This header is deprecated. Use This header is deprecated. Please use <boost/test/tools/output_test_stream.hpp> instead. instead.
   14 | BOOST_HEADER_DEPRECATED( "This header is deprecated. Please use <boost/test/tools/output_test_stream.hpp> instead." )
      | ^~~~~~~~~~~~~~~~~~~~~~~
[ 96%] Built target QuadratureSpacetime_Pentatope_btest_OBJECT
[ 96%] Linking CXX executable QuadratureSpacetime_Pentatope_btest
[ 96%] Built target QuadratureSpacetime_Pentatope_btest_build
[ 96%] Checking style of test/unit/Quadrature/QuadratureVolume_Hexahedron_btest.cpp
[ 96%] Built target QuadratureVolume_Hexahedron_btest_build_vera
[ 96%] Building CXX object test/unit/Quadrature/CMakeFiles/QuadratureVolume_Hexahedron_btest_OBJECT.dir/QuadratureVolume_Hexahedron_btest.cpp.o
In file included from /usr/include/boost/config/header_deprecated.hpp:18,
                 from /usr/include/boost/test/output_test_stream.hpp:13,
                 from /jenkins/workspace/SANS_Nightly/builddir/undefined_gnu9/buildnode/reynolds/test/SANS_prefix_btest.h:51,
                 from /jenkins/workspace/SANS_Nightly/builddir/undefined_gnu9/buildnode/reynolds/build/undefined_gnu9/test/cotire/SANS_PREFIX_BTEST_CXX_prefix.cxx:4,
                 from /jenkins/workspace/SANS_Nightly/builddir/undefined_gnu9/buildnode/reynolds/build/undefined_gnu9/test/cotire/SANS_PREFIX_BTEST_CXX_prefix.hxx:4:
/usr/include/boost/test/output_test_stream.hpp:14:1: note: #pragma message: This header is deprecated. Use This header is deprecated. Please use <boost/test/tools/output_test_stream.hpp> instead. instead.
   14 | BOOST_HEADER_DEPRECATED( "This header is deprecated. Please use <boost/test/tools/output_test_stream.hpp> instead." )
      | ^~~~~~~~~~~~~~~~~~~~~~~
[ 96%] Built target QuadratureVolume_Hexahedron_btest_OBJECT
[ 96%] Linking CXX executable QuadratureVolume_Hexahedron_btest
[ 96%] Built target QuadratureVolume_Hexahedron_btest_build
[ 96%] Checking style of test/unit/Quadrature/QuadratureVolume_Tetrahedron_btest.cpp
[ 96%] Built target QuadratureVolume_Tetrahedron_btest_build_vera
[ 96%] Building CXX object test/unit/Quadrature/CMakeFiles/QuadratureVolume_Tetrahedron_btest_OBJECT.dir/QuadratureVolume_Tetrahedron_btest.cpp.o
In file included from /usr/include/boost/config/header_deprecated.hpp:18,
                 from /usr/include/boost/test/output_test_stream.hpp:13,
                 from /jenkins/workspace/SANS_Nightly/builddir/undefined_gnu9/buildnode/reynolds/test/SANS_prefix_btest.h:51,
                 from /jenkins/workspace/SANS_Nightly/builddir/undefined_gnu9/buildnode/reynolds/build/undefined_gnu9/test/cotire/SANS_PREFIX_BTEST_CXX_prefix.cxx:4,
                 from /jenkins/workspace/SANS_Nightly/builddir/undefined_gnu9/buildnode/reynolds/build/undefined_gnu9/test/cotire/SANS_PREFIX_BTEST_CXX_prefix.hxx:4:
/usr/include/boost/test/output_test_stream.hpp:14:1: note: #pragma message: This header is deprecated. Use This header is deprecated. Please use <boost/test/tools/output_test_stream.hpp> instead. instead.
   14 | BOOST_HEADER_DEPRECATED( "This header is deprecated. Please use <boost/test/tools/output_test_stream.hpp> instead." )
      | ^~~~~~~~~~~~~~~~~~~~~~~
[ 96%] Built target QuadratureVolume_Tetrahedron_btest_OBJECT
[ 96%] Linking CXX executable QuadratureVolume_Tetrahedron_btest
[ 96%] Built target QuadratureVolume_Tetrahedron_btest_build
[ 96%] Checking style of test/unit/Quaternion/Quaternion_btest.cpp
[ 96%] Built target Quaternion_btest_build_vera
[ 96%] Building CXX object test/unit/Quaternion/CMakeFiles/Quaternion_btest_OBJECT.dir/Quaternion_btest.cpp.o
[ 96%] Built target Quaternion_btest_OBJECT
[ 96%] Linking CXX executable Quaternion_btest
[ 96%] Built target Quaternion_btest_build
[ 96%] Checking style of src/SolutionTrek/Continuation/Continuation.h
[ 96%] Checking style of src/SolutionTrek/Continuation/DissipationBased/AlgebraicEquationSet_DBC.h
[ 96%] Checking style of src/SolutionTrek/Continuation/DissipationBased/DissipationBased.h
[ 96%] Checking style of src/SolutionTrek/Continuation/Homotopy/AlgebraicEquationSet_HTC.h
[ 96%] Checking style of src/SolutionTrek/Continuation/Homotopy/BCHomotopy.h
[ 96%] Checking style of src/SolutionTrek/Continuation/Homotopy/Homotopy.h
[ 96%] Checking style of src/SolutionTrek/Continuation/Homotopy/PDEHomotopy.h
[ 96%] Checking style of src/SolutionTrek/Continuation/Homotopy/PDESourceOnly.h
[ 96%] Checking style of src/SolutionTrek/Continuation/ImplicitResidualSmoothing/AlgebraicEquationSetBase_IRS.h
[ 96%] Checking style of src/SolutionTrek/Continuation/ImplicitResidualSmoothing/AlgebraicEquationSet_Block2x2_IRS.h
[ 96%] Checking style of src/SolutionTrek/Continuation/ImplicitResidualSmoothing/AlgebraicEquationSet_IRS.h
[ 96%] Checking style of src/SolutionTrek/Continuation/ImplicitResidualSmoothing/ImplicitResidualSmoothing.h
[ 96%] Checking style of src/SolutionTrek/Continuation/PseudoTime/AlgebraicEquationSetBase_GloballyConstrained_PTC.h
[ 96%] Checking style of src/SolutionTrek/Continuation/PseudoTime/AlgebraicEquationSetBase_PTC.h
[ 96%] Checking style of src/SolutionTrek/Continuation/PseudoTime/AlgebraicEquationSet_Block2x2_PTC.h
[ 96%] Checking style of src/SolutionTrek/Continuation/PseudoTime/AlgebraicEquationSet_Block3x3_PTC_IBL3D_panel.h
[ 96%] Checking style of src/SolutionTrek/Continuation/PseudoTime/AlgebraicEquationSet_Block4x4_PTC_FP_IBL3.h
[ 96%] Checking style of src/SolutionTrek/Continuation/PseudoTime/AlgebraicEquationSet_Block4x4_PTC_IBL.h
[ 96%] Checking style of src/SolutionTrek/Continuation/PseudoTime/AlgebraicEquationSet_PTC.h
[ 96%] Checking style of src/SolutionTrek/Continuation/PseudoTime/AlgebraicEquationSet_PTC_VMSD.h
[ 96%] Checking style of src/SolutionTrek/Continuation/PseudoTime/PseudoTime.h
[ 96%] Checking style of src/SolutionTrek/Continuation/PseudoTime/SetLocalTimeStep.h
[ 96%] Checking style of src/SolutionTrek/Continuation/PseudoTime/SetLocalTimeStep_VMSD.h
[ 96%] Checking style of src/SolutionTrek/Continuation/Continuation.cpp
[ 96%] Checking style of src/SolutionTrek/Continuation/Homotopy/Homotopy.cpp
[ 96%] Checking style of src/SolutionTrek/Continuation/ImplicitResidualSmoothing/ImplicitResidualSmoothing.cpp
[ 96%] Checking style of src/SolutionTrek/Continuation/PseudoTime/PseudoTime.cpp
[ 96%] Built target ContinuationLib_vera
[ 96%] Generating CXX unity source src/SolutionTrek/Continuation/cotire/ContinuationLib_CXX_unity.cxx
[ 96%] Generating CXX prefix source src/SolutionTrek/Continuation/cotire/ContinuationLib_CXX_prefix.cxx
[ 96%] Generating CXX prefix header src/SolutionTrek/Continuation/cotire/ContinuationLib_CXX_prefix.hxx
[ 96%] Building CXX precompiled header src/SolutionTrek/Continuation/cotire/ContinuationLib_CXX_prefix.hxx.gch
Scanning dependencies of target ContinuationLib
[ 96%] Building CXX object src/SolutionTrek/Continuation/CMakeFiles/ContinuationLib.dir/PseudoTime/PseudoTime.cpp.o
[ 96%] Building CXX object src/SolutionTrek/Continuation/CMakeFiles/ContinuationLib.dir/ImplicitResidualSmoothing/ImplicitResidualSmoothing.cpp.o
[ 96%] Building CXX object src/SolutionTrek/Continuation/CMakeFiles/ContinuationLib.dir/Homotopy/Homotopy.cpp.o
[ 96%] Building CXX object src/SolutionTrek/Continuation/CMakeFiles/ContinuationLib.dir/Continuation.cpp.o
[ 96%] Linking CXX static library libContinuationLib.a
[ 96%] Built target ContinuationLib
[ 96%] Building CXX object test/unit/SolutionTrek/Continuation/CMakeFiles/DissipationBased_btest_OBJECT.dir/DissipationBased_btest.cpp.o
[ 96%] Built target DissipationBased_btest_OBJECT
[ 96%] Checking style of test/unit/SolutionTrek/Continuation/DissipationBased_btest.cpp
[ 96%] Built target DissipationBased_btest_build_vera
[ 96%] Linking CXX executable DissipationBased_btest
[ 96%] Built target DissipationBased_btest_build
[ 96%] Building CXX object test/unit/SolutionTrek/Continuation/CMakeFiles/Homotopy_Euler_btest_OBJECT.dir/Homotopy_Euler_btest.cpp.o
In file included from /jenkins/workspace/SANS_Nightly/builddir/undefined_gnu9/buildnode/reynolds/test/unit/SolutionTrek/Continuation/Homotopy_Euler_btest.cpp:38:
/jenkins/workspace/SANS_Nightly/builddir/undefined_gnu9/buildnode/reynolds/src/pde/NS/PDEEulermitAVDiffusion2D.h:43:46: note: #pragma message: #undef USE_GRID_LAPLACIAN
   43 | #pragma message( "#undef USE_GRID_LAPLACIAN" )
      |                                              ^
In file included from /jenkins/workspace/SANS_Nightly/builddir/undefined_gnu9/buildnode/reynolds/src/pde/NS/BCEulermitAVSensor2D.h:15,
                 from /jenkins/workspace/SANS_Nightly/builddir/undefined_gnu9/buildnode/reynolds/test/unit/SolutionTrek/Continuation/Homotopy_Euler_btest.cpp:39:
/jenkins/workspace/SANS_Nightly/builddir/undefined_gnu9/buildnode/reynolds/src/pde/NS/PDEmitAVDiffusionOuter2D.h:43:46: note: #pragma message: #undef USE_GRID_LAPLACIAN
   43 | #pragma message( "#undef USE_GRID_LAPLACIAN" )
      |                                              ^
In file included from /jenkins/workspace/SANS_Nightly/builddir/undefined_gnu9/buildnode/reynolds/src/pde/NS/BCEulermitAVSensor2D.h:18,
                 from /jenkins/workspace/SANS_Nightly/builddir/undefined_gnu9/buildnode/reynolds/test/unit/SolutionTrek/Continuation/Homotopy_Euler_btest.cpp:39:
/jenkins/workspace/SANS_Nightly/builddir/undefined_gnu9/buildnode/reynolds/src/pde/ArtificialViscosity/BCmitAVSensor2D.h:32:46: note: #pragma message: #undef USE_GRID_LAPLACIAN
   32 | #pragma message( "#undef USE_GRID_LAPLACIAN" )
      |                                              ^
In file included from /jenkins/workspace/SANS_Nightly/builddir/undefined_gnu9/buildnode/reynolds/test/unit/SolutionTrek/Continuation/Homotopy_Euler_btest.cpp:42:
/jenkins/workspace/SANS_Nightly/builddir/undefined_gnu9/buildnode/reynolds/src/pde/ArtificialViscosity/AVSensor_ViscousFlux2D.h:30:46: note: #pragma message: #undef USE_GRID_LAPLACIAN
   30 | #pragma message( "#undef USE_GRID_LAPLACIAN" )
      |                                              ^
In file included from /jenkins/workspace/SANS_Nightly/builddir/undefined_gnu9/buildnode/reynolds/src/pde/ArtificialViscosity/AVSensor_Source2D.h:26,
                 from /jenkins/workspace/SANS_Nightly/builddir/undefined_gnu9/buildnode/reynolds/test/unit/SolutionTrek/Continuation/Homotopy_Euler_btest.cpp:43:
/jenkins/workspace/SANS_Nightly/builddir/undefined_gnu9/buildnode/reynolds/src/pde/ArtificialViscosity/PDEmitAVSensor2D.h:38:46: note: #pragma message: #undef USE_GRID_LAPLACIAN
   38 | #pragma message( "#undef USE_GRID_LAPLACIAN" )
      |                                              ^
In file included from /jenkins/workspace/SANS_Nightly/builddir/undefined_gnu9/buildnode/reynolds/test/unit/SolutionTrek/Continuation/Homotopy_Euler_btest.cpp:43:
/jenkins/workspace/SANS_Nightly/builddir/undefined_gnu9/buildnode/reynolds/src/pde/ArtificialViscosity/AVSensor_Source2D.h:38:46: note: #pragma message: #undef USE_GRID_LAPLACIAN
   38 | #pragma message( "#undef USE_GRID_LAPLACIAN" )
      |                                              ^
[ 96%] Built target Homotopy_Euler_btest_OBJECT
[ 96%] Checking style of test/unit/SolutionTrek/Continuation/Homotopy_Euler_btest.cpp
[ 96%] Built target Homotopy_Euler_btest_build_vera
[ 96%] Linking CXX executable Homotopy_Euler_btest
[ 96%] Built target Homotopy_Euler_btest_build
[ 96%] Building CXX object test/unit/SolutionTrek/Continuation/CMakeFiles/Homotopy_btest_OBJECT.dir/Homotopy_btest.cpp.o
[ 96%] Built target Homotopy_btest_OBJECT
[ 96%] Checking style of test/unit/SolutionTrek/Continuation/Homotopy_btest.cpp
[ 96%] Built target Homotopy_btest_build_vera
[ 96%] Linking CXX executable Homotopy_btest
[ 96%] Built target Homotopy_btest_build
[ 96%] Building CXX object test/unit/SolutionTrek/Continuation/CMakeFiles/ImplicitResidualSmoothing_btest_OBJECT.dir/ImplicitResidualSmoothing_btest.cpp.o
[ 96%] Built target ImplicitResidualSmoothing_btest_OBJECT
[ 96%] Checking style of test/unit/SolutionTrek/Continuation/ImplicitResidualSmoothing_btest.cpp
[ 96%] Built target ImplicitResidualSmoothing_btest_build_vera
[ 96%] Linking CXX executable ImplicitResidualSmoothing_btest
[ 96%] Built target ImplicitResidualSmoothing_btest_build
[ 96%] Building CXX object test/unit/SolutionTrek/Continuation/CMakeFiles/PDEHomotopy_btest_OBJECT.dir/PDEHomotopy_btest.cpp.o
[ 96%] Built target PDEHomotopy_btest_OBJECT
[ 96%] Checking style of test/unit/SolutionTrek/Continuation/PDEHomotopy_btest.cpp
[ 96%] Built target PDEHomotopy_btest_build_vera
[ 96%] Linking CXX executable PDEHomotopy_btest
[ 96%] Built target PDEHomotopy_btest_build
[ 96%] Building CXX object test/unit/SolutionTrek/Continuation/CMakeFiles/PDESourceOnly_btest_OBJECT.dir/PDESourceOnly_btest.cpp.o
In file included from /usr/include/boost/config/header_deprecated.hpp:18,
                 from /usr/include/boost/test/output_test_stream.hpp:13,
                 from /jenkins/workspace/SANS_Nightly/builddir/undefined_gnu9/buildnode/reynolds/test/SANS_prefix_btest.h:51,
                 from /jenkins/workspace/SANS_Nightly/builddir/undefined_gnu9/buildnode/reynolds/build/undefined_gnu9/test/cotire/SANS_PREFIX_BTEST_CXX_prefix.cxx:4,
                 from /jenkins/workspace/SANS_Nightly/builddir/undefined_gnu9/buildnode/reynolds/build/undefined_gnu9/test/cotire/SANS_PREFIX_BTEST_CXX_prefix.hxx:4:
/usr/include/boost/test/output_test_stream.hpp:14:1: note: #pragma message: This header is deprecated. Use This header is deprecated. Please use <boost/test/tools/output_test_stream.hpp> instead. instead.
   14 | BOOST_HEADER_DEPRECATED( "This header is deprecated. Please use <boost/test/tools/output_test_stream.hpp> instead." )
      | ^~~~~~~~~~~~~~~~~~~~~~~
In file included from /jenkins/workspace/SANS_Nightly/builddir/undefined_gnu9/buildnode/reynolds/test/unit/SolutionTrek/Continuation/PDESourceOnly_btest.cpp:30:
/jenkins/workspace/SANS_Nightly/builddir/undefined_gnu9/buildnode/reynolds/src/pde/NS/PDEEulermitAVDiffusion2D.h:43:46: note: #pragma message: #undef USE_GRID_LAPLACIAN
   43 | #pragma message( "#undef USE_GRID_LAPLACIAN" )
      |                                              ^
In file included from /jenkins/workspace/SANS_Nightly/builddir/undefined_gnu9/buildnode/reynolds/test/unit/SolutionTrek/Continuation/PDESourceOnly_btest.cpp:37:
/jenkins/workspace/SANS_Nightly/builddir/undefined_gnu9/buildnode/reynolds/src/pde/NS/PDEEulermitAVDiffusion3D.h:43:46: note: #pragma message: #undef USE_GRID_LAPLACIAN
   43 | #pragma message( "#undef USE_GRID_LAPLACIAN" )
      |                                              ^
In file included from /jenkins/workspace/SANS_Nightly/builddir/undefined_gnu9/buildnode/reynolds/test/unit/SolutionTrek/Continuation/PDESourceOnly_btest.cpp:44:
/jenkins/workspace/SANS_Nightly/builddir/undefined_gnu9/buildnode/reynolds/src/pde/ArtificialViscosity/AVSensor_ViscousFlux2D.h:30:46: note: #pragma message: #undef USE_GRID_LAPLACIAN
   30 | #pragma message( "#undef USE_GRID_LAPLACIAN" )
      |                                              ^
In file included from /jenkins/workspace/SANS_Nightly/builddir/undefined_gnu9/buildnode/reynolds/src/pde/ArtificialViscosity/AVSensor_Source2D.h:26,
                 from /jenkins/workspace/SANS_Nightly/builddir/undefined_gnu9/buildnode/reynolds/test/unit/SolutionTrek/Continuation/PDESourceOnly_btest.cpp:45:
/jenkins/workspace/SANS_Nightly/builddir/undefined_gnu9/buildnode/reynolds/src/pde/ArtificialViscosity/PDEmitAVSensor2D.h:38:46: note: #pragma message: #undef USE_GRID_LAPLACIAN
   38 | #pragma message( "#undef USE_GRID_LAPLACIAN" )
      |                                              ^
In file included from /jenkins/workspace/SANS_Nightly/builddir/undefined_gnu9/buildnode/reynolds/test/unit/SolutionTrek/Continuation/PDESourceOnly_btest.cpp:45:
/jenkins/workspace/SANS_Nightly/builddir/undefined_gnu9/buildnode/reynolds/src/pde/ArtificialViscosity/AVSensor_Source2D.h:38:46: note: #pragma message: #undef USE_GRID_LAPLACIAN
   38 | #pragma message( "#undef USE_GRID_LAPLACIAN" )
      |                                              ^
In file included from /jenkins/workspace/SANS_Nightly/builddir/undefined_gnu9/buildnode/reynolds/test/unit/SolutionTrek/Continuation/PDESourceOnly_btest.cpp:49:
/jenkins/workspace/SANS_Nightly/builddir/undefined_gnu9/buildnode/reynolds/src/pde/ArtificialViscosity/AVSensor_ViscousFlux3D.h:30:46: note: #pragma message: #undef USE_GRID_LAPLACIAN
   30 | #pragma message( "#undef USE_GRID_LAPLACIAN" )
      |                                              ^
In file included from /jenkins/workspace/SANS_Nightly/builddir/undefined_gnu9/buildnode/reynolds/test/unit/SolutionTrek/Continuation/PDESourceOnly_btest.cpp:50:
/jenkins/workspace/SANS_Nightly/builddir/undefined_gnu9/buildnode/reynolds/src/pde/ArtificialViscosity/AVSensor_Source3D.h:37:46: note: #pragma message: #undef USE_GRID_LAPLACIAN
   37 | #pragma message( "#undef USE_GRID_LAPLACIAN" )
      |                                              ^
In file included from /jenkins/workspace/SANS_Nightly/builddir/undefined_gnu9/buildnode/reynolds/test/unit/SolutionTrek/Continuation/PDESourceOnly_btest.cpp:51:
/jenkins/workspace/SANS_Nightly/builddir/undefined_gnu9/buildnode/reynolds/src/pde/ArtificialViscosity/PDEmitAVSensor3D.h:38:46: note: #pragma message: #undef USE_GRID_LAPLACIAN
   38 | #pragma message( "#undef USE_GRID_LAPLACIAN" )
      |                                              ^
[ 96%] Built target PDESourceOnly_btest_OBJECT
[ 96%] Checking style of test/unit/SolutionTrek/Continuation/PDESourceOnly_btest.cpp
[ 96%] Built target PDESourceOnly_btest_build_vera
[ 96%] Linking CXX executable PDESourceOnly_btest
[ 96%] Built target PDESourceOnly_btest_build
[ 96%] Building CXX object test/unit/SolutionTrek/Continuation/CMakeFiles/PseudoTime_btest_OBJECT.dir/PseudoTime_btest.cpp.o
[ 96%] Built target PseudoTime_btest_OBJECT
[ 96%] Checking style of test/unit/SolutionTrek/Continuation/PseudoTime_btest.cpp
[ 96%] Built target PseudoTime_btest_build_vera
[ 96%] Linking CXX executable PseudoTime_btest
/usr/bin/ld.gold: fatal error: PseudoTime_btest: No space left on device
collect2: error: ld returned 1 exit status
make[3]: *** [test/unit/SolutionTrek/Continuation/CMakeFiles/PseudoTime_btest_build.dir/build.make:182: test/unit/SolutionTrek/Continuation/PseudoTime_btest] Error 1
make[2]: *** [CMakeFiles/Makefile2:122784: test/unit/SolutionTrek/Continuation/CMakeFiles/PseudoTime_btest_build.dir/all] Error 2
make[1]: *** [CMakeFiles/Makefile2:16417: test/unit/CMakeFiles/check_unit.dir/rule] Error 2
make: *** [Makefile:3195: check_unit] Error 2

real	675m6.232s
user	645m32.633s
sys	24m3.653s
+ status=1
++ find /jenkins/workspace/SANS_Nightly/builddir/undefined_gnu9/buildnode/reynolds/build/undefined_gnu9 -name Test.xml
+ mv /jenkins/workspace/SANS_Nightly/builddir/undefined_gnu9/buildnode/reynolds/build/Test_unit_memcheck.xml
mv: missing destination file operand after '/jenkins/workspace/SANS_Nightly/builddir/undefined_gnu9/buildnode/reynolds/build/Test_unit_memcheck.xml'
Try 'mv --help' for more information.
Build step 'Execute shell' marked build as failure
[GNU C Compiler (gcc)ClangIntel Compiler (C, Fortran)Vera++] Skipping execution of recorder since overall result is 'FAILURE'
[Valgrind] Files to copy:
[Valgrind] Analysing valgrind results
[Valgrind] Ending the valgrind analysis.
INFO: Processing BoostTest-1.x (default)
INFO: [BoostTest-1.x (default)] - No test report file(s) were found with the pattern 'build/boosttest/*.xml' relative to '/jenkins/workspace/SANS_Nightly/builddir/undefined_gnu9/buildnode/reynolds' for the testing framework 'BoostTest-1.x (default)'.
Did you enter a pattern relative to (and within) the workspace directory?
Did you generate the result report(s) for 'BoostTest-1.x (default)'?"
WARNING: All test reports are empty.
INFO: Check 'Failed Tests' threshold.
INFO: Check 'Skipped Tests' threshold.
INFO: Setting the build status to SUCCESS
[PostBuildScript] - [INFO] Executing post build scripts.
[PostBuildScript] - [INFO] Node does not have the role MASTER. Did not execute build step #0.
[PostBuildScript] - [INFO] Node does not have the role MASTER. Did not execute build step #1.
[WS-CLEANUP] Deleting project workspace...
[WS-CLEANUP] Deferred wipeout is used...
[WS-CLEANUP] done
Finished: FAILURE