Console Output

Skipping 1,337 KB.. Full Log
        Start 365: ElementSpacetime_Pentatope_btest
365/914 Test #365: ElementSpacetime_Pentatope_btest .................................................................   Passed    4.49 sec
        Start 366: ElementTuple_btest
366/914 Test #366: ElementTuple_btest ...............................................................................   Passed    1.29 sec
        Start 367: ElementVolume_Hexahedron_Cache_Hierarchical_btest
367/914 Test #367: ElementVolume_Hexahedron_Cache_Hierarchical_btest ................................................   Passed    7.27 sec
        Start 368: ElementVolume_Hexahedron_Cache_Lagrange_btest
368/914 Test #368: ElementVolume_Hexahedron_Cache_Lagrange_btest ....................................................   Passed  143.13 sec
        Start 369: ElementVolume_Hexahedron_Cache_Legendre_btest
369/914 Test #369: ElementVolume_Hexahedron_Cache_Legendre_btest ....................................................   Passed   67.12 sec
        Start 370: ElementVolume_Hexahedron_btest
370/914 Test #370: ElementVolume_Hexahedron_btest ...................................................................   Passed    1.20 sec
        Start 371: ElementVolume_Tetrahedron_btest
371/914 Test #371: ElementVolume_Tetrahedron_btest ..................................................................   Passed   17.36 sec
        Start 372: ElementXFieldAreaBase_Quad_btest
372/914 Test #372: ElementXFieldAreaBase_Quad_btest .................................................................   Passed    1.33 sec
        Start 373: ElementXFieldAreaBase_Triangle_btest
373/914 Test #373: ElementXFieldAreaBase_Triangle_btest .............................................................   Passed    1.28 sec
        Start 374: ElementXFieldArea_2D_Quad_btest
374/914 Test #374: ElementXFieldArea_2D_Quad_btest ..................................................................   Passed    1.30 sec
        Start 375: ElementXFieldArea_2D_Triangle_btest
375/914 Test #375: ElementXFieldArea_2D_Triangle_btest ..............................................................   Passed    1.29 sec
        Start 376: ElementXFieldArea_3D_Quad_btest
376/914 Test #376: ElementXFieldArea_3D_Quad_btest ..................................................................   Passed    1.24 sec
        Start 377: ElementXFieldArea_3D_Triangle_btest
377/914 Test #377: ElementXFieldArea_3D_Triangle_btest ..............................................................   Passed    1.26 sec
        Start 378: ElementXFieldLineBase_btest
378/914 Test #378: ElementXFieldLineBase_btest ......................................................................   Passed    1.23 sec
        Start 379: ElementXFieldLine_1D_btest
379/914 Test #379: ElementXFieldLine_1D_btest .......................................................................   Passed    1.26 sec
        Start 380: ElementXFieldLine_2D_btest
380/914 Test #380: ElementXFieldLine_2D_btest .......................................................................   Passed    1.27 sec
        Start 381: ElementXFieldSpacetime_Pentatope_btest
381/914 Test #381: ElementXFieldSpacetime_Pentatope_btest ...........................................................   Passed    1.36 sec
        Start 382: ElementXFieldVolume_4D_Tetrahedron_btest
382/914 Test #382: ElementXFieldVolume_4D_Tetrahedron_btest .........................................................   Passed    1.33 sec
        Start 383: ElementXFieldVolume_Hexahedron_btest
383/914 Test #383: ElementXFieldVolume_Hexahedron_btest .............................................................   Passed    1.30 sec
        Start 384: ElementXFieldVolume_Tetrahedron_btest
384/914 Test #384: ElementXFieldVolume_Tetrahedron_btest ............................................................   Passed    1.27 sec
        Start 385: RefCoordSolver_btest
385/914 Test #385: RefCoordSolver_btest .............................................................................   Passed    1.27 sec
        Start 386: ReferenceElementMesh_btest
386/914 Test #386: ReferenceElementMesh_btest .......................................................................   Passed    1.41 sec
        Start 387: UniqueElem_btest
387/914 Test #387: UniqueElem_btest .................................................................................   Passed    1.26 sec
        Start 388: Field1D_LocalPatch_Edge_CG_btest
388/914 Test #388: Field1D_LocalPatch_Edge_CG_btest .................................................................   Passed    1.31 sec
        Start 389: Field1D_LocalPatch_Element_DG_btest
389/914 Test #389: Field1D_LocalPatch_Element_DG_btest ..............................................................   Passed    1.32 sec
        Start 390: Field2D_LocalPatch_Edge_CG_btest
390/914 Test #390: Field2D_LocalPatch_Edge_CG_btest .................................................................   Passed    3.31 sec
        Start 391: Field2D_LocalPatch_Element_DG_btest
391/914 Test #391: Field2D_LocalPatch_Element_DG_btest ..............................................................   Passed    1.43 sec
        Start 392: Field3D_LocalPatch_Edge_CG_btest
392/914 Test #392: Field3D_LocalPatch_Edge_CG_btest .................................................................   Passed    9.61 sec
        Start 393: Field3D_LocalPatch_Element_DG_btest
393/914 Test #393: Field3D_LocalPatch_Element_DG_btest ..............................................................   Passed   18.20 sec
        Start 394: Field4D_LocalPatch_Edge_CG_btest
394/914 Test #394: Field4D_LocalPatch_Edge_CG_btest .................................................................   Passed    4.05 sec
        Start 395: Field4D_LocalPatch_Element_DG_btest
395/914 Test #395: Field4D_LocalPatch_Element_DG_btest ..............................................................   Passed   11.44 sec
        Start 396: XField1D_LocalPatch_Edge_CG_btest
396/914 Test #396: XField1D_LocalPatch_Edge_CG_btest ................................................................   Passed    1.23 sec
        Start 397: XField1D_LocalPatch_Element_CG_btest
397/914 Test #397: XField1D_LocalPatch_Element_CG_btest .............................................................   Passed    1.19 sec
        Start 398: XField1D_LocalPatch_Element_DG_btest
398/914 Test #398: XField1D_LocalPatch_Element_DG_btest .............................................................   Passed    1.20 sec
        Start 399: XField2D_LocalPatch_Edge_CG_btest
399/914 Test #399: XField2D_LocalPatch_Edge_CG_btest ................................................................   Passed    1.26 sec
        Start 400: XField2D_LocalPatch_Element_CG_btest
400/914 Test #400: XField2D_LocalPatch_Element_CG_btest .............................................................   Passed    1.24 sec
        Start 401: XField2D_LocalPatch_Element_DG_btest
401/914 Test #401: XField2D_LocalPatch_Element_DG_btest .............................................................   Passed    1.55 sec
        Start 402: XField3D_LocalPatch_Edge_CG_btest
402/914 Test #402: XField3D_LocalPatch_Edge_CG_btest ................................................................   Passed    2.49 sec
        Start 403: XField3D_LocalPatch_Element_CG_btest
403/914 Test #403: XField3D_LocalPatch_Element_CG_btest .............................................................   Passed    4.37 sec
        Start 404: XField3D_LocalPatch_Element_DG_btest
404/914 Test #404: XField3D_LocalPatch_Element_DG_btest .............................................................   Passed    2.22 sec
        Start 405: XField4D_LocalPatch_Element_CG_btest
405/914 Test #405: XField4D_LocalPatch_Element_CG_btest .............................................................   Passed    2.80 sec
        Start 406: XField4D_LocalPatch_Element_DG_btest
406/914 Test #406: XField4D_LocalPatch_Element_DG_btest .............................................................   Passed    1.74 sec
        Start 407: XField_LocalPatch_HighOrderTet_btest
407/914 Test #407: XField_LocalPatch_HighOrderTet_btest .............................................................   Passed   10.12 sec
        Start 408: XField_LocalPatch_HighOrderTriangle_btest
408/914 Test #408: XField_LocalPatch_HighOrderTriangle_btest ........................................................   Passed    2.20 sec
        Start 409: XField_LocalPatch_Line_btest
409/914 Test #409: XField_LocalPatch_Line_btest .....................................................................   Passed    1.18 sec
        Start 410: XField_LocalPatch_Pentatope_btest
410/914 Test #410: XField_LocalPatch_Pentatope_btest ................................................................   Passed   10.06 sec
        Start 411: XField_LocalPatch_Simplex_forCG_btest
411/914 Test #411: XField_LocalPatch_Simplex_forCG_btest ............................................................   Passed    3.37 sec
        Start 412: XField_LocalPatch_Simplex_forDG_btest
412/914 Test #412: XField_LocalPatch_Simplex_forDG_btest ............................................................   Passed    3.29 sec
        Start 413: XField_LocalPatch_Tet_btest
413/914 Test #413: XField_LocalPatch_Tet_btest ......................................................................   Passed    7.05 sec
        Start 414: XField_LocalPatch_Triangle_btest
414/914 Test #414: XField_LocalPatch_Triangle_btest .................................................................   Passed    1.36 sec
        Start 415: MatrixBlock_2x2_Decompose_LUP_btest
415/914 Test #415: MatrixBlock_2x2_Decompose_LUP_btest ..............................................................   Passed    1.20 sec
        Start 416: MatrixBlock_2x2_Decompose_LU_btest
416/914 Test #416: MatrixBlock_2x2_Decompose_LU_btest ...............................................................   Passed    1.19 sec
        Start 417: MatrixBlock_2x2_DenseMatrix_btest
417/914 Test #417: MatrixBlock_2x2_DenseMatrix_btest ................................................................   Passed    1.24 sec
        Start 418: MatrixBlock_2x2_InverseLUP_btest
418/914 Test #418: MatrixBlock_2x2_InverseLUP_btest .................................................................   Passed    1.21 sec
        Start 419: MatrixBlock_2x2_InverseLU_btest
419/914 Test #419: MatrixBlock_2x2_InverseLU_btest ..................................................................   Passed    1.20 sec
        Start 420: MatrixBlock_2x2_SparseMatrix_CRS_btest
420/914 Test #420: MatrixBlock_2x2_SparseMatrix_CRS_btest ...........................................................   Passed    1.19 sec
        Start 421: MatrixBlock_2x2_Transpose_btest
421/914 Test #421: MatrixBlock_2x2_Transpose_btest ..................................................................   Passed    1.18 sec
        Start 422: MatrixBlock_3x3_DenseMatrix_btest
422/914 Test #422: MatrixBlock_3x3_DenseMatrix_btest ................................................................   Passed    1.18 sec
        Start 423: MatrixBlock_3x3_SparseMatrix_CRS_btest
423/914 Test #423: MatrixBlock_3x3_SparseMatrix_CRS_btest ...........................................................   Passed    1.22 sec
        Start 424: MatrixBlock_4x4_SparseMatrix_CRS_btest
424/914 Test #424: MatrixBlock_4x4_SparseMatrix_CRS_btest ...........................................................   Passed    1.21 sec
        Start 425: VectorBlock_2_DenseVector_btest
425/914 Test #425: VectorBlock_2_DenseVector_btest ..................................................................   Passed    1.22 sec
        Start 426: VectorBlock_2_SparseVector_btest
426/914 Test #426: VectorBlock_2_SparseVector_btest .................................................................   Passed    1.24 sec
        Start 427: VectorBlock_3_DenseVector_btest
427/914 Test #427: VectorBlock_3_DenseVector_btest ..................................................................   Passed    1.19 sec
        Start 428: VectorBlock_4_btest
428/914 Test #428: VectorBlock_4_btest ..............................................................................   Passed    1.19 sec
        Start 429: DenseLinAlg_MatrixUtil_btest
429/914 Test #429: DenseLinAlg_MatrixUtil_btest .....................................................................   Passed    1.18 sec
        Start 430: MatrixDView_btest
430/914 Test #430: MatrixDView_btest ................................................................................   Passed    1.19 sec
        Start 431: MatrixD_Array_btest
431/914 Test #431: MatrixD_Array_btest ..............................................................................   Passed    1.18 sec
        Start 432: MatrixD_BlockView_btest
432/914 Test #432: MatrixD_BlockView_btest ..........................................................................   Passed    1.17 sec
        Start 433: MatrixD_Decompose_LUP_btest
433/914 Test #433: MatrixD_Decompose_LUP_btest ......................................................................   Passed    1.18 sec
        Start 434: MatrixD_Decompose_LU_btest
434/914 Test #434: MatrixD_Decompose_LU_btest .......................................................................   Passed    1.18 sec
        Start 435: MatrixD_Det_btest
435/914 Test #435: MatrixD_Det_btest ................................................................................   Passed    1.21 sec
        Start 436: MatrixD_Diag_btest
436/914 Test #436: MatrixD_Diag_btest ...............................................................................   Passed    1.19 sec
        Start 437: MatrixD_InverseLUP_btest
437/914 Test #437: MatrixD_InverseLUP_btest .........................................................................   Passed    1.22 sec
        Start 438: MatrixD_InverseLU_btest
438/914 Test #438: MatrixD_InverseLU_btest ..........................................................................   Passed    1.23 sec
        Start 439: MatrixD_InverseQR_btest
439/914 Test #439: MatrixD_InverseQR_btest ..........................................................................   Passed    1.22 sec
        Start 440: MatrixD_LAPACK_btest
440/914 Test #440: MatrixD_LAPACK_btest .............................................................................   Passed    1.19 sec
        Start 441: MatrixD_Mul_Native_btest
441/914 Test #441: MatrixD_Mul_Native_btest .........................................................................   Passed    1.19 sec
        Start 442: MatrixD_NonZeroPattern_btest
442/914 Test #442: MatrixD_NonZeroPattern_btest .....................................................................   Passed    1.22 sec
        Start 443: MatrixD_Transpose_btest
443/914 Test #443: MatrixD_Transpose_btest ..........................................................................   Passed    1.20 sec
        Start 444: MatrixD_Tuple_btest
444/914 Test #444: MatrixD_Tuple_btest ..............................................................................   Passed    1.31 sec
        Start 445: MatrixD_btest
445/914 Test #445: MatrixD_btest ....................................................................................   Passed    1.19 sec
        Start 446: MatrixD_of_MatrixS_btest
446/914 Test #446: MatrixD_of_MatrixS_btest .........................................................................   Passed    1.22 sec
        Start 447: MatrixS_Decompose_LUP_btest
447/914 Test #447: MatrixS_Decompose_LUP_btest ......................................................................   Passed    1.19 sec
        Start 448: MatrixS_Decompose_LU_btest
448/914 Test #448: MatrixS_Decompose_LU_btest .......................................................................   Passed    1.18 sec
        Start 449: MatrixS_Decompose_QR_btest
449/914 Test #449: MatrixS_Decompose_QR_btest .......................................................................   Passed    1.20 sec
        Start 450: MatrixS_Det_btest
450/914 Test #450: MatrixS_Det_btest ................................................................................   Passed    1.21 sec
        Start 451: MatrixS_Diag_btest
451/914 Test #451: MatrixS_Diag_btest ...............................................................................   Passed    1.19 sec
        Start 452: MatrixS_FrobNorm_btest
452/914 Test #452: MatrixS_FrobNorm_btest ...........................................................................   Passed    1.19 sec
        Start 453: MatrixS_InverseLUP_btest
453/914 Test #453: MatrixS_InverseLUP_btest .........................................................................   Passed    1.21 sec
        Start 454: MatrixS_InverseLU_btest
454/914 Test #454: MatrixS_InverseLU_btest ..........................................................................   Passed    1.24 sec
        Start 455: MatrixS_InverseQR_btest
455/914 Test #455: MatrixS_InverseQR_btest ..........................................................................   Passed    1.20 sec
        Start 456: MatrixS_LpNorm_btest
456/914 Test #456: MatrixS_LpNorm_btest .............................................................................   Passed    1.18 sec
        Start 457: MatrixS_MatrixUtil_btest
457/914 Test #457: MatrixS_MatrixUtil_btest .........................................................................   Passed    1.19 sec
        Start 458: MatrixS_Mul_Native_btest
458/914 Test #458: MatrixS_Mul_Native_btest .........................................................................   Passed    1.21 sec
        Start 459: MatrixS_SVD_btest
459/914 Test #459: MatrixS_SVD_btest ................................................................................   Passed    1.18 sec
        Start 460: MatrixS_SurrealD_btest
460/914 Test #460: MatrixS_SurrealD_btest ...........................................................................   Passed    1.18 sec
        Start 461: MatrixS_SurrealS_btest
461/914 Test #461: MatrixS_SurrealS_btest ...........................................................................   Passed    1.21 sec
        Start 462: MatrixS_Trace_btest
462/914 Test #462: MatrixS_Trace_btest ..............................................................................   Passed    1.21 sec
        Start 463: MatrixS_Transpose_btest
463/914 Test #463: MatrixS_Transpose_btest ..........................................................................   Passed    1.21 sec
        Start 464: MatrixS_btest
464/914 Test #464: MatrixS_btest ....................................................................................   Passed    1.22 sec
        Start 465: MatrixS_of_MatrixS_btest
465/914 Test #465: MatrixS_of_MatrixS_btest .........................................................................   Passed    1.19 sec
        Start 466: MatrixSymS_Decompose_Cholesky_btest
466/914 Test #466: MatrixSymS_Decompose_Cholesky_btest ..............................................................   Passed    1.18 sec
        Start 467: MatrixSymS_Decompose_LDLT_btest
467/914 Test #467: MatrixSymS_Decompose_LDLT_btest ..................................................................   Passed    1.18 sec
        Start 468: MatrixSymS_Eigen_btest
468/914 Test #468: MatrixSymS_Eigen_btest ...........................................................................   Passed    1.19 sec
        Start 469: MatrixSymS_Exp_btest
469/914 Test #469: MatrixSymS_Exp_btest .............................................................................   Passed    1.19 sec
        Start 470: MatrixSymS_InverseCholesky_btest
470/914 Test #470: MatrixSymS_InverseCholesky_btest .................................................................   Passed    1.21 sec
        Start 471: MatrixSymS_InverseLDLT_btest
471/914 Test #471: MatrixSymS_InverseLDLT_btest .....................................................................   Passed    1.21 sec
        Start 472: MatrixSymS_Log_btest
472/914 Test #472: MatrixSymS_Log_btest .............................................................................   Passed    1.22 sec
        Start 473: MatrixSymS_Pow_btest
473/914 Test #473: MatrixSymS_Pow_btest .............................................................................   Passed    1.18 sec
        Start 474: MatrixSymS_SurrealS_btest
474/914 Test #474: MatrixSymS_SurrealS_btest ........................................................................   Passed    1.19 sec
        Start 475: MatrixSymS_btest
475/914 Test #475: MatrixSymS_btest .................................................................................   Passed    1.20 sec
        Start 476: VectorD_DenseVectorSize_btest
476/914 Test #476: VectorD_DenseVectorSize_btest ....................................................................   Passed    1.19 sec
        Start 477: VectorD_btest
477/914 Test #477: VectorD_btest ....................................................................................   Passed    1.21 sec
        Start 478: VectorD_dot_btest
478/914 Test #478: VectorD_dot_btest ................................................................................   Passed    1.19 sec
        Start 479: VectorD_norm_btest
479/914 Test #479: VectorD_norm_btest ...............................................................................   Passed    1.21 sec
        Start 480: VectorS_InnerProduct_btest
480/914 Test #480: VectorS_InnerProduct_btest .......................................................................   Passed    1.21 sec
        Start 481: VectorS_OuterProduct_btest
481/914 Test #481: VectorS_OuterProduct_btest .......................................................................   Passed    1.18 sec
        Start 482: VectorS_SurrealD_btest
482/914 Test #482: VectorS_SurrealD_btest ...........................................................................   Passed    1.19 sec
        Start 483: VectorS_SurrealD_deriv_btest
483/914 Test #483: VectorS_SurrealD_deriv_btest .....................................................................   Passed    1.18 sec
        Start 484: VectorS_SurrealS_btest
484/914 Test #484: VectorS_SurrealS_btest ...........................................................................   Passed    1.20 sec
        Start 485: VectorS_SurrealS_deriv_btest
485/914 Test #485: VectorS_SurrealS_deriv_btest .....................................................................   Passed    1.21 sec
        Start 486: VectorS_btest
486/914 Test #486: VectorS_btest ....................................................................................   Passed    1.20 sec
        Start 487: VectorS_cross_btest
487/914 Test #487: VectorS_cross_btest ..............................................................................   Passed    1.17 sec
        Start 488: VectorS_dot_btest
488/914 Test #488: VectorS_dot_btest ................................................................................   Passed    1.18 sec
        Start 489: VectorS_norm_btest
489/914 Test #489: VectorS_norm_btest ...............................................................................   Passed    1.18 sec
        Start 490: FGMRES_btest
490/914 Test #490: FGMRES_btest .....................................................................................   Passed    1.23 sec
        Start 491: ILU0_btest
491/914 Test #491: ILU0_btest .......................................................................................   Passed    1.21 sec
        Start 492: LU_SGS_btest
492/914 Test #492: LU_SGS_btest .....................................................................................   Passed    1.19 sec
        Start 493: LinearSolver_btest
493/914 Test #493: LinearSolver_btest ...............................................................................   Passed    1.23 sec
        Start 494: MatrixD_SparseMatrix_CRS_MatrixD_MatrixS_btest
494/914 Test #494: MatrixD_SparseMatrix_CRS_MatrixD_MatrixS_btest ...................................................   Passed    1.19 sec
        Start 495: MatrixD_SparseMatrix_CRS_MatrixD_btest
495/914 Test #495: MatrixD_SparseMatrix_CRS_MatrixD_btest ...........................................................   Passed    1.18 sec
        Start 496: MatrixD_SparseMatrix_CRS_MatrixS_btest
496/914 Test #496: MatrixD_SparseMatrix_CRS_MatrixS_btest ...........................................................   Passed    1.22 sec
        Start 497: MatrixD_SparseMatrix_CRS_Real_btest
497/914 Test #497: MatrixD_SparseMatrix_CRS_Real_btest ..............................................................   Passed    1.20 sec
        Start 498: SparseMatrix_CRS_MatrixD_MatrixS_btest
498/914 Test #498: SparseMatrix_CRS_MatrixD_MatrixS_btest ...........................................................   Passed    1.18 sec
        Start 499: SparseMatrix_CRS_MatrixD_btest
499/914 Test #499: SparseMatrix_CRS_MatrixD_btest ...................................................................   Passed    1.18 sec
        Start 500: SparseMatrix_CRS_MatrixS_btest
500/914 Test #500: SparseMatrix_CRS_MatrixS_btest ...................................................................   Passed    1.22 sec
        Start 501: SparseMatrix_CRS_Real_btest
501/914 Test #501: SparseMatrix_CRS_Real_btest ......................................................................   Passed    1.20 sec
        Start 502: SparseMatrix_Diag_btest
502/914 Test #502: SparseMatrix_Diag_btest ..........................................................................   Passed    1.18 sec
        Start 503: SparseVector_Real_btest
503/914 Test #503: SparseVector_Real_btest ..........................................................................   Passed    1.19 sec
        Start 504: SparseVector_VectorD_VectorS_btest
504/914 Test #504: SparseVector_VectorD_VectorS_btest ...............................................................   Passed    1.18 sec
        Start 505: SparseVector_VectorD_btest
505/914 Test #505: SparseVector_VectorD_btest .......................................................................   Passed    1.19 sec
        Start 506: SparseVector_VectorS_btest
506/914 Test #506: SparseVector_VectorS_btest .......................................................................   Passed    1.18 sec
        Start 507: UMFPACK_btest
507/914 Test #507: UMFPACK_btest ....................................................................................   Passed    1.25 sec
        Start 508: VectorD_SparseVector_Real_btest
508/914 Test #508: VectorD_SparseVector_Real_btest ..................................................................   Passed    1.18 sec
        Start 509: VectorD_SparseVector_VectorD_btest
509/914 Test #509: VectorD_SparseVector_VectorD_btest ...............................................................   Passed    1.21 sec
        Start 510: VectorD_SparseVector_VectorS_btest
510/914 Test #510: VectorD_SparseVector_VectorS_btest ...............................................................   Passed    1.19 sec
        Start 511: PETSc_LinearSolver_btest
511/914 Test #511: PETSc_LinearSolver_btest .........................................................................   Passed    1.20 sec
        Start 512: PETSc_MDF_Ordering_btest
512/914 Test #512: PETSc_MDF_Ordering_btest .........................................................................   Passed    1.21 sec
        Start 513: PETSc_btest
513/914 Test #513: PETSc_btest ......................................................................................   Passed    1.21 sec
        Start 514: AFLR2_btest
514/914 Test #514: AFLR2_btest ......................................................................................   Passed    1.24 sec
        Start 515: AFLR3_btest
515/914 Test #515: AFLR3_btest ......................................................................................   Passed    6.71 sec
        Start 516: MetricAnalytical_btest
516/914 Test #516: MetricAnalytical_btest ...........................................................................   Passed    1.23 sec
        Start 517: MesherInterface_avro_btest
517/914 Test #517: MesherInterface_avro_btest .......................................................................   Passed   16.11 sec
        Start 518: XField3D_Wake_avro_btest
518/914 Test #518: XField3D_Wake_avro_btest .........................................................................   Passed    1.18 sec
        Start 519: XField_avro_btest
519/914 Test #519: XField_avro_btest ................................................................................   Passed    1.91 sec
        Start 520: CamberBlade_btest
520/914 Test #520: CamberBlade_btest ................................................................................   Passed    5.79 sec
        Start 521: CubicCamber_btest
521/914 Test #521: CubicCamber_btest ................................................................................   Passed    1.22 sec
        Start 522: EGApproximate_btest
522/914 Test #522: EGApproximate_btest ..............................................................................   Passed    1.23 sec
        Start 523: EGBody_btest
523/914 Test #523: EGBody_btest .....................................................................................   Passed    1.19 sec
        Start 524: EGContext_btest
524/914 Test #524: EGContext_btest ..................................................................................   Passed    1.19 sec
        Start 525: EGEdge_btest
525/914 Test #525: EGEdge_btest .....................................................................................   Passed    1.19 sec
        Start 526: EGFace_btest
526/914 Test #526: EGFace_btest .....................................................................................   Passed    1.22 sec
        Start 527: EGLine_btest
527/914 Test #527: EGLine_btest .....................................................................................   Passed    1.18 sec
        Start 528: EGLoop_btest
528/914 Test #528: EGLoop_btest .....................................................................................   Passed    1.19 sec
        Start 529: EGModel_btest
529/914 Test #529: EGModel_btest ....................................................................................   Passed    1.18 sec
        Start 530: EGNode_btest
530/914 Test #530: EGNode_btest .....................................................................................   Passed    1.18 sec
        Start 531: EGObject_btest
531/914 Test #531: EGObject_btest ...................................................................................   Passed    1.18 sec
        Start 532: Generated_btest
532/914 Test #532: Generated_btest ..................................................................................   Passed    1.19 sec
        Start 533: QuadCamber_btest
533/914 Test #533: QuadCamber_btest .................................................................................   Passed    1.19 sec
        Start 534: ThicknessNACA6_btest
534/914 Test #534: ThicknessNACA6_btest .............................................................................   Passed    1.19 sec
        Start 535: transform_btest
535/914 Test #535: transform_btest ..................................................................................   Passed    1.19 sec
        Start 536: EGTessEdge_btest
536/914 Test #536: EGTessEdge_btest .................................................................................   Passed    1.18 sec
        Start 537: EGTessModel_btest
537/914 Test #537: EGTessModel_btest ................................................................................   Passed    1.34 sec
        Start 538: EGTessellation_btest
538/914 Test #538: EGTessellation_btest .............................................................................   Passed    1.25 sec
        Start 539: MesherInterface_Embedding_btest
539/914 Test #539: MesherInterface_Embedding_btest ..................................................................   Passed    1.21 sec
        Start 540: MesherInterface_Epic_btest
540/914 Test #540: MesherInterface_Epic_btest .......................................................................   Passed    1.41 sec
        Start 541: WriteMeshMetric_Epic_btest
541/914 Test #541: WriteMeshMetric_Epic_btest .......................................................................   Passed    1.30 sec
        Start 542: WriteSolution_PX_btest
542/914 Test #542: WriteSolution_PX_btest ...........................................................................   Passed    1.33 sec
        Start 543: XField_PX_btest
543/914 Test #543: XField_PX_btest ..................................................................................   Passed    2.02 sec
        Start 544: EGTetGen_btest
544/914 Test #544: EGTetGen_btest ...................................................................................   Passed    2.00 sec
        Start 545: makeTetGenModel_btest
545/914 Test #545: makeTetGenModel_btest ............................................................................   Passed    7.64 sec
        Start 546: makeWakedAirfoil_btest
546/914 Test #546: makeWakedAirfoil_btest ...........................................................................   Passed    1.34 sec
        Start 547: MetricOps_btest
547/914 Test #547: MetricOps_btest ..................................................................................   Passed    1.18 sec
        Start 548: MesherInterface_Poitwise_btest
548/914 Test #548: MesherInterface_Poitwise_btest ...................................................................   Passed    1.26 sec
        Start 549: Write_PointwisePCD_btest
549/914 Test #549: Write_PointwisePCD_btest .........................................................................   Passed    1.24 sec
        Start 550: refine2D_btest
550/914 Test #550: refine2D_btest ...................................................................................   Passed   10.78 sec
        Start 551: refine3D_btest
551/914 Test #551: refine3D_btest ...................................................................................   Passed   55.89 sec
        Start 552: ReadSolution_libMeshb_btest
552/914 Test #552: ReadSolution_libMeshb_btest ......................................................................   Passed    1.27 sec
        Start 553: WriteMesh_libMeshb_btest
553/914 Test #553: WriteMesh_libMeshb_btest .........................................................................   Passed    1.24 sec
        Start 554: WriteSolution_libMeshb_btest
554/914 Test #554: WriteSolution_libMeshb_btest .....................................................................   Passed    1.24 sec
        Start 555: XField_libMeshb_btest
555/914 Test #555: XField_libMeshb_btest ............................................................................   Passed    1.27 sec
        Start 556: MesherInterface_FeFloa_btest
556/914 Test #556: MesherInterface_FeFloa_btest .....................................................................   Passed    1.26 sec
        Start 557: XField_gmsh_btest
557/914 Test #557: XField_gmsh_btest ................................................................................   Passed    4.80 sec
        Start 558: XField_ugrid_btest
558/914 Test #558: XField_ugrid_btest ...............................................................................   Passed    1.28 sec
        Start 559: XField1D_btest
559/914 Test #559: XField1D_btest ...................................................................................   Passed    1.26 sec
        Start 560: HalvingSearchLineUpdate_btest
560/914 Test #560: HalvingSearchLineUpdate_btest ....................................................................   Passed    1.28 sec
        Start 561: NewtonSolver_Parameters_btest
561/914 Test #561: NewtonSolver_Parameters_btest ....................................................................   Passed    1.30 sec
        Start 562: NewtonSolver_btest
562/914 Test #562: NewtonSolver_btest ...............................................................................   Passed    1.38 sec
        Start 563: ScalarGoldenSearchLineUpdate_btest
563/914 Test #563: ScalarGoldenSearchLineUpdate_btest ...............................................................   Passed    1.26 sec
        Start 564: PiecewiseConstSourcePanel_FlatPlate3D_btest
564/914 Test #564: PiecewiseConstSourcePanel_FlatPlate3D_btest ......................................................   Passed    1.22 sec
        Start 565: XfoilPanelEquationSet_btest
565/914 Test #565: XfoilPanelEquationSet_btest ......................................................................   Passed    1.21 sec
        Start 566: XfoilPanel_btest
566/914 Test #566: XfoilPanel_btest .................................................................................   Passed    1.20 sec
        Start 567: OutputCell_SolutionErrorL2_Axisym_btest
567/914 Test #567: OutputCell_SolutionErrorL2_Axisym_btest ..........................................................   Passed    1.22 sec
        Start 568: OutputCell_SolutionErrorL2_btest
568/914 Test #568: OutputCell_SolutionErrorL2_btest .................................................................   Passed    1.18 sec
        Start 569: OutputCell_SolutionErrorSquared_btest
569/914 Test #569: OutputCell_SolutionErrorSquared_btest ............................................................   Passed    1.19 sec
        Start 570: OutputCell_SolutionSquared_btest
570/914 Test #570: OutputCell_SolutionSquared_btest .................................................................   Passed    1.20 sec
        Start 571: OutputCell_Solution_btest
571/914 Test #571: OutputCell_Solution_btest ........................................................................   Passed    1.19 sec
        Start 572: OutputCell_WeightedSolution_btest
572/914 Test #572: OutputCell_WeightedSolution_btest ................................................................   Passed    1.19 sec
        Start 573: AdvectionDiffusion_Sensor_btest
573/914 Test #573: AdvectionDiffusion_Sensor_btest ..................................................................   Passed    1.22 sec
        Start 574: AdvectiveFlux1D_btest
574/914 Test #574: AdvectiveFlux1D_btest ............................................................................   Passed    1.20 sec
        Start 575: AdvectiveFlux2D_btest
575/914 Test #575: AdvectiveFlux2D_btest ............................................................................   Passed    1.22 sec
        Start 576: AdvectiveFlux3D_btest
576/914 Test #576: AdvectiveFlux3D_btest ............................................................................   Passed    1.20 sec
        Start 577: BCAdvectionDiffusion1D_btest
577/914 Test #577: BCAdvectionDiffusion1D_btest .....................................................................   Passed    1.21 sec
        Start 578: BCAdvectionDiffusion2D_btest
578/914 Test #578: BCAdvectionDiffusion2D_btest .....................................................................   Passed    1.21 sec
        Start 579: ForcingFunction1D_MMS_btest
579/914 Test #579: ForcingFunction1D_MMS_btest ......................................................................   Passed    1.19 sec
        Start 580: ForcingFunction2D_MMS_btest
580/914 Test #580: ForcingFunction2D_MMS_btest ......................................................................   Passed    1.20 sec
        Start 581: ForcingFunction2D_btest
581/914 Test #581: ForcingFunction2D_btest ..........................................................................   Passed    1.19 sec
        Start 582: ForcingFunction3D_MMS_btest
582/914 Test #582: ForcingFunction3D_MMS_btest ......................................................................   Passed    1.21 sec
        Start 583: ForcingFunction3D_btest
583/914 Test #583: ForcingFunction3D_btest ..........................................................................   Passed    1.23 sec
        Start 584: OutputAdvectionDiffusion_btest
584/914 Test #584: OutputAdvectionDiffusion_btest ...................................................................   Passed    1.22 sec
        Start 585: PDEAdvectionDiffusion1D_btest
585/914 Test #585: PDEAdvectionDiffusion1D_btest ....................................................................   Passed    1.20 sec
        Start 586: PDEAdvectionDiffusion2D_btest
586/914 Test #586: PDEAdvectionDiffusion2D_btest ....................................................................   Passed    1.19 sec
        Start 587: PDEAdvectionDiffusion3D_btest
587/914 Test #587: PDEAdvectionDiffusion3D_btest ....................................................................   Passed    1.19 sec
        Start 588: PDEAdvectionDiffusion_ArtificialViscosity2D_btest
588/914 Test #588: PDEAdvectionDiffusion_ArtificialViscosity2D_btest ................................................   Passed    1.18 sec
        Start 589: Source1D_btest
589/914 Test #589: Source1D_btest ...................................................................................   Passed    1.20 sec
        Start 590: Source2D_btest
590/914 Test #590: Source2D_btest ...................................................................................   Passed    1.18 sec
        Start 591: Source3D_btest
591/914 Test #591: Source3D_btest ...................................................................................   Passed    1.19 sec
        Start 592: ViscousFlux1D_btest
592/914 Test #592: ViscousFlux1D_btest ..............................................................................   Passed    1.24 sec
        Start 593: ViscousFlux2D_btest
593/914 Test #593: ViscousFlux2D_btest ..............................................................................   Passed    1.20 sec
        Start 594: ViscousFlux3D_btest
594/914 Test #594: ViscousFlux3D_btest ..............................................................................   Passed    1.19 sec
        Start 595: AVSensor_AdvectiveFlux1D_btest
595/914 Test #595: AVSensor_AdvectiveFlux1D_btest ...................................................................   Passed    1.20 sec
        Start 596: AVSensor_AdvectiveFlux2D_btest
596/914 Test #596: AVSensor_AdvectiveFlux2D_btest ...................................................................   Passed    1.20 sec
        Start 597: AVSensor_Source1D_Euler_btest
597/914 Test #597: AVSensor_Source1D_Euler_btest ....................................................................   Passed    1.22 sec
        Start 598: AVSensor_Source1D_btest
598/914 Test #598: AVSensor_Source1D_btest ..........................................................................   Passed    1.19 sec
        Start 599: AVSensor_Source2D_Euler_btest
599/914 Test #599: AVSensor_Source2D_Euler_btest ....................................................................   Passed    1.27 sec
        Start 600: AVSensor_Source2D_TwoPhase_btest
600/914 Test #600: AVSensor_Source2D_TwoPhase_btest .................................................................   Passed    1.18 sec
        Start 601: AVSensor_Source3D_Euler_btest
601/914 Test #601: AVSensor_Source3D_Euler_btest ....................................................................   Passed    1.37 sec
        Start 602: AVSensor_ViscousFlux1D_btest
602/914 Test #602: AVSensor_ViscousFlux1D_btest .....................................................................   Passed    1.24 sec
        Start 603: AVSensor_ViscousFlux2D_btest
603/914 Test #603: AVSensor_ViscousFlux2D_btest .....................................................................   Passed    1.22 sec
        Start 604: AVSensor_ViscousFlux3D_btest
604/914 Test #604: AVSensor_ViscousFlux3D_btest .....................................................................   Passed    1.20 sec
        Start 605: PDEmitAVSensor1D_btest
605/914 Test #605: PDEmitAVSensor1D_btest ...........................................................................   Passed    1.20 sec
        Start 606: PDEmitAVSensor2D_btest
606/914 Test #606: PDEmitAVSensor2D_btest ...........................................................................   Passed    1.21 sec
        Start 607: PDEmitAVSensor3D_btest
607/914 Test #607: PDEmitAVSensor3D_btest ...........................................................................   Passed    1.19 sec
        Start 608: ArrayFunction2D_btest
608/914 Test #608: ArrayFunction2D_btest ............................................................................   Passed    1.20 sec
        Start 609: ScalarFunction1D_btest
609/914 Test #609: ScalarFunction1D_btest ...........................................................................   Passed    1.20 sec
        Start 610: ScalarFunction2D_btest
610/914 Test #610: ScalarFunction2D_btest ...........................................................................   Passed    1.21 sec
        Start 611: ScalarFunction3D_btest
611/914 Test #611: ScalarFunction3D_btest ...........................................................................   Passed    1.24 sec
        Start 612: PDEEikonal_Distance2D_btest
612/914 Test #612: PDEEikonal_Distance2D_btest ......................................................................   Passed    1.21 sec
        Start 613: BCCauchyRiemann2D_btest
613/914 Test #613: BCCauchyRiemann2D_btest ..........................................................................   Passed    1.18 sec
        Start 614: PDECauchyRiemann2D_SurrealD_btest
614/914 Test #614: PDECauchyRiemann2D_SurrealD_btest ................................................................   Passed    1.19 sec
        Start 615: PDECauchyRiemann2D_SurrealS_btest
615/914 Test #615: PDECauchyRiemann2D_SurrealS_btest ................................................................   Passed    1.22 sec
        Start 616: PDECauchyRiemann2D_btest
616/914 Test #616: PDECauchyRiemann2D_btest .........................................................................   Passed    1.21 sec
        Start 617: BCFullPotential3D_btest
617/914 Test #617: BCFullPotential3D_btest ..........................................................................   Passed    1.21 sec
        Start 618: BCIncompressiblePotentialTwoField2D_sansLG_btest
618/914 Test #618: BCIncompressiblePotentialTwoField2D_sansLG_btest .................................................   Passed    1.21 sec
        Start 619: BCLinearizedIncompressiblePotential2D_btest
619/914 Test #619: BCLinearizedIncompressiblePotential2D_btest ......................................................   Passed    1.19 sec
        Start 620: BCLinearizedIncompressiblePotential2D_sansLG_btest
620/914 Test #620: BCLinearizedIncompressiblePotential2D_sansLG_btest ...............................................   Passed    1.21 sec
        Start 621: BCLinearizedIncompressiblePotential3D_btest
621/914 Test #621: BCLinearizedIncompressiblePotential3D_btest ......................................................   Passed    1.23 sec
        Start 622: LinearizedIncompressiblePotential3D_Circulation_btest
622/914 Test #622: LinearizedIncompressiblePotential3D_Circulation_btest ............................................   Passed    1.47 sec
        Start 623: LinearizedIncompressiblePotential3D_Trefftz_btest
623/914 Test #623: LinearizedIncompressiblePotential3D_Trefftz_btest ................................................   Passed    1.50 sec
        Start 624: OutputLIP3D_btest
624/914 Test #624: OutputLIP3D_btest ................................................................................   Passed    1.21 sec
        Start 625: PDEFullPotential3D_btest
625/914 Test #625: PDEFullPotential3D_btest .........................................................................   Passed    1.18 sec
        Start 626: PDEIncompressiblePotentialTwoField2D_btest
626/914 Test #626: PDEIncompressiblePotentialTwoField2D_btest .......................................................   Passed    1.18 sec
        Start 627: PDELinearizedIncompressiblePotential2D_btest
627/914 Test #627: PDELinearizedIncompressiblePotential2D_btest .....................................................   Passed    1.20 sec
        Start 628: PDELinearizedIncompressiblePotential3D_btest
628/914 Test #628: PDELinearizedIncompressiblePotential3D_btest .....................................................   Passed    1.20 sec
        Start 629: SolutionFunction2D_LIP_btest
629/914 Test #629: SolutionFunction2D_LIP_btest .....................................................................   Passed    1.18 sec
        Start 630: SolutionFunction3D_LIP_btest
630/914 Test #630: SolutionFunction3D_LIP_btest .....................................................................   Passed    1.23 sec
        Start 631: SolutionFunction_Potential2D_btest
631/914 Test #631: SolutionFunction_Potential2D_btest ...............................................................   Passed    1.21 sec
        Start 632: AlgebraicEquationSet_ProjectToQauxv_3D_btest
632/914 Test #632: AlgebraicEquationSet_ProjectToQauxv_3D_btest .....................................................   Passed    1.49 sec
        Start 633: AlgebraicEquationSet_ProjectToQauxv_PiecewiseConstSourcePanel_FlatPlate3D_Quad_btest
633/914 Test #633: AlgebraicEquationSet_ProjectToQauxv_PiecewiseConstSourcePanel_FlatPlate3D_Quad_btest .............   Passed    1.24 sec
        Start 634: AlgebraicEquationSet_ProjectToQauxv_PiecewiseConstSourcePanel_FlatPlate3D_Triangle_btest
634/914 Test #634: AlgebraicEquationSet_ProjectToQauxv_PiecewiseConstSourcePanel_FlatPlate3D_Triangle_btest .........   Passed    1.24 sec
        Start 635: BCIBL2D_btest
635/914 Test #635: BCIBL2D_btest ....................................................................................   Passed    1.23 sec
        Start 636: BCIBLUniField2D_btest
636/914 Test #636: BCIBLUniField2D_btest ............................................................................   Passed    1.20 sec
        Start 637: ElementProjectionIBLoutput_L2_btest
637/914 Test #637: ElementProjectionIBLoutput_L2_btest ..............................................................   Passed    1.20 sec
        Start 638: FluidModels_btest
638/914 Test #638: FluidModels_btest ................................................................................   Passed    1.20 sec
        Start 639: GetSolnDofCell_IBL_btest
639/914 Test #639: GetSolnDofCell_IBL_btest .........................................................................   Passed    1.23 sec
        Start 640: IBLMiscClosures_btest
640/914 Test #640: IBLMiscClosures_btest ............................................................................   Passed    1.19 sec
        Start 641: PDEIBL2D_btest
641/914 Test #641: PDEIBL2D_btest ...................................................................................   Passed    1.23 sec
        Start 642: PDEIBL2D_continued_btest
642/914 Test #642: PDEIBL2D_continued_btest .........................................................................   Passed    1.21 sec
        Start 643: PDEIBL3D_btest
643/914 Test #643: PDEIBL3D_btest ...................................................................................   Passed    1.20 sec
        Start 644: PDEIBLFourEqn3D_btest
644/914 Test #644: PDEIBLFourEqn3D_btest ............................................................................   Passed    1.22 sec
        Start 645: PDEIBLSplitAmpLag2D_btest
645/914 Test #645: PDEIBLSplitAmpLag2D_btest ........................................................................   Passed    1.23 sec
        Start 646: PDEIBLUniField2D_btest
646/914 Test #646: PDEIBLUniField2D_btest ...........................................................................   Passed    1.20 sec
        Start 647: ProjectToQauxi2D_btest
647/914 Test #647: ProjectToQauxi2D_btest ...........................................................................   Passed    1.21 sec
        Start 648: ProjectToQauxi3D_btest
648/914 Test #648: ProjectToQauxi3D_btest ...........................................................................   Passed    1.23 sec
        Start 649: QauxvInterpret2D_btest
649/914 Test #649: QauxvInterpret2D_btest ...........................................................................   Passed    1.19 sec
        Start 650: SecondaryVar2D_btest
650/914 Test #650: SecondaryVar2D_btest .............................................................................   Passed    1.21 sec
        Start 651: SetIBLoutputCellGroup_btest
651/914 Test #651: SetIBLoutputCellGroup_btest ......................................................................   Passed    1.22 sec
        Start 652: SetSolnDofCell_IBL_btest
652/914 Test #652: SetSolnDofCell_IBL_btest .........................................................................   Passed    1.21 sec
        Start 653: SetVelDofCell_IBL_btest
653/914 Test #653: SetVelDofCell_IBL_btest ..........................................................................   Passed    1.21 sec
        Start 654: SpaldingLawModified_btest
654/914 Test #654: SpaldingLawModified_btest ........................................................................   Passed    1.19 sec
        Start 655: ThicknessesCoefficients2D_CorrelationClosure_btest
655/914 Test #655: ThicknessesCoefficients2D_CorrelationClosure_btest ...............................................   Passed    1.24 sec
        Start 656: ThicknessesCoefficients2D_ProfileClosure_btest
656/914 Test #656: ThicknessesCoefficients2D_ProfileClosure_btest ...................................................   Passed    1.24 sec
        Start 657: VarInterpret2D_btest
657/914 Test #657: VarInterpret2D_btest .............................................................................   Passed    1.21 sec
        Start 658: VelocityProfile2D_btest
658/914 Test #658: VelocityProfile2D_btest ..........................................................................   Passed    1.19 sec
        Start 659: BCIncompressibleNavierStokes1DChannel_btest
659/914 Test #659: BCIncompressibleNavierStokes1DChannel_btest ......................................................   Passed    1.21 sec
        Start 660: BCIncompressibleRANSSA1DChannel_btest
660/914 Test #660: BCIncompressibleRANSSA1DChannel_btest ............................................................   Passed    1.24 sec
        Start 661: PDEIncompressibleNavierStokes1DChannel_btest
661/914 Test #661: PDEIncompressibleNavierStokes1DChannel_btest .....................................................   Passed    1.22 sec
        Start 662: PDEIncompressibleRANSSA1DChannel_btest
662/914 Test #662: PDEIncompressibleRANSSA1DChannel_btest ...........................................................   Passed    1.20 sec
        Start 663: SolutionFunction_IncompressibleRANSSA1DChannel_btest
663/914 Test #663: SolutionFunction_IncompressibleRANSSA1DChannel_btest .............................................   Passed    1.22 sec
        Start 664: BCLorenz_btest
664/914 Test #664: BCLorenz_btest ...................................................................................   Passed    1.23 sec
        Start 665: PDELorenz_btest
665/914 Test #665: PDELorenz_btest ..................................................................................   Passed    1.21 sec
        Start 666: BCEuler1D_btest
666/914 Test #666: BCEuler1D_btest ..................................................................................   Passed    1.25 sec
        Start 667: BCEuler2D_btest
667/914 Test #667: BCEuler2D_btest ..................................................................................   Passed    1.36 sec
        Start 668: BCEuler3D_mitLagrange_btest
668/914 Test #668: BCEuler3D_mitLagrange_btest ......................................................................   Passed    1.22 sec
        Start 669: BCEuler3D_mitState_btest
669/914 Test #669: BCEuler3D_mitState_btest .........................................................................   Passed    1.23 sec
        Start 670: BCEulermitAVSensor1D_btest
670/914 Test #670: BCEulermitAVSensor1D_btest .......................................................................   Passed    1.22 sec
        Start 671: BCEulermitAVSensor2D_btest
671/914 Test #671: BCEulermitAVSensor2D_btest .......................................................................   Passed    1.24 sec
        Start 672: BCEulermitAVSensor3D_btest
672/914 Test #672: BCEulermitAVSensor3D_btest .......................................................................   Passed    1.21 sec
        Start 673: BCNavierStokes2D_Robin_sansLG_btest
673/914 Test #673: BCNavierStokes2D_Robin_sansLG_btest ..............................................................   Passed    1.21 sec
        Start 674: BCNavierStokes2D_btest
674/914 Test #674: BCNavierStokes2D_btest ...........................................................................   Passed    1.21 sec
        Start 675: BCNavierStokes3D_Robin_sansLG_btest
675/914 Test #675: BCNavierStokes3D_Robin_sansLG_btest ..............................................................   Passed    1.24 sec
        Start 676: BCNavierStokes3D_mitState_btest
676/914 Test #676: BCNavierStokes3D_mitState_btest ..................................................................   Passed    1.21 sec
        Start 677: BCRANSSA2D_btest
677/914 Test #677: BCRANSSA2D_btest .................................................................................   Passed    1.26 sec
        Start 678: BCRANSSA3D_mitState_btest
678/914 Test #678: BCRANSSA3D_mitState_btest ........................................................................   Passed    1.23 sec
        Start 679: EulerSolutionFunction1D_btest
679/914 Test #679: EulerSolutionFunction1D_btest ....................................................................   Passed    1.23 sec
        Start 680: EulerSolutionFunction2D_btest
680/914 Test #680: EulerSolutionFunction2D_btest ....................................................................   Passed    1.21 sec
        Start 681: Fluids1D_Sensor_btest
681/914 Test #681: Fluids1D_Sensor_btest ............................................................................   Passed    1.19 sec
        Start 682: Fluids2D_Sensor_btest
682/914 Test #682: Fluids2D_Sensor_btest ............................................................................   Passed    1.20 sec
        Start 683: GasModel_SurrealS1_btest
683/914 Test #683: GasModel_SurrealS1_btest .........................................................................   Passed    1.24 sec
        Start 684: GasModel_btest
684/914 Test #684: GasModel_btest ...................................................................................   Passed    1.23 sec
        Start 685: HLLC2D_btest
685/914 Test #685: HLLC2D_btest .....................................................................................   Passed    1.21 sec
        Start 686: IsmailRoe_btest
686/914 Test #686: IsmailRoe_btest ..................................................................................   Passed    2.30 sec
        Start 687: NSVariable1D_btest
687/914 Test #687: NSVariable1D_btest ...............................................................................   Passed    1.20 sec
        Start 688: NSVariable2D_btest
688/914 Test #688: NSVariable2D_btest ...............................................................................   Passed    1.20 sec
        Start 689: NSVariable3D_btest
689/914 Test #689: NSVariable3D_btest ...............................................................................   Passed    1.24 sec
        Start 690: NavierStokesForcingFunction2D_btest
690/914 Test #690: NavierStokesForcingFunction2D_btest ..............................................................   Passed    1.20 sec
        Start 691: NavierStokesSolutionFunction2D_btest
691/914 Test #691: NavierStokesSolutionFunction2D_btest .............................................................   Passed    1.20 sec
        Start 692: OutputEuler2D_btest
692/914 Test #692: OutputEuler2D_btest ..............................................................................   Passed    1.20 sec
        Start 693: OutputEuler3D_btest
693/914 Test #693: OutputEuler3D_btest ..............................................................................   Passed    1.19 sec
        Start 694: OutputNavierStokes2D_btest
694/914 Test #694: OutputNavierStokes2D_btest .......................................................................   Passed    1.20 sec
        Start 695: PDEEuler1D_btest
695/914 Test #695: PDEEuler1D_btest .................................................................................   Passed    1.21 sec
        Start 696: PDEEuler2D_btest
696/914 Test #696: PDEEuler2D_btest .................................................................................   Passed    1.21 sec
        Start 697: PDEEuler3D_RotorSource_btest
697/914 Test #697: PDEEuler3D_RotorSource_btest .....................................................................   Passed    1.23 sec
        Start 698: PDEEuler3D_btest
698/914 Test #698: PDEEuler3D_btest .................................................................................   Passed    1.22 sec
        Start 699: PDEEulermitAVDiffusion1D_btest
699/914 Test #699: PDEEulermitAVDiffusion1D_btest ...................................................................   Passed    1.20 sec
        Start 700: PDEEulermitAVDiffusion2D_RANSSA_btest
700/914 Test #700: PDEEulermitAVDiffusion2D_RANSSA_btest ............................................................   Passed    1.22 sec
        Start 701: PDEEulermitAVDiffusion2D_btest
701/914 Test #701: PDEEulermitAVDiffusion2D_btest ...................................................................   Passed    1.22 sec
        Start 702: PDEEulermitAVDiffusion3D_RANSSA_btest
702/914 Test #702: PDEEulermitAVDiffusion3D_RANSSA_btest ............................................................   Passed    1.25 sec
        Start 703: PDEEulermitAVDiffusion3D_RotorSource_btest
703/914 Test #703: PDEEulermitAVDiffusion3D_RotorSource_btest .......................................................   Passed    1.19 sec
        Start 704: PDEEulermitAVDiffusion3D_btest
704/914 Test #704: PDEEulermitAVDiffusion3D_btest ...................................................................   Passed    1.23 sec
        Start 705: PDENavierStokes1D_btest
705/914 Test #705: PDENavierStokes1D_btest ..........................................................................   Passed    1.19 sec
        Start 706: PDENavierStokes2D_btest
706/914 Test #706: PDENavierStokes2D_btest ..........................................................................   Passed    1.20 sec
        Start 707: PDENavierStokes3D_btest
707/914 Test #707: PDENavierStokes3D_btest ..........................................................................   Passed    1.20 sec
        Start 708: PDERANSSA2D_btest
708/914 Test #708: PDERANSSA2D_btest ................................................................................   Passed    1.23 sec
        Start 709: PDERANSSA3D_btest
709/914 Test #709: PDERANSSA3D_btest ................................................................................   Passed    1.24 sec
        Start 710: Q1DConservative_btest
710/914 Test #710: Q1DConservative_btest ............................................................................   Passed    1.19 sec
        Start 711: Q1DEntropy_btest
711/914 Test #711: Q1DEntropy_btest .................................................................................   Passed    1.19 sec
        Start 712: Q1DPrimitiveRhoPressure_btest
712/914 Test #712: Q1DPrimitiveRhoPressure_btest ....................................................................   Passed    1.20 sec
        Start 713: Q1DPrimitiveSurrogate_btest
713/914 Test #713: Q1DPrimitiveSurrogate_btest ......................................................................   Passed    1.19 sec
        Start 714: Q2DConservative_btest
714/914 Test #714: Q2DConservative_btest ............................................................................   Passed    1.19 sec
        Start 715: Q2DEntropy_btest
715/914 Test #715: Q2DEntropy_btest .................................................................................   Passed    1.19 sec
        Start 716: Q2DPrimitiveRhoPressure_btest
716/914 Test #716: Q2DPrimitiveRhoPressure_btest ....................................................................   Passed    1.19 sec
        Start 717: Q2DPrimitiveRhoTemperature_btest
717/914 Test #717: Q2DPrimitiveRhoTemperature_btest .................................................................   Passed    1.21 sec
        Start 718: Q2DPrimitiveSurrogate_btest
718/914 Test #718: Q2DPrimitiveSurrogate_btest ......................................................................   Passed    1.20 sec
        Start 719: Q3DConservative_btest
719/914 Test #719: Q3DConservative_btest ............................................................................   Passed    1.19 sec
        Start 720: Q3DEntropy_btest
720/914 Test #720: Q3DEntropy_btest .................................................................................   Passed    1.20 sec
        Start 721: Q3DPrimitiveRhoPressure_btest
721/914 Test #721: Q3DPrimitiveRhoPressure_btest ....................................................................   Passed    1.19 sec
        Start 722: Q3DPrimitiveRhoTemperature_btest
722/914 Test #722: Q3DPrimitiveRhoTemperature_btest .................................................................   Passed    1.20 sec
        Start 723: Q3DPrimitiveSurrogate_btest
723/914 Test #723: Q3DPrimitiveSurrogate_btest ......................................................................   Passed    1.19 sec
        Start 724: QRANSSA2D_btest
724/914 Test #724: QRANSSA2D_btest ..................................................................................   Passed    1.20 sec
        Start 725: QRANSSA3D_btest
725/914 Test #725: QRANSSA3D_btest ..................................................................................   Passed    1.20 sec
        Start 726: Roe_btest
726/914 Test #726: Roe_btest ........................................................................................   Passed    1.20 sec
        Start 727: BCNDConvert_btest
727/914 Test #727: BCNDConvert_btest ................................................................................   Passed    1.20 sec
        Start 728: OutputNDConvert_btest
728/914 Test #728: OutputNDConvert_btest ............................................................................   Passed    1.19 sec
        Start 729: PDENDConvert1D_AD_ST_btest
729/914 Test #729: PDENDConvert1D_AD_ST_btest .......................................................................   Passed    1.23 sec
        Start 730: PDENDConvert1D_AD_btest
730/914 Test #730: PDENDConvert1D_AD_btest ..........................................................................   Passed    1.19 sec
        Start 731: PDENDConvert2D_AD_btest
731/914 Test #731: PDENDConvert2D_AD_btest ..........................................................................   Passed    1.21 sec
        Start 732: PDENDConvert3D_AD_btest
732/914 Test #732: PDENDConvert3D_AD_btest ..........................................................................   Passed    1.19 sec
        Start 733: SolnNDConvert1D_AD_btest
733/914 Test #733: SolnNDConvert1D_AD_btest .........................................................................   Passed    1.18 sec
        Start 734: SolnNDConvert2D_AD_btest
734/914 Test #734: SolnNDConvert2D_AD_btest .........................................................................   Passed    1.19 sec
        Start 735: SolnNDConvert3D_AD_btest
735/914 Test #735: SolnNDConvert3D_AD_btest .........................................................................   Passed    1.31 sec
        Start 736: BCHSM2D_btest
736/914 Test #736: BCHSM2D_btest ....................................................................................   Passed    1.27 sec
        Start 737: HSMVariable_btest
737/914 Test #737: HSMVariable_btest ................................................................................   Passed    1.19 sec
        Start 738: PDEHSM2D_btest
738/914 Test #738: PDEHSM2D_btest ...................................................................................   Passed    1.22 sec
        Start 739: PDEHSMKL_btest
739/914 Test #739: PDEHSMKL_btest ...................................................................................   Passed    1.22 sec
        Start 740: VarLambda_btest
740/914 Test #740: VarLambda_btest ..................................................................................   Passed    1.22 sec
        Start 741: BCBuckleyLeverett1D_btest
741/914 Test #741: BCBuckleyLeverett1D_btest ........................................................................   Passed    1.21 sec
        Start 742: BCBuckleyLeverett_ArtificialViscosity1D_btest
742/914 Test #742: BCBuckleyLeverett_ArtificialViscosity1D_btest ....................................................   Passed    1.21 sec
        Start 743: BCTwoPhase1D_btest
743/914 Test #743: BCTwoPhase1D_btest ...............................................................................   Passed    1.22 sec
        Start 744: BCTwoPhase2D_btest
744/914 Test #744: BCTwoPhase2D_btest ...............................................................................   Passed    1.22 sec
        Start 745: BCTwoPhaseArtificialViscosity1D_btest
745/914 Test #745: BCTwoPhaseArtificialViscosity1D_btest ............................................................   Passed    1.20 sec
        Start 746: BCTwoPhaseArtificialViscosity2D_btest
746/914 Test #746: BCTwoPhaseArtificialViscosity2D_btest ............................................................   Passed    1.21 sec
        Start 747: BCTwoPhaseLinearized1D_btest
747/914 Test #747: BCTwoPhaseLinearized1D_btest .....................................................................   Passed    1.24 sec
        Start 748: CapillaryModel_btest
748/914 Test #748: CapillaryModel_btest .............................................................................   Passed    1.25 sec
        Start 749: CartTable_btest
749/914 Test #749: CartTable_btest ..................................................................................   Passed    1.20 sec
        Start 750: DensityModel_btest
750/914 Test #750: DensityModel_btest ...............................................................................   Passed    1.21 sec
        Start 751: OutputTwoPhase_btest
751/914 Test #751: OutputTwoPhase_btest .............................................................................   Passed    1.21 sec
        Start 752: PDEBuckleyLeverett1D_btest
752/914 Test #752: PDEBuckleyLeverett1D_btest .......................................................................   Passed    1.19 sec
        Start 753: PDEBuckleyLeverett_ArtificialViscosity1D_btest
753/914 Test #753: PDEBuckleyLeverett_ArtificialViscosity1D_btest ...................................................   Passed    1.18 sec
        Start 754: PDETwoPhase1D_btest
754/914 Test #754: PDETwoPhase1D_btest ..............................................................................   Passed    1.21 sec
        Start 755: PDETwoPhase2D_btest
755/914 Test #755: PDETwoPhase2D_btest ..............................................................................   Passed    1.24 sec
        Start 756: PDETwoPhaseLinearized1D_btest
756/914 Test #756: PDETwoPhaseLinearized1D_btest ....................................................................   Passed    1.21 sec
        Start 757: PDETwoPhase_ArtificialViscosity1D_btest
757/914 Test #757: PDETwoPhase_ArtificialViscosity1D_btest ..........................................................   Passed    1.19 sec
        Start 758: PDETwoPhase_ArtificialViscosity2D_btest
758/914 Test #758: PDETwoPhase_ArtificialViscosity2D_btest ..........................................................   Passed    1.22 sec
        Start 759: PermeabilityModel2D_btest
759/914 Test #759: PermeabilityModel2D_btest ........................................................................   Passed    1.20 sec
        Start 760: PorosityModel_btest
760/914 Test #760: PorosityModel_btest ..............................................................................   Passed    1.20 sec
        Start 761: Q1DPrimitive_Surrogate_pnSw_btest
761/914 Test #761: Q1DPrimitive_Surrogate_pnSw_btest ................................................................   Passed    1.21 sec
        Start 762: Q1DPrimitive_Sw_btest
762/914 Test #762: Q1DPrimitive_Sw_btest ............................................................................   Passed    1.19 sec
        Start 763: Q1DPrimitive_pnSw_btest
763/914 Test #763: Q1DPrimitive_pnSw_btest ..........................................................................   Passed    1.18 sec
        Start 764: Q2DPrimitive_LogpnSw_btest
764/914 Test #764: Q2DPrimitive_LogpnSw_btest .......................................................................   Passed    1.25 sec
        Start 765: Q2DPrimitive_Surrogate_pnSw_btest
765/914 Test #765: Q2DPrimitive_Surrogate_pnSw_btest ................................................................   Passed    1.24 sec
        Start 766: Q2DPrimitive_pnSw_btest
766/914 Test #766: Q2DPrimitive_pnSw_btest ..........................................................................   Passed    1.27 sec
        Start 767: RelativePermeabilityModel_SurrealS1_btest
767/914 Test #767: RelativePermeabilityModel_SurrealS1_btest ........................................................   Passed    1.29 sec
        Start 768: RelativePermeabilityModel_btest
768/914 Test #768: RelativePermeabilityModel_btest ..................................................................   Passed    1.29 sec
        Start 769: Sensor_BuckleyLeverett1D_btest
769/914 Test #769: Sensor_BuckleyLeverett1D_btest ...................................................................   Passed    1.28 sec
        Start 770: Sensor_TwoPhase_btest
770/914 Test #770: Sensor_TwoPhase_btest ............................................................................   Passed    1.26 sec
        Start 771: SolutionFunction_BuckleyLeverett1D_btest
771/914 Test #771: SolutionFunction_BuckleyLeverett1D_btest .........................................................   Passed    1.24 sec
        Start 772: SolutionFunction_TwoPhase2D_btest
772/914 Test #772: SolutionFunction_TwoPhase2D_btest ................................................................   Passed    1.20 sec
        Start 773: SourceTwoPhase1D_btest
773/914 Test #773: SourceTwoPhase1D_btest ...........................................................................   Passed    1.24 sec
        Start 774: SourceTwoPhase2D_btest
774/914 Test #774: SourceTwoPhase2D_btest ...........................................................................   Passed    1.21 sec
        Start 775: ViscosityModel_btest
775/914 Test #775: ViscosityModel_btest .............................................................................   Passed    1.22 sec
        Start 776: AtmosphereIsothermal_btest
776/914 Test #776: AtmosphereIsothermal_btest .......................................................................   Passed    1.18 sec
        Start 777: AtmosphereStandard_btest
777/914 Test #777: AtmosphereStandard_btest .........................................................................   Passed    1.19 sec
        Start 778: BCsansBOOM_btest
778/914 Test #778: BCsansBOOM_btest .................................................................................   Passed    1.23 sec
        Start 779: ICsansBOOM_btest
779/914 Test #779: ICsansBOOM_btest .................................................................................   Passed    1.19 sec
        Start 780: OutputsansBOOM_btest
780/914 Test #780: OutputsansBOOM_btest .............................................................................   Passed    1.19 sec
        Start 781: PDEsansBOOM_btest
781/914 Test #781: PDEsansBOOM_btest ................................................................................   Passed    1.19 sec
        Start 782: RayPath_btest
782/914 Test #782: RayPath_btest ....................................................................................   Passed    1.18 sec
        Start 783: BCSensorParameter1D_btest
783/914 Test #783: BCSensorParameter1D_btest ........................................................................   Passed    1.21 sec
        Start 784: BCSensorParameter2D_btest
784/914 Test #784: BCSensorParameter2D_btest ........................................................................   Passed    1.20 sec
        Start 785: PDESensorParameter1D_btest
785/914 Test #785: PDESensorParameter1D_btest .......................................................................   Passed    1.20 sec
        Start 786: PDESensorParameter2D_btest
786/914 Test #786: PDESensorParameter2D_btest .......................................................................   Passed    1.22 sec
        Start 787: Sensor_AdvectiveFlux1D_btest
787/914 Test #787: Sensor_AdvectiveFlux1D_btest .....................................................................   Passed    1.19 sec
        Start 788: Sensor_AdvectiveFlux2D_btest
788/914 Test #788: Sensor_AdvectiveFlux2D_btest .....................................................................   Passed    1.18 sec
        Start 789: Sensor_DiffusionMatrix1D_btest
789/914 Test #789: Sensor_DiffusionMatrix1D_btest ...................................................................   Passed    1.20 sec
        Start 790: Sensor_DiffusionMatrix2D_btest
790/914 Test #790: Sensor_DiffusionMatrix2D_btest ...................................................................   Passed    1.19 sec
        Start 791: Source1D_JumpSensor_btest
791/914 Test #791: Source1D_JumpSensor_btest ........................................................................   Passed    1.18 sec
        Start 792: Source2D_JumpSensor_btest
792/914 Test #792: Source2D_JumpSensor_btest ........................................................................   Passed    1.23 sec
        Start 793: BCShallowWater1D_btest
793/914 Test #793: BCShallowWater1D_btest ...........................................................................   Passed    1.25 sec
        Start 794: BCShallowWater2D_btest
794/914 Test #794: BCShallowWater2D_btest ...........................................................................   Passed    1.21 sec
        Start 795: BCShallowWater2D_manifold_btest
795/914 Test #795: BCShallowWater2D_manifold_btest ..................................................................   Passed    1.24 sec
        Start 796: OutputShallowWater1D_btest
796/914 Test #796: OutputShallowWater1D_btest .......................................................................   Passed    1.22 sec
        Start 797: OutputShallowWater2D_btest
797/914 Test #797: OutputShallowWater2D_btest .......................................................................   Passed    1.24 sec
        Start 798: PDEShallowWater1D_btest
798/914 Test #798: PDEShallowWater1D_btest ..........................................................................   Passed    1.22 sec
        Start 799: PDEShallowWater2D_btest
799/914 Test #799: PDEShallowWater2D_btest ..........................................................................   Passed    1.25 sec
        Start 800: PDEShallowWater2D_manifold_btest
800/914 Test #800: PDEShallowWater2D_manifold_btest .................................................................   Passed    1.22 sec
        Start 801: ShallowWaterSolution1D_btest
801/914 Test #801: ShallowWaterSolution1D_btest .....................................................................   Passed    1.21 sec
        Start 802: ShallowWaterSolution2D_btest
802/914 Test #802: ShallowWaterSolution2D_btest .....................................................................   Passed    1.22 sec
        Start 803: ShallowWaterSolution2D_manifold_btest
803/914 Test #803: ShallowWaterSolution2D_manifold_btest ............................................................   Passed    1.21 sec
        Start 804: ShallowWaterVarInterp1D_btest
804/914 Test #804: ShallowWaterVarInterp1D_btest ....................................................................   Passed    1.21 sec
        Start 805: ShallowWaterVarInterp2D_btest
805/914 Test #805: ShallowWaterVarInterp2D_btest ....................................................................   Passed    1.19 sec
        Start 806: ShallowWaterVarInterp2D_manifold_btest
806/914 Test #806: ShallowWaterVarInterp2D_manifold_btest ...........................................................   Passed    1.19 sec
        Start 807: PDEStokes2D_btest
807/914 Test #807: PDEStokes2D_btest ................................................................................   Passed    1.21 sec
        Start 808: BCTCNEEuler1D_btest
808/914 Test #808: BCTCNEEuler1D_btest ..............................................................................   Passed    1.28 sec
        Start 809: PDETCNEEuler1D_btest
809/914 Test #809: PDETCNEEuler1D_btest .............................................................................   Passed    1.24 sec
        Start 810: Q1DTCNEConservative_btest
810/914 Test #810: Q1DTCNEConservative_btest ........................................................................   Passed    1.23 sec
        Start 811: TCNEChemistryDataImport_btest
811/914 Test #811: TCNEChemistryDataImport_btest ....................................................................   Passed    1.26 sec
        Start 812: TCNEChemistryModels_btest
812/914 Test #812: TCNEChemistryModels_btest ........................................................................   Passed    1.25 sec
        Start 813: TCNEGasModel_StatMech_btest
813/914 Test #813: TCNEGasModel_StatMech_btest ......................................................................   Passed    1.26 sec
        Start 814: TCNEVariable1D_btest
814/914 Test #814: TCNEVariable1D_btest .............................................................................   Passed    1.24 sec
        Start 815: Parameters_btest
815/914 Test #815: Parameters_btest .................................................................................   Passed    1.23 sec
        Start 816: PyDict_btest
816/914 Test #816: PyDict_btest .....................................................................................   Passed    1.25 sec
        Start 817: QuadratureArea_Quad_btest
817/914 Test #817: QuadratureArea_Quad_btest ........................................................................   Passed    1.25 sec
        Start 818: QuadratureArea_Triangle_btest
818/914 Test #818: QuadratureArea_Triangle_btest ....................................................................   Passed    1.26 sec
        Start 819: QuadratureLine_btest
819/914 Test #819: QuadratureLine_btest .............................................................................   Passed    1.22 sec
        Start 820: QuadratureSpacetime_Pentatope_Stroud_btest
820/914 Test #820: QuadratureSpacetime_Pentatope_Stroud_btest .......................................................   Passed    1.24 sec
        Start 821: QuadratureSpacetime_Pentatope_btest
821/914 Test #821: QuadratureSpacetime_Pentatope_btest ..............................................................   Passed    1.36 sec
        Start 822: QuadratureVolume_Hexahedron_btest
822/914 Test #822: QuadratureVolume_Hexahedron_btest ................................................................   Passed    1.30 sec
        Start 823: QuadratureVolume_Tetrahedron_btest
823/914 Test #823: QuadratureVolume_Tetrahedron_btest ...............................................................   Passed    1.26 sec
        Start 824: Quaternion_btest
824/914 Test #824: Quaternion_btest .................................................................................   Passed    1.19 sec
        Start 825: DissipationBased_btest
825/914 Test #825: DissipationBased_btest ...........................................................................   Passed    1.33 sec
        Start 826: Homotopy_Euler_btest
826/914 Test #826: Homotopy_Euler_btest .............................................................................   Passed    1.63 sec
        Start 827: Homotopy_btest
827/914 Test #827: Homotopy_btest ...................................................................................   Passed    1.31 sec
        Start 828: ImplicitResidualSmoothing_btest
828/914 Test #828: ImplicitResidualSmoothing_btest ..................................................................   Passed    1.25 sec
        Start 829: PDEHomotopy_btest
829/914 Test #829: PDEHomotopy_btest ................................................................................   Passed    1.18 sec
        Start 830: PDESourceOnly_btest
830/914 Test #830: PDESourceOnly_btest ..............................................................................   Passed    1.20 sec
        Start 831: PseudoTime_btest
831/914 Test #831: PseudoTime_btest .................................................................................   Passed    1.25 sec
        Start 832: HarmonicBalance_btest
832/914 Test #832: HarmonicBalance_btest ............................................................................   Passed    1.36 sec
        Start 833: BDF_btest
833/914 Test #833: BDF_btest ........................................................................................   Passed    1.26 sec
        Start 834: RK_btest
834/914 Test #834: RK_btest .........................................................................................   Passed    1.75 sec
        Start 835: SurrealD1_btest
835/914 Test #835: SurrealD1_btest ..................................................................................   Passed    1.22 sec
        Start 836: SurrealD4_btest
836/914 Test #836: SurrealD4_btest ..................................................................................   Passed    1.20 sec
        Start 837: SurrealS1_btest
837/914 Test #837: SurrealS1_btest ..................................................................................   Passed    1.20 sec
        Start 838: SurrealS4_btest
838/914 Test #838: SurrealS4_btest ..................................................................................   Passed    1.19 sec
        Start 839: KahanSum_btest
839/914 Test #839: KahanSum_btest ...................................................................................   Passed    1.70 sec
        Start 840: PointerArray_btest
840/914 Test #840: PointerArray_btest ...............................................................................   Passed    1.18 sec
        Start 841: PointerSequence_btest
841/914 Test #841: PointerSequence_btest ............................................................................   Passed    1.19 sec
        Start 842: Tuple_btest
842/914 Test #842: Tuple_btest ......................................................................................   Passed    1.22 sec
        Start 843: add_decorator_btest
843/914 Test #843: add_decorator_btest ..............................................................................   Passed    1.20 sec
        Start 844: call_derived_functor_btest
844/914 Test #844: call_derived_functor_btest .......................................................................   Passed    1.18 sec
        Start 845: call_with_derived_btest
845/914 Test #845: call_with_derived_btest ..........................................................................   Passed    1.18 sec
        Start 846: file_extension_btest
846/914 Test #846: file_extension_btest .............................................................................   Passed    1.22 sec
        Start 847: linspace_btest
847/914 Test #847: linspace_btest ...................................................................................   Passed    1.20 sec
        Start 848: output_std_vector_btest
848/914 Test #848: output_std_vector_btest ..........................................................................   Passed    1.19 sec
        Start 849: plus_std_vector_btest
849/914 Test #849: plus_std_vector_btest ............................................................................   Passed    1.20 sec
        Start 850: pyrite_fstream_btest
850/914 Test #850: pyrite_fstream_btest .............................................................................   Passed    1.20 sec
        Start 851: smoothmath_btest
851/914 Test #851: smoothmath_btest .................................................................................   Passed    1.19 sec
        Start 852: split_cat_std_vector_btest
852/914 Test #852: split_cat_std_vector_btest .......................................................................   Passed    1.19 sec
        Start 853: tools_btest
853/914 Test #853: tools_btest ......................................................................................   Passed    1.20 sec
        Start 854: LIPSolver_btest
854/914 Test #854: LIPSolver_btest ..................................................................................   Passed    9.90 sec
        Start 855: XField1D_1Group_Periodic_btest
855/914 Test #855: XField1D_1Group_Periodic_btest ...................................................................   Passed    1.21 sec
        Start 856: XField1D_1Line_X1_1Group_btest
856/914 Test #856: XField1D_1Line_X1_1Group_btest ...................................................................   Passed    1.18 sec
        Start 857: XField1D_2Line_X1_1Group_btest
857/914 Test #857: XField1D_2Line_X1_1Group_btest ...................................................................   Passed    1.19 sec
        Start 858: XField1D_4Line_X1_2Group_btest
858/914 Test #858: XField1D_4Line_X1_2Group_btest ...................................................................   Passed    1.21 sec
        Start 859: XField2D_1Line_X1_1Group_btest
859/914 Test #859: XField2D_1Line_X1_1Group_btest ...................................................................   Passed    1.21 sec
        Start 860: XField2D_1Quad_X1_1Group_btest
860/914 Test #860: XField2D_1Quad_X1_1Group_btest ...................................................................   Passed    1.22 sec
        Start 861: XField2D_1Triangle_X1_1Group_btest
861/914 Test #861: XField2D_1Triangle_X1_1Group_btest ...............................................................   Passed    1.19 sec
        Start 862: XField2D_2Quad_X1_1Group_btest
862/914 Test #862: XField2D_2Quad_X1_1Group_btest ...................................................................   Passed    1.19 sec
        Start 863: XField2D_2Triangle_X1_1Group_btest
863/914 Test #863: XField2D_2Triangle_X1_1Group_btest ...............................................................   Passed    1.19 sec
        Start 864: XField2D_4Quad_X1_1Group_btest
864/914 Test #864: XField2D_4Quad_X1_1Group_btest ...................................................................   Passed    1.19 sec
        Start 865: XField2D_4Triangle_X1_1Group_btest
865/914 Test #865: XField2D_4Triangle_X1_1Group_btest ...............................................................   Passed    1.18 sec
        Start 866: XField2D_4Triangle_X1_4Group_btest
866/914 Test #866: XField2D_4Triangle_X1_4Group_btest ...............................................................   Passed    1.19 sec
        Start 867: XField2D_Annulus_Quad_X1_btest
867/914 Test #867: XField2D_Annulus_Quad_X1_btest ...................................................................   Passed    1.23 sec
        Start 868: XField2D_Annulus_Triangle_X1_btest
868/914 Test #868: XField2D_Annulus_Triangle_X1_btest ...............................................................   Passed    1.20 sec
        Start 869: XField2D_BackwardsStep_X1_btest
869/914 Test #869: XField2D_BackwardsStep_X1_btest ..................................................................   Passed    1.20 sec
        Start 870: XField2D_BoxPeriodic_Triangle_X1_btest
870/914 Test #870: XField2D_BoxPeriodic_Triangle_X1_btest ...........................................................   Passed    1.20 sec
        Start 871: XField2D_Box_Mixed_X1_btest
871/914 Test #871: XField2D_Box_Mixed_X1_btest ......................................................................   Passed    1.21 sec
        Start 872: XField2D_Box_Quad_Lagrange_X1_btest
872/914 Test #872: XField2D_Box_Quad_Lagrange_X1_btest ..............................................................   Passed    1.22 sec
        Start 873: XField2D_Box_Quad_X1_btest
873/914 Test #873: XField2D_Box_Quad_X1_btest .......................................................................   Passed    1.21 sec
        Start 874: XField2D_Box_Triangle_Ghost_X1_btest
874/914 Test #874: XField2D_Box_Triangle_Ghost_X1_btest .............................................................   Passed    1.19 sec
        Start 875: XField2D_Box_Triangle_Lagrange_X1_btest
875/914 Test #875: XField2D_Box_Triangle_Lagrange_X1_btest ..........................................................   Passed    1.22 sec
        Start 876: XField2D_Box_Triangle_X1_btest
876/914 Test #876: XField2D_Box_Triangle_X1_btest ...................................................................   Passed    1.19 sec
        Start 877: XField2D_Box_UnionJack_LocalRefine_Triangle_X1_btest
877/914 Test #877: XField2D_Box_UnionJack_LocalRefine_Triangle_X1_btest .............................................   Passed    1.19 sec
        Start 878: XField2D_Box_UnionJack_Triangle_X1_btest
878/914 Test #878: XField2D_Box_UnionJack_Triangle_X1_btest .........................................................   Passed    1.18 sec
        Start 879: XField2D_Circle_Line_X1_1Group_btest
879/914 Test #879: XField2D_Circle_Line_X1_1Group_btest .............................................................   Passed    1.22 sec
        Start 880: XField2D_CubicSourceBump_Xq_btest
880/914 Test #880: XField2D_CubicSourceBump_Xq_btest ................................................................   Passed    1.51 sec
        Start 881: XField2D_Duct_Triangle_Lagrange_Xq_btest
881/914 Test #881: XField2D_Duct_Triangle_Lagrange_Xq_btest .........................................................   Passed    1.23 sec
        Start 882: XField2D_FlatPlate_X1_btest
882/914 Test #882: XField2D_FlatPlate_X1_btest ......................................................................   Passed    1.21 sec
        Start 883: XField2D_GilesPierceNozzle_HACK_btest
883/914 Test #883: XField2D_GilesPierceNozzle_HACK_btest ............................................................   Passed    1.50 sec
        Start 884: XField2D_Line_X1_1Group_btest
884/914 Test #884: XField2D_Line_X1_1Group_btest ....................................................................   Passed    1.23 sec
        Start 885: XField2D_Line_X1_2Group_AirfoilWithWake_btest
885/914 Test #885: XField2D_Line_X1_2Group_AirfoilWithWake_btest ....................................................   Passed    1.20 sec
        Start 886: XField2D_Line_Xq_1Group_btest
886/914 Test #886: XField2D_Line_Xq_1Group_btest ....................................................................   Passed    1.21 sec
        Start 887: XField2D_SymAirfoil_X1_btest
887/914 Test #887: XField2D_SymAirfoil_X1_btest .....................................................................   Passed    1.20 sec
        Start 888: XField2D_WakeSymAirfoil_X1_btest
888/914 Test #888: XField2D_WakeSymAirfoil_X1_btest .................................................................   Passed    1.20 sec
        Start 889: XField3D_1Hex_X1_1Group_btest
889/914 Test #889: XField3D_1Hex_X1_1Group_btest ....................................................................   Passed    1.23 sec
        Start 890: XField3D_1Tet_X1_1Group_btest
890/914 Test #890: XField3D_1Tet_X1_1Group_btest ....................................................................   Passed    1.21 sec
        Start 891: XField3D_2Hex_X1_1Group_btest
891/914 Test #891: XField3D_2Hex_X1_1Group_btest ....................................................................   Passed    1.21 sec
        Start 892: XField3D_2Tet_X1_1Group_WakeCut_btest
892/914 Test #892: XField3D_2Tet_X1_1Group_WakeCut_btest ............................................................   Passed    1.22 sec
        Start 893: XField3D_2Tet_X1_1Group_btest
893/914 Test #893: XField3D_2Tet_X1_1Group_btest ....................................................................   Passed    1.25 sec
        Start 894: XField3D_5Tet_X1_1Group_AllOrientations_btest
894/914 Test #894: XField3D_5Tet_X1_1Group_AllOrientations_btest ....................................................   Passed    1.23 sec
        Start 895: XField3D_6Tet_X1_1Group_btest
895/914 Test #895: XField3D_6Tet_X1_1Group_btest ....................................................................   Passed    1.21 sec
        Start 896: XField3D_8Tet_X1_1Group_btest
896/914 Test #896: XField3D_8Tet_X1_1Group_btest ....................................................................   Passed    1.21 sec
        Start 897: XField3D_BoxBoundaries_Quad_X1_btest
897/914 Test #897: XField3D_BoxBoundaries_Quad_X1_btest .............................................................   Passed    1.37 sec
        Start 898: XField3D_BoxBoundary_Quad_X1_btest
898/914 Test #898: XField3D_BoxBoundary_Quad_X1_btest ...............................................................   Passed    1.27 sec
        Start 899: XField3D_Box_Hex_X1_WakeCut_btest
899/914 Test #899: XField3D_Box_Hex_X1_WakeCut_btest ................................................................   Passed    1.24 sec
        Start 900: XField3D_Box_Hex_X1_btest
900/914 Test #900: XField3D_Box_Hex_X1_btest ........................................................................   Passed    1.56 sec
        Start 901: XField3D_Box_Tet_X1_WakeCut_btest
901/914 Test #901: XField3D_Box_Tet_X1_WakeCut_btest ................................................................   Passed    1.26 sec
        Start 902: XField3D_Box_Tet_X1_btest
902/914 Test #902: XField3D_Box_Tet_X1_btest ........................................................................   Passed    2.35 sec
        Start 903: XField3D_CornerFlatPlate_X1_btest
903/914 Test #903: XField3D_CornerFlatPlate_X1_btest ................................................................   Passed    1.43 sec
        Start 904: XField3D_FlatPlate_X1_btest
904/914 Test #904: XField3D_FlatPlate_X1_btest ......................................................................   Passed    1.65 sec
        Start 905: XField3D_ForwardStep_Hex_X1_btest
905/914 Test #905: XField3D_ForwardStep_Hex_X1_btest ................................................................   Passed    1.25 sec
        Start 906: XField3D_GaussianBump_Xq_btest
906/914 Test #906: XField3D_GaussianBump_Xq_btest ...................................................................   Passed    4.55 sec
        Start 907: XField3D_Sheet_Quad_X1_btest
907/914 Test #907: XField3D_Sheet_Quad_X1_btest .....................................................................   Passed    1.24 sec
        Start 908: XField3D_Sheet_Triangle_X1_btest
908/914 Test #908: XField3D_Sheet_Triangle_X1_btest .................................................................   Passed    1.23 sec
        Start 909: XField3D_Sphere_Triangle_X1_btest
909/914 Test #909: XField3D_Sphere_Triangle_X1_btest ................................................................   Passed    1.23 sec
        Start 910: XField4D_1Pentatope_X1_1Group_btest
910/914 Test #910: XField4D_1Pentatope_X1_1Group_btest ..............................................................   Passed    1.29 sec
        Start 911: XField4D_24Pentatope_X1_1Group_btest
911/914 Test #911: XField4D_24Pentatope_X1_1Group_btest .............................................................   Passed    1.29 sec
        Start 912: XField4D_2Pentatope_X1_1Group_btest
912/914 Test #912: XField4D_2Pentatope_X1_1Group_btest ..............................................................   Passed    1.28 sec
        Start 913: XField4D_6Pentatope_X1_1Group_NegativeTraceOrientation_btest
913/914 Test #913: XField4D_6Pentatope_X1_1Group_NegativeTraceOrientation_btest .....................................   Passed    1.29 sec
        Start 914: XField4D_Box_Pentatope_X1_btest
914/914 Test #914: XField4D_Box_Pentatope_X1_btest ..................................................................   Passed    1.70 sec

100% tests passed, 0 tests failed out of 914

Label Time Summary:
SANSCheck_unit    = 2540.37 sec*proc (914 tests)

Total Test time (real) = 2541.08 sec
[100%] Built target check_unit

real	729m15.351s
user	701m33.739s
sys	24m38.981s
+ status=0
++ find /jenkins/workspace/SANS_Nightly/builddir/undefined_gnu9/buildnode/reynolds/build/undefined_gnu9 -name Test.xml
+ mv /jenkins/workspace/SANS_Nightly/builddir/undefined_gnu9/buildnode/reynolds/build/undefined_gnu9/Testing/20220509-1621/Test.xml /jenkins/workspace/SANS_Nightly/builddir/undefined_gnu9/buildnode/reynolds/build/Test_unit_memcheck.xml
+ '[' 0 -eq 1 ']'
+ [[ undefined_gnu9 == *\r\e\l\e\a\s\e* ]]
+ [[ undefined_gnu9 == *\m\e\m\c\h\e\c\k* ]]
+ [[ undefined_gnu9 == *\u\n\d\e\f\i\n\e\d* ]]
+ make check_system 'CTESTARGS=-T Test'
[  0%] Checking style of test/system/CodeConsistency/VMSDBR2_BubbleModes_btest.cpp
[  0%] Built target VMSDBR2_BubbleModes_btest_build_vera
[  0%] Built target libtetgen
[  2%] Built target BasisFunctionLib_vera
Consolidate compiler generated dependencies of target BasisFunctionLib
[  5%] Built target BasisFunctionLib
[ 18%] Built target Discretization_vera
[ 18%] Built target Discretization
Consolidate compiler generated dependencies of target GalerkinLib
[ 18%] Built target GalerkinLib
[ 21%] Built target ErrorEstimateLib_vera
Consolidate compiler generated dependencies of target ErrorEstimateLib
[ 24%] Built target ErrorEstimateLib
[ 40%] Built target FieldLib_vera
Consolidate compiler generated dependencies of target FieldLib
[ 45%] Built target FieldLib
[ 51%] Built target DenseLinAlgLib_vera
[ 51%] Built target LinearAlgebraLib_vera
[ 51%] Built target LinearAlgebraLib
Consolidate compiler generated dependencies of target DenseLinAlgLib
[ 51%] Built target DenseLinAlgLib
[ 51%] Built target SparseLinAlgLib_vera
Consolidate compiler generated dependencies of target SparseLinAlgLib
[ 54%] Built target SparseLinAlgLib
[ 54%] Built target AFLRLib_vera
Consolidate compiler generated dependencies of target AFLRLib
[ 54%] Built target AFLRLib
[ 54%] Built target EGADSLib_vera
Consolidate compiler generated dependencies of target EGADSLib
[ 56%] Built target EGADSLib
[ 56%] Built target EGTessLib_vera
Consolidate compiler generated dependencies of target EGTessLib
[ 56%] Built target EGTessLib
[ 56%] Built target EPICLib_vera
Consolidate compiler generated dependencies of target EPICLib
[ 56%] Built target EPICLib
[ 59%] Built target NonLinearSolverLib_vera
Consolidate compiler generated dependencies of target NonLinearSolverLib
[ 59%] Built target NonLinearSolverLib
[ 59%] Built target pdeLib_vera
Consolidate compiler generated dependencies of target pdeLib
[ 59%] Built target pdeLib
[ 59%] Built target AdvectionDiffusionLib_vera
Consolidate compiler generated dependencies of target AdvectionDiffusionLib
[ 62%] Built target AdvectionDiffusionLib
[ 62%] Built target AnalyticFunctionLib_vera
Consolidate compiler generated dependencies of target AnalyticFunctionLib
[ 64%] Built target AnalyticFunctionLib
[ 67%] Built target IBL_Lib_vera
Consolidate compiler generated dependencies of target IBL_Lib
[ 67%] Built target IBL_Lib
[ 72%] Built target NSLib_vera
Consolidate compiler generated dependencies of target NSLib
[ 72%] Built target NSLib
[ 72%] Built target PythonLib_vera
Consolidate compiler generated dependencies of target PythonLib
[ 72%] Built target PythonLib
[ 72%] Built target QuadratureLib_vera
Consolidate compiler generated dependencies of target QuadratureLib
[ 72%] Built target QuadratureLib
[ 72%] Built target ContinuationLib_vera
Consolidate compiler generated dependencies of target ContinuationLib
[ 72%] Built target ContinuationLib
[ 72%] Built target SurrealLib_vera
Consolidate compiler generated dependencies of target SurrealLib
[ 72%] Built target SurrealLib
[ 72%] Built target TopologyLib_vera
Consolidate compiler generated dependencies of target TopologyLib
[ 72%] Built target TopologyLib
[ 72%] Built target toolsLib_vera
Consolidate compiler generated dependencies of target toolsLib
[ 72%] Built target toolsLib
Consolidate compiler generated dependencies of target BOOST_TEST_MAIN_OBJECT
[ 72%] Built target BOOST_TEST_MAIN_OBJECT
Consolidate compiler generated dependencies of target PETSC_FIXTURE_OBJECT
[ 72%] Built target PETSC_FIXTURE_OBJECT
Consolidate compiler generated dependencies of target UnitGridsLib
[ 75%] Built target UnitGridsLib
[ 75%] Built target SANS_PREFIX_BTEST_pch
[ 75%] Building CXX object test/system/CodeConsistency/CMakeFiles/VMSDBR2_BubbleModes_btest_OBJECT.dir/VMSDBR2_BubbleModes_btest.cpp.o
[ 75%] Built target VMSDBR2_BubbleModes_btest_OBJECT
[ 75%] Linking CXX executable VMSDBR2_BubbleModes_btest
[ 75%] Built target VMSDBR2_BubbleModes_btest_build
[ 75%] Built target HeaderCompileCheck
[ 75%] Checking style of test/system/Adaptation/SolverInterface_DGAdvective_btest.cpp
[ 75%] Built target SolverInterface_DGAdvective_btest_build_vera
[ 75%] Built target libmeshb
[ 78%] Built target AdaptationLib_vera
Consolidate compiler generated dependencies of target AdaptationLib
[ 78%] Built target AdaptationLib
Consolidate compiler generated dependencies of target DGBR2Lib
[ 78%] Built target DGBR2Lib
Consolidate compiler generated dependencies of target DGBR2ADLib
[ 78%] Built target DGBR2ADLib
Consolidate compiler generated dependencies of target DGAdvectiveLib
[ 78%] Built target DGAdvectiveLib
Consolidate compiler generated dependencies of target HDGLib
[ 81%] Built target HDGLib
[ 81%] Built target avroLib_vera
Consolidate compiler generated dependencies of target avroLib
[ 81%] Built target avroLib
[ 81%] Built target EmbeddingLib_vera
Consolidate compiler generated dependencies of target EmbeddingLib
[ 81%] Built target EmbeddingLib
[ 81%] Built target TetGenLib_vera
Consolidate compiler generated dependencies of target TetGenLib
[ 81%] Built target TetGenLib
[ 81%] Built target PointwiseLib_vera
Consolidate compiler generated dependencies of target PointwiseLib
[ 81%] Built target PointwiseLib
[ 81%] Built target refineLib_vera
Consolidate compiler generated dependencies of target refineLib
[ 81%] Built target refineLib
[ 81%] Built target libMeshbLib_vera
Consolidate compiler generated dependencies of target libMeshbLib
[ 83%] Built target libMeshbLib
[ 83%] Built target FeFloaLib_vera
Consolidate compiler generated dependencies of target FeFloaLib
[ 83%] Built target FeFloaLib
[ 83%] Built target gmshLib_vera
Consolidate compiler generated dependencies of target gmshLib
[ 83%] Built target gmshLib
[ 83%] Built target XField1DLib_vera
Consolidate compiler generated dependencies of target XField1DLib
[ 83%] Built target XField1DLib
[ 83%] Built target MPILib_vera
Consolidate compiler generated dependencies of target MPILib
[ 83%] Built target MPILib
[ 83%] Building CXX object test/system/Adaptation/CMakeFiles/SolverInterface_DGAdvective_btest_OBJECT.dir/SolverInterface_DGAdvective_btest.cpp.o
[ 83%] Built target SolverInterface_DGAdvective_btest_OBJECT
[ 83%] Linking CXX executable SolverInterface_DGAdvective_btest
[ 83%] Built target SolverInterface_DGAdvective_btest_build
[ 83%] Checking style of test/system/Adaptation/SolverInterface_DGBR2_btest.cpp
[ 83%] Built target SolverInterface_DGBR2_btest_build_vera
[ 83%] Building CXX object test/system/Adaptation/CMakeFiles/SolverInterface_DGBR2_btest_OBJECT.dir/SolverInterface_DGBR2_btest.cpp.o
[ 83%] Built target SolverInterface_DGBR2_btest_OBJECT
[ 83%] Linking CXX executable SolverInterface_DGBR2_btest
[ 83%] Built target SolverInterface_DGBR2_btest_build
[ 83%] Checking style of test/system/Adaptation/SolverInterface_Galerkin_Stabilized_btest.cpp
[ 83%] Built target SolverInterface_Galerkin_Stabilized_btest_build_vera
[ 83%] Building CXX object test/system/Adaptation/CMakeFiles/SolverInterface_Galerkin_Stabilized_btest_OBJECT.dir/SolverInterface_Galerkin_Stabilized_btest.cpp.o
[ 83%] Built target SolverInterface_Galerkin_Stabilized_btest_OBJECT
[ 83%] Linking CXX executable SolverInterface_Galerkin_Stabilized_btest
[ 83%] Built target SolverInterface_Galerkin_Stabilized_btest_build
[ 83%] Checking style of test/system/Asymptotic/Adjoint1D_DGBR2_BuckleyLeverett_ST_btest.cpp
[ 83%] Built target Adjoint1D_DGBR2_BuckleyLeverett_ST_btest_build_vera
Consolidate compiler generated dependencies of target DGBR2PorousMediaLib
[ 83%] Built target DGBR2PorousMediaLib
Consolidate compiler generated dependencies of target DGBR2RANSSALib
[ 83%] Built target DGBR2RANSSALib
[ 86%] Built target PorousMediaLib_vera
Consolidate compiler generated dependencies of target PorousMediaLib
[ 86%] Built target PorousMediaLib
[ 89%] Built target ShallowWaterLib_vera
Consolidate compiler generated dependencies of target ShallowWaterLib
[ 89%] Built target ShallowWaterLib
[ 89%] Building CXX object test/system/Asymptotic/CMakeFiles/Adjoint1D_DGBR2_BuckleyLeverett_ST_btest_OBJECT.dir/Adjoint1D_DGBR2_BuckleyLeverett_ST_btest.cpp.o
[ 89%] Built target Adjoint1D_DGBR2_BuckleyLeverett_ST_btest_OBJECT
[ 89%] Linking CXX executable Adjoint1D_DGBR2_BuckleyLeverett_ST_btest
[ 89%] Built target Adjoint1D_DGBR2_BuckleyLeverett_ST_btest_build
[ 89%] Checking style of test/system/Asymptotic/Adjoint2D_CG_Triangle_AD_Bernstein_btest.cpp
[ 89%] Built target Adjoint2D_CG_Triangle_AD_Bernstein_btest_build_vera
[ 89%] Building CXX object test/system/Asymptotic/CMakeFiles/Adjoint2D_CG_Triangle_AD_Bernstein_btest_OBJECT.dir/Adjoint2D_CG_Triangle_AD_Bernstein_btest.cpp.o
[ 89%] Built target Adjoint2D_CG_Triangle_AD_Bernstein_btest_OBJECT
[ 89%] Linking CXX executable Adjoint2D_CG_Triangle_AD_Bernstein_btest
[ 89%] Built target Adjoint2D_CG_Triangle_AD_Bernstein_btest_build
[ 89%] Checking style of test/system/Asymptotic/Adjoint2D_CG_Triangle_AD_btest.cpp
[ 89%] Built target Adjoint2D_CG_Triangle_AD_btest_build_vera
[ 89%] Building CXX object test/system/Asymptotic/CMakeFiles/Adjoint2D_CG_Triangle_AD_btest_OBJECT.dir/Adjoint2D_CG_Triangle_AD_btest.cpp.o
[ 89%] Built target Adjoint2D_CG_Triangle_AD_btest_OBJECT
[ 89%] Linking CXX executable Adjoint2D_CG_Triangle_AD_btest
[ 89%] Built target Adjoint2D_CG_Triangle_AD_btest_build
[ 89%] Checking style of test/system/Asymptotic/Adjoint2D_DGAdvective_Triangle_AD_btest.cpp
[ 89%] Built target Adjoint2D_DGAdvective_Triangle_AD_btest_build_vera
[ 89%] Building CXX object test/system/Asymptotic/CMakeFiles/Adjoint2D_DGAdvective_Triangle_AD_btest_OBJECT.dir/Adjoint2D_DGAdvective_Triangle_AD_btest.cpp.o
[ 89%] Built target Adjoint2D_DGAdvective_Triangle_AD_btest_OBJECT
[ 89%] Linking CXX executable Adjoint2D_DGAdvective_Triangle_AD_btest
[ 89%] Built target Adjoint2D_DGAdvective_Triangle_AD_btest_build
[ 89%] Checking style of test/system/Asymptotic/Adjoint2D_DGBR2_Triangle_AD_btest.cpp
[ 89%] Built target Adjoint2D_DGBR2_Triangle_AD_btest_build_vera
[ 89%] Building CXX object test/system/Asymptotic/CMakeFiles/Adjoint2D_DGBR2_Triangle_AD_btest_OBJECT.dir/Adjoint2D_DGBR2_Triangle_AD_btest.cpp.o
[ 89%] Built target Adjoint2D_DGBR2_Triangle_AD_btest_OBJECT
[ 89%] Linking CXX executable Adjoint2D_DGBR2_Triangle_AD_btest
[ 89%] Built target Adjoint2D_DGBR2_Triangle_AD_btest_build
[ 89%] Checking style of test/system/Asymptotic/Adjoint2D_HDG_Triangle_AD_mitState_btest.cpp
[ 89%] Built target Adjoint2D_HDG_Triangle_AD_mitState_btest_build_vera
[ 89%] Building CXX object test/system/Asymptotic/CMakeFiles/Adjoint2D_HDG_Triangle_AD_mitState_btest_OBJECT.dir/Adjoint2D_HDG_Triangle_AD_mitState_btest.cpp.o
[ 89%] Built target Adjoint2D_HDG_Triangle_AD_mitState_btest_OBJECT
[ 89%] Linking CXX executable Adjoint2D_HDG_Triangle_AD_mitState_btest
[ 89%] Built target Adjoint2D_HDG_Triangle_AD_mitState_btest_build
[ 89%] Checking style of test/system/Asymptotic/Adjoint2D_HDG_Triangle_AD_sansLG_btest.cpp
[ 89%] Built target Adjoint2D_HDG_Triangle_AD_sansLG_btest_build_vera
[ 89%] Building CXX object test/system/Asymptotic/CMakeFiles/Adjoint2D_HDG_Triangle_AD_sansLG_btest_OBJECT.dir/Adjoint2D_HDG_Triangle_AD_sansLG_btest.cpp.o
[ 89%] Built target Adjoint2D_HDG_Triangle_AD_sansLG_btest_OBJECT
[ 89%] Linking CXX executable Adjoint2D_HDG_Triangle_AD_sansLG_btest
[ 89%] Built target Adjoint2D_HDG_Triangle_AD_sansLG_btest_build
[ 89%] Checking style of test/system/Asymptotic/ErrorEstimateOrder_1D_CG_Line_AD_btest.cpp
[ 89%] Built target ErrorEstimateOrder_1D_CG_Line_AD_btest_build_vera
[ 89%] Building CXX object test/system/Asymptotic/CMakeFiles/ErrorEstimateOrder_1D_CG_Line_AD_btest_OBJECT.dir/ErrorEstimateOrder_1D_CG_Line_AD_btest.cpp.o
[ 89%] Built target ErrorEstimateOrder_1D_CG_Line_AD_btest_OBJECT
[ 89%] Linking CXX executable ErrorEstimateOrder_1D_CG_Line_AD_btest
[ 89%] Built target ErrorEstimateOrder_1D_CG_Line_AD_btest_build
[ 89%] Checking style of test/system/Asymptotic/ErrorEstimateOrder_1D_DGBR2_Line_AD_btest.cpp
[ 89%] Built target ErrorEstimateOrder_1D_DGBR2_Line_AD_btest_build_vera
[ 89%] Building CXX object test/system/Asymptotic/CMakeFiles/ErrorEstimateOrder_1D_DGBR2_Line_AD_btest_OBJECT.dir/ErrorEstimateOrder_1D_DGBR2_Line_AD_btest.cpp.o
[ 89%] Built target ErrorEstimateOrder_1D_DGBR2_Line_AD_btest_OBJECT
[ 89%] Linking CXX executable ErrorEstimateOrder_1D_DGBR2_Line_AD_btest
[ 89%] Built target ErrorEstimateOrder_1D_DGBR2_Line_AD_btest_build
[ 89%] Checking style of test/system/Asymptotic/ErrorEstimateOrder_2D_CG_Nodal_Triangle_AD_Bernstein_btest.cpp
[ 89%] Built target ErrorEstimateOrder_2D_CG_Nodal_Triangle_AD_Bernstein_btest_build_vera
[ 89%] Building CXX object test/system/Asymptotic/CMakeFiles/ErrorEstimateOrder_2D_CG_Nodal_Triangle_AD_Bernstein_btest_OBJECT.dir/ErrorEstimateOrder_2D_CG_Nodal_Triangle_AD_Bernstein_btest.cpp.o
[ 89%] Built target ErrorEstimateOrder_2D_CG_Nodal_Triangle_AD_Bernstein_btest_OBJECT
[ 89%] Linking CXX executable ErrorEstimateOrder_2D_CG_Nodal_Triangle_AD_Bernstein_btest
[ 89%] Built target ErrorEstimateOrder_2D_CG_Nodal_Triangle_AD_Bernstein_btest_build
[ 89%] Checking style of test/system/Asymptotic/ErrorEstimateOrder_2D_CG_Nodal_Triangle_AD_btest.cpp
[ 89%] Built target ErrorEstimateOrder_2D_CG_Nodal_Triangle_AD_btest_build_vera
[ 89%] Building CXX object test/system/Asymptotic/CMakeFiles/ErrorEstimateOrder_2D_CG_Nodal_Triangle_AD_btest_OBJECT.dir/ErrorEstimateOrder_2D_CG_Nodal_Triangle_AD_btest.cpp.o
[ 89%] Built target ErrorEstimateOrder_2D_CG_Nodal_Triangle_AD_btest_OBJECT
[ 89%] Linking CXX executable ErrorEstimateOrder_2D_CG_Nodal_Triangle_AD_btest
[ 89%] Built target ErrorEstimateOrder_2D_CG_Nodal_Triangle_AD_btest_build
[ 89%] Checking style of test/system/Asymptotic/ErrorEstimateOrder_2D_CG_Triangle_AD_btest.cpp
[ 89%] Built target ErrorEstimateOrder_2D_CG_Triangle_AD_btest_build_vera
[ 89%] Building CXX object test/system/Asymptotic/CMakeFiles/ErrorEstimateOrder_2D_CG_Triangle_AD_btest_OBJECT.dir/ErrorEstimateOrder_2D_CG_Triangle_AD_btest.cpp.o
[ 89%] Built target ErrorEstimateOrder_2D_CG_Triangle_AD_btest_OBJECT
[ 89%] Linking CXX executable ErrorEstimateOrder_2D_CG_Triangle_AD_btest
[ 89%] Built target ErrorEstimateOrder_2D_CG_Triangle_AD_btest_build
[ 89%] Checking style of test/system/Asymptotic/ErrorEstimateOrder_2D_CG_Triangle_RD_btest.cpp
[ 89%] Built target ErrorEstimateOrder_2D_CG_Triangle_RD_btest_build_vera
[ 89%] Building CXX object test/system/Asymptotic/CMakeFiles/ErrorEstimateOrder_2D_CG_Triangle_RD_btest_OBJECT.dir/ErrorEstimateOrder_2D_CG_Triangle_RD_btest.cpp.o
[ 89%] Built target ErrorEstimateOrder_2D_CG_Triangle_RD_btest_OBJECT
[ 89%] Linking CXX executable ErrorEstimateOrder_2D_CG_Triangle_RD_btest
[ 89%] Built target ErrorEstimateOrder_2D_CG_Triangle_RD_btest_build
[ 89%] Checking style of test/system/Asymptotic/ErrorEstimateOrder_2D_DGAdvective_Triangle_AD_btest.cpp
[ 89%] Built target ErrorEstimateOrder_2D_DGAdvective_Triangle_AD_btest_build_vera
[ 89%] Building CXX object test/system/Asymptotic/CMakeFiles/ErrorEstimateOrder_2D_DGAdvective_Triangle_AD_btest_OBJECT.dir/ErrorEstimateOrder_2D_DGAdvective_Triangle_AD_btest.cpp.o
[ 89%] Built target ErrorEstimateOrder_2D_DGAdvective_Triangle_AD_btest_OBJECT
[ 89%] Linking CXX executable ErrorEstimateOrder_2D_DGAdvective_Triangle_AD_btest
[ 89%] Built target ErrorEstimateOrder_2D_DGAdvective_Triangle_AD_btest_build
[ 89%] Checking style of test/system/Asymptotic/ErrorEstimateOrder_2D_DGBR2_Triangle_AD_btest.cpp
[ 89%] Built target ErrorEstimateOrder_2D_DGBR2_Triangle_AD_btest_build_vera
[ 89%] Building CXX object test/system/Asymptotic/CMakeFiles/ErrorEstimateOrder_2D_DGBR2_Triangle_AD_btest_OBJECT.dir/ErrorEstimateOrder_2D_DGBR2_Triangle_AD_btest.cpp.o
[ 89%] Built target ErrorEstimateOrder_2D_DGBR2_Triangle_AD_btest_OBJECT
[ 89%] Linking CXX executable ErrorEstimateOrder_2D_DGBR2_Triangle_AD_btest
[ 89%] Built target ErrorEstimateOrder_2D_DGBR2_Triangle_AD_btest_build
[ 89%] Checking style of test/system/Asymptotic/ErrorEstimateOrder_2D_HDG_Triangle_AD_btest.cpp
[ 89%] Built target ErrorEstimateOrder_2D_HDG_Triangle_AD_btest_build_vera
[ 89%] Building CXX object test/system/Asymptotic/CMakeFiles/ErrorEstimateOrder_2D_HDG_Triangle_AD_btest_OBJECT.dir/ErrorEstimateOrder_2D_HDG_Triangle_AD_btest.cpp.o
[ 89%] Built target ErrorEstimateOrder_2D_HDG_Triangle_AD_btest_OBJECT
[ 89%] Linking CXX executable ErrorEstimateOrder_2D_HDG_Triangle_AD_btest
[ 89%] Built target ErrorEstimateOrder_2D_HDG_Triangle_AD_btest_build
[ 89%] Checking style of test/system/Asymptotic/ErrorEstimateOrder_3D_CG_Tet_AD_btest.cpp
[ 89%] Built target ErrorEstimateOrder_3D_CG_Tet_AD_btest_build_vera
[ 89%] Building CXX object test/system/Asymptotic/CMakeFiles/ErrorEstimateOrder_3D_CG_Tet_AD_btest_OBJECT.dir/ErrorEstimateOrder_3D_CG_Tet_AD_btest.cpp.o
[ 89%] Built target ErrorEstimateOrder_3D_CG_Tet_AD_btest_OBJECT
[ 89%] Linking CXX executable ErrorEstimateOrder_3D_CG_Tet_AD_btest
[ 89%] Built target ErrorEstimateOrder_3D_CG_Tet_AD_btest_build
[ 89%] Checking style of test/system/Asymptotic/ErrorOrder_1D_CG_AD_BDF_btest.cpp
[ 89%] Built target ErrorOrder_1D_CG_AD_BDF_btest_build_vera
[ 89%] Building CXX object test/system/Asymptotic/CMakeFiles/ErrorOrder_1D_CG_AD_BDF_btest_OBJECT.dir/ErrorOrder_1D_CG_AD_BDF_btest.cpp.o
[ 89%] Built target ErrorOrder_1D_CG_AD_BDF_btest_OBJECT
[ 89%] Linking CXX executable ErrorOrder_1D_CG_AD_BDF_btest
[ 89%] Built target ErrorOrder_1D_CG_AD_BDF_btest_build
[ 89%] Checking style of test/system/Asymptotic/ErrorOrder_1D_CG_AD_Bernstein_btest.cpp
[ 89%] Built target ErrorOrder_1D_CG_AD_Bernstein_btest_build_vera
[ 89%] Building CXX object test/system/Asymptotic/CMakeFiles/ErrorOrder_1D_CG_AD_Bernstein_btest_OBJECT.dir/ErrorOrder_1D_CG_AD_Bernstein_btest.cpp.o
[ 89%] Built target ErrorOrder_1D_CG_AD_Bernstein_btest_OBJECT
[ 89%] Linking CXX executable ErrorOrder_1D_CG_AD_Bernstein_btest
[ 89%] Built target ErrorOrder_1D_CG_AD_Bernstein_btest_build
[ 89%] Checking style of test/system/Asymptotic/ErrorOrder_1D_CG_AD_btest.cpp
[ 89%] Built target ErrorOrder_1D_CG_AD_btest_build_vera
[ 89%] Building CXX object test/system/Asymptotic/CMakeFiles/ErrorOrder_1D_CG_AD_btest_OBJECT.dir/ErrorOrder_1D_CG_AD_btest.cpp.o
[ 89%] Built target ErrorOrder_1D_CG_AD_btest_OBJECT
[ 89%] Linking CXX executable ErrorOrder_1D_CG_AD_btest
[ 89%] Built target ErrorOrder_1D_CG_AD_btest_build
[ 89%] Checking style of test/system/Asymptotic/ErrorOrder_1D_DGAdvective_ShallowWater_btest.cpp
[ 89%] Built target ErrorOrder_1D_DGAdvective_ShallowWater_btest_build_vera
[ 89%] Building CXX object test/system/Asymptotic/CMakeFiles/ErrorOrder_1D_DGAdvective_ShallowWater_btest_OBJECT.dir/ErrorOrder_1D_DGAdvective_ShallowWater_btest.cpp.o
[ 89%] Built target ErrorOrder_1D_DGAdvective_ShallowWater_btest_OBJECT
[ 89%] Linking CXX executable ErrorOrder_1D_DGAdvective_ShallowWater_btest
[ 89%] Built target ErrorOrder_1D_DGAdvective_ShallowWater_btest_build
[ 89%] Checking style of test/system/Asymptotic/ErrorOrder_1D_DGBR2_AD_BDF_btest.cpp
[ 89%] Built target ErrorOrder_1D_DGBR2_AD_BDF_btest_build_vera
[ 89%] Building CXX object test/system/Asymptotic/CMakeFiles/ErrorOrder_1D_DGBR2_AD_BDF_btest_OBJECT.dir/ErrorOrder_1D_DGBR2_AD_BDF_btest.cpp.o
[ 89%] Built target ErrorOrder_1D_DGBR2_AD_BDF_btest_OBJECT
[ 89%] Linking CXX executable ErrorOrder_1D_DGBR2_AD_BDF_btest
[ 89%] Built target ErrorOrder_1D_DGBR2_AD_BDF_btest_build
[ 89%] Checking style of test/system/Asymptotic/ErrorOrder_1D_DGBR2_AD_Bernstein_btest.cpp
[ 89%] Built target ErrorOrder_1D_DGBR2_AD_Bernstein_btest_build_vera
[ 89%] Building CXX object test/system/Asymptotic/CMakeFiles/ErrorOrder_1D_DGBR2_AD_Bernstein_btest_OBJECT.dir/ErrorOrder_1D_DGBR2_AD_Bernstein_btest.cpp.o
[ 89%] Built target ErrorOrder_1D_DGBR2_AD_Bernstein_btest_OBJECT
[ 89%] Linking CXX executable ErrorOrder_1D_DGBR2_AD_Bernstein_btest
[ 89%] Built target ErrorOrder_1D_DGBR2_AD_Bernstein_btest_build
[ 89%] Checking style of test/system/Asymptotic/ErrorOrder_1D_DGBR2_AD_HB_btest.cpp
[ 89%] Built target ErrorOrder_1D_DGBR2_AD_HB_btest_build_vera
[ 89%] Building CXX object test/system/Asymptotic/CMakeFiles/ErrorOrder_1D_DGBR2_AD_HB_btest_OBJECT.dir/ErrorOrder_1D_DGBR2_AD_HB_btest.cpp.o
[ 89%] Built target ErrorOrder_1D_DGBR2_AD_HB_btest_OBJECT
[ 89%] Linking CXX executable ErrorOrder_1D_DGBR2_AD_HB_btest
[ 89%] Built target ErrorOrder_1D_DGBR2_AD_HB_btest_build
[ 89%] Checking style of test/system/Asymptotic/ErrorOrder_1D_DGBR2_AD_btest.cpp
[ 89%] Built target ErrorOrder_1D_DGBR2_AD_btest_build_vera
[ 89%] Building CXX object test/system/Asymptotic/CMakeFiles/ErrorOrder_1D_DGBR2_AD_btest_OBJECT.dir/ErrorOrder_1D_DGBR2_AD_btest.cpp.o
[ 89%] Built target ErrorOrder_1D_DGBR2_AD_btest_OBJECT
[ 89%] Linking CXX executable ErrorOrder_1D_DGBR2_AD_btest
[ 89%] Built target ErrorOrder_1D_DGBR2_AD_btest_build
[ 89%] Checking style of test/system/Asymptotic/ErrorOrder_1D_DGBR2_BuckleyLeverett_ST_btest.cpp
[ 89%] Built target ErrorOrder_1D_DGBR2_BuckleyLeverett_ST_btest_build_vera
[ 89%] Building CXX object test/system/Asymptotic/CMakeFiles/ErrorOrder_1D_DGBR2_BuckleyLeverett_ST_btest_OBJECT.dir/ErrorOrder_1D_DGBR2_BuckleyLeverett_ST_btest.cpp.o
[ 89%] Built target ErrorOrder_1D_DGBR2_BuckleyLeverett_ST_btest_OBJECT
[ 89%] Linking CXX executable ErrorOrder_1D_DGBR2_BuckleyLeverett_ST_btest
[ 89%] Built target ErrorOrder_1D_DGBR2_BuckleyLeverett_ST_btest_build
[ 89%] Checking style of test/system/Asymptotic/ErrorOrder_1D_DGBR2_TwoPhase_ST_btest.cpp
[ 89%] Built target ErrorOrder_1D_DGBR2_TwoPhase_ST_btest_build_vera
[ 89%] Building CXX object test/system/Asymptotic/CMakeFiles/ErrorOrder_1D_DGBR2_TwoPhase_ST_btest_OBJECT.dir/ErrorOrder_1D_DGBR2_TwoPhase_ST_btest.cpp.o
[ 89%] Built target ErrorOrder_1D_DGBR2_TwoPhase_ST_btest_OBJECT
[ 89%] Linking CXX executable ErrorOrder_1D_DGBR2_TwoPhase_ST_btest
[ 89%] Built target ErrorOrder_1D_DGBR2_TwoPhase_ST_btest_build
[ 89%] Checking style of test/system/Asymptotic/ErrorOrder_1D_HDGAdvective_Advection_btest.cpp
[ 89%] Built target ErrorOrder_1D_HDGAdvective_Advection_btest_build_vera
[ 89%] Building CXX object test/system/Asymptotic/CMakeFiles/ErrorOrder_1D_HDGAdvective_Advection_btest_OBJECT.dir/ErrorOrder_1D_HDGAdvective_Advection_btest.cpp.o
[ 89%] Built target ErrorOrder_1D_HDGAdvective_Advection_btest_OBJECT
[ 89%] Linking CXX executable ErrorOrder_1D_HDGAdvective_Advection_btest
[ 89%] Built target ErrorOrder_1D_HDGAdvective_Advection_btest_build
[ 89%] Checking style of test/system/Asymptotic/ErrorOrder_1D_HDG_AD_BDF_btest.cpp
[ 89%] Built target ErrorOrder_1D_HDG_AD_BDF_btest_build_vera
[ 89%] Building CXX object test/system/Asymptotic/CMakeFiles/ErrorOrder_1D_HDG_AD_BDF_btest_OBJECT.dir/ErrorOrder_1D_HDG_AD_BDF_btest.cpp.o
[ 89%] Built target ErrorOrder_1D_HDG_AD_BDF_btest_OBJECT
[ 89%] Linking CXX executable ErrorOrder_1D_HDG_AD_BDF_btest
[ 89%] Built target ErrorOrder_1D_HDG_AD_BDF_btest_build
[ 89%] Checking style of test/system/Asymptotic/ErrorOrder_1D_HDG_AD_btest.cpp
[ 89%] Built target ErrorOrder_1D_HDG_AD_btest_build_vera
[ 89%] Building CXX object test/system/Asymptotic/CMakeFiles/ErrorOrder_1D_HDG_AD_btest_OBJECT.dir/ErrorOrder_1D_HDG_AD_btest.cpp.o
[ 89%] Built target ErrorOrder_1D_HDG_AD_btest_OBJECT
[ 89%] Linking CXX executable ErrorOrder_1D_HDG_AD_btest
[ 89%] Built target ErrorOrder_1D_HDG_AD_btest_build
[ 89%] Checking style of test/system/Asymptotic/ErrorOrder_2D_CGStabilized_RANS_MMS_btest.cpp
[ 89%] Built target ErrorOrder_2D_CGStabilized_RANS_MMS_btest_build_vera
[ 89%] Building CXX object test/system/Asymptotic/CMakeFiles/ErrorOrder_2D_CGStabilized_RANS_MMS_btest_OBJECT.dir/ErrorOrder_2D_CGStabilized_RANS_MMS_btest.cpp.o
In file included from /jenkins/workspace/SANS_Nightly/builddir/undefined_gnu9/buildnode/reynolds/test/system/Asymptotic/ErrorOrder_2D_CGStabilized_RANS_MMS_btest.cpp:25:
/jenkins/workspace/SANS_Nightly/builddir/undefined_gnu9/buildnode/reynolds/src/pde/NS/PDERANSSA2D.h: In member function ‘void SANS::PDERANSSA2D<PDETraitsSize, PDETraitsModel>::diffusionViscousGradient(const Real&, const Real&, const Real&, const Real&, SANS::PDERANSSA2D<PDETraitsSize, PDETraitsModel>::ArrayQ<T>&, SANS::PDERANSSA2D<PDETraitsSize, PDETraitsModel>::ArrayQ<Tg>&, SANS::PDERANSSA2D<PDETraitsSize, PDETraitsModel>::ArrayQ<Tg>&, SANS::PDERANSSA2D<PDETraitsSize, PDETraitsModel>::ArrayQ<Tf>&, SANS::PDERANSSA2D<PDETraitsSize, PDETraitsModel>::ArrayQ<Tf>&, SANS::PDERANSSA2D<PDETraitsSize, PDETraitsModel>::ArrayQ<Tf>&, SANS::PDERANSSA2D<PDETraitsSize, PDETraitsModel>::MatrixQ<Tk>&, SANS::PDERANSSA2D<PDETraitsSize, PDETraitsModel>::MatrixQ<Tk>&, SANS::PDERANSSA2D<PDETraitsSize, PDETraitsModel>::MatrixQ<Tk>&, SANS::PDERANSSA2D<PDETraitsSize, PDETraitsModel>::MatrixQ<Tk>&, SANS::PDERANSSA2D<PDETraitsSize, PDETraitsModel>::MatrixQ<Tk>&, SANS::PDERANSSA2D<PDETraitsSize, PDETraitsModel>::MatrixQ<Tk>&) const [with Tq = SANS::SurrealS<5, double>; Tg = double; Th = double; Tk = SANS::SurrealS<5, double>; PDETraitsSize = SANS::TraitsSizeRANSSA; PDETraitsModel = SANS::TraitsModelRANSSA<SANS::QTypePrimitiveRhoPressure, SANS::GasModel, SANS::ViscosityModel_Const, SANS::ThermalConductivityModel>]’:
/jenkins/workspace/SANS_Nightly/builddir/undefined_gnu9/buildnode/reynolds/src/pde/NS/PDERANSSA2D.h:2029:1: note: variable tracking size limit exceeded with ‘-fvar-tracking-assignments’, retrying without
 2029 | PDERANSSA2D<PDETraitsSize, PDETraitsModel>::diffusionViscousGradient(
      | ^~~~~~~~~~~~~~~~~~~~~~~~~~~~~~~~~~~~~~~~~~
/jenkins/workspace/SANS_Nightly/builddir/undefined_gnu9/buildnode/reynolds/src/pde/NS/PDERANSSA2D.h: In member function ‘void SANS::PDERANSSA2D<PDETraitsSize, PDETraitsModel>::jacobianGradientSourceGradient(const Real&, const Real&, const Real&, const Real&, SANS::PDERANSSA2D<PDETraitsSize, PDETraitsModel>::ArrayQ<T>&, SANS::PDERANSSA2D<PDETraitsSize, PDETraitsModel>::ArrayQ<Tg>&, SANS::PDERANSSA2D<PDETraitsSize, PDETraitsModel>::ArrayQ<Tg>&, SANS::PDERANSSA2D<PDETraitsSize, PDETraitsModel>::ArrayQ<Tf>&, SANS::PDERANSSA2D<PDETraitsSize, PDETraitsModel>::ArrayQ<Tf>&, SANS::PDERANSSA2D<PDETraitsSize, PDETraitsModel>::ArrayQ<Tf>&, SANS::PDERANSSA2D<PDETraitsSize, PDETraitsModel>::MatrixQ<Tk>&) const [with Tq = SANS::SurrealS<5, double>; Tg = double; Th = double; Ts = SANS::SurrealS<5, double>; PDETraitsSize = SANS::TraitsSizeRANSSA; PDETraitsModel = SANS::TraitsModelRANSSA<SANS::QTypePrimitiveRhoPressure, SANS::GasModel, SANS::ViscosityModel_Const, SANS::ThermalConductivityModel>]’:
/jenkins/workspace/SANS_Nightly/builddir/undefined_gnu9/buildnode/reynolds/src/pde/NS/PDERANSSA2D.h:4242:1: note: variable tracking size limit exceeded with ‘-fvar-tracking-assignments’, retrying without
 4242 | PDERANSSA2D<PDETraitsSize, PDETraitsModel>::jacobianGradientSourceGradient(
      | ^~~~~~~~~~~~~~~~~~~~~~~~~~~~~~~~~~~~~~~~~~
/jenkins/workspace/SANS_Nightly/builddir/undefined_gnu9/buildnode/reynolds/src/pde/NS/PDERANSSA2D.h: In member function ‘void SANS::PDERANSSA2D<PDETraitsSize, PDETraitsModel>::diffusionViscousGradient(const Real&, const Real&, const Real&, const Real&, SANS::PDERANSSA2D<PDETraitsSize, PDETraitsModel>::ArrayQ<T>&, SANS::PDERANSSA2D<PDETraitsSize, PDETraitsModel>::ArrayQ<Tg>&, SANS::PDERANSSA2D<PDETraitsSize, PDETraitsModel>::ArrayQ<Tg>&, SANS::PDERANSSA2D<PDETraitsSize, PDETraitsModel>::ArrayQ<Tf>&, SANS::PDERANSSA2D<PDETraitsSize, PDETraitsModel>::ArrayQ<Tf>&, SANS::PDERANSSA2D<PDETraitsSize, PDETraitsModel>::ArrayQ<Tf>&, SANS::PDERANSSA2D<PDETraitsSize, PDETraitsModel>::MatrixQ<Tk>&, SANS::PDERANSSA2D<PDETraitsSize, PDETraitsModel>::MatrixQ<Tk>&, SANS::PDERANSSA2D<PDETraitsSize, PDETraitsModel>::MatrixQ<Tk>&, SANS::PDERANSSA2D<PDETraitsSize, PDETraitsModel>::MatrixQ<Tk>&, SANS::PDERANSSA2D<PDETraitsSize, PDETraitsModel>::MatrixQ<Tk>&, SANS::PDERANSSA2D<PDETraitsSize, PDETraitsModel>::MatrixQ<Tk>&) const [with Tq = double; Tg = SANS::SurrealS<5, double>; Th = double; Tk = SANS::SurrealS<5, double>; PDETraitsSize = SANS::TraitsSizeRANSSA; PDETraitsModel = SANS::TraitsModelRANSSA<SANS::QTypePrimitiveRhoPressure, SANS::GasModel, SANS::ViscosityModel_Const, SANS::ThermalConductivityModel>]’:
/jenkins/workspace/SANS_Nightly/builddir/undefined_gnu9/buildnode/reynolds/src/pde/NS/PDERANSSA2D.h:2029:1: note: variable tracking size limit exceeded with ‘-fvar-tracking-assignments’, retrying without
 2029 | PDERANSSA2D<PDETraitsSize, PDETraitsModel>::diffusionViscousGradient(
      | ^~~~~~~~~~~~~~~~~~~~~~~~~~~~~~~~~~~~~~~~~~
[ 89%] Built target ErrorOrder_2D_CGStabilized_RANS_MMS_btest_OBJECT
[ 89%] Linking CXX executable ErrorOrder_2D_CGStabilized_RANS_MMS_btest
[ 89%] Built target ErrorOrder_2D_CGStabilized_RANS_MMS_btest_build
[ 89%] Checking style of test/system/Asymptotic/ErrorOrder_2D_CG_Quad_AD_btest.cpp
[ 89%] Built target ErrorOrder_2D_CG_Quad_AD_btest_build_vera
[ 89%] Building CXX object test/system/Asymptotic/CMakeFiles/ErrorOrder_2D_CG_Quad_AD_btest_OBJECT.dir/ErrorOrder_2D_CG_Quad_AD_btest.cpp.o
[ 89%] Built target ErrorOrder_2D_CG_Quad_AD_btest_OBJECT
[ 89%] Linking CXX executable ErrorOrder_2D_CG_Quad_AD_btest
[ 89%] Built target ErrorOrder_2D_CG_Quad_AD_btest_build
[ 89%] Checking style of test/system/Asymptotic/ErrorOrder_2D_CG_Triangle_AD_Bernstein_btest.cpp
[ 89%] Built target ErrorOrder_2D_CG_Triangle_AD_Bernstein_btest_build_vera
[ 89%] Building CXX object test/system/Asymptotic/CMakeFiles/ErrorOrder_2D_CG_Triangle_AD_Bernstein_btest_OBJECT.dir/ErrorOrder_2D_CG_Triangle_AD_Bernstein_btest.cpp.o
[ 89%] Built target ErrorOrder_2D_CG_Triangle_AD_Bernstein_btest_OBJECT
[ 89%] Linking CXX executable ErrorOrder_2D_CG_Triangle_AD_Bernstein_btest
[ 89%] Built target ErrorOrder_2D_CG_Triangle_AD_Bernstein_btest_build
[ 89%] Checking style of test/system/Asymptotic/ErrorOrder_2D_CG_Triangle_AD_btest.cpp
[ 89%] Built target ErrorOrder_2D_CG_Triangle_AD_btest_build_vera
[ 89%] Building CXX object test/system/Asymptotic/CMakeFiles/ErrorOrder_2D_CG_Triangle_AD_btest_OBJECT.dir/ErrorOrder_2D_CG_Triangle_AD_btest.cpp.o
[ 89%] Built target ErrorOrder_2D_CG_Triangle_AD_btest_OBJECT
[ 89%] Linking CXX executable ErrorOrder_2D_CG_Triangle_AD_btest
[ 89%] Built target ErrorOrder_2D_CG_Triangle_AD_btest_build
[ 89%] Checking style of test/system/Asymptotic/ErrorOrder_2D_DGAdvective_Annulus_Quad_btest.cpp
[ 89%] Built target ErrorOrder_2D_DGAdvective_Annulus_Quad_btest_build_vera
[ 89%] Building CXX object test/system/Asymptotic/CMakeFiles/ErrorOrder_2D_DGAdvective_Annulus_Quad_btest_OBJECT.dir/ErrorOrder_2D_DGAdvective_Annulus_Quad_btest.cpp.o
[ 89%] Built target ErrorOrder_2D_DGAdvective_Annulus_Quad_btest_OBJECT
[ 89%] Linking CXX executable ErrorOrder_2D_DGAdvective_Annulus_Quad_btest
[ 89%] Built target ErrorOrder_2D_DGAdvective_Annulus_Quad_btest_build
[ 89%] Checking style of test/system/Asymptotic/ErrorOrder_2D_DGAdvective_Annulus_Triangle_btest.cpp
[ 89%] Built target ErrorOrder_2D_DGAdvective_Annulus_Triangle_btest_build_vera
[ 89%] Building CXX object test/system/Asymptotic/CMakeFiles/ErrorOrder_2D_DGAdvective_Annulus_Triangle_btest_OBJECT.dir/ErrorOrder_2D_DGAdvective_Annulus_Triangle_btest.cpp.o
[ 89%] Built target ErrorOrder_2D_DGAdvective_Annulus_Triangle_btest_OBJECT
[ 89%] Linking CXX executable ErrorOrder_2D_DGAdvective_Annulus_Triangle_btest
[ 89%] Built target ErrorOrder_2D_DGAdvective_Annulus_Triangle_btest_build
[ 89%] Checking style of test/system/Asymptotic/ErrorOrder_2D_DGAdvective_Circle_Line_AD_btest.cpp
[ 89%] Built target ErrorOrder_2D_DGAdvective_Circle_Line_AD_btest_build_vera
[ 89%] Building CXX object test/system/Asymptotic/CMakeFiles/ErrorOrder_2D_DGAdvective_Circle_Line_AD_btest_OBJECT.dir/ErrorOrder_2D_DGAdvective_Circle_Line_AD_btest.cpp.o
[ 89%] Built target ErrorOrder_2D_DGAdvective_Circle_Line_AD_btest_OBJECT
[ 89%] Linking CXX executable ErrorOrder_2D_DGAdvective_Circle_Line_AD_btest
[ 89%] Built target ErrorOrder_2D_DGAdvective_Circle_Line_AD_btest_build
[ 89%] Checking style of test/system/Asymptotic/ErrorOrder_2D_DGAdvective_Circle_Line_ShallowWater_btest.cpp
[ 89%] Built target ErrorOrder_2D_DGAdvective_Circle_Line_ShallowWater_btest_build_vera
[ 89%] Building CXX object test/system/Asymptotic/CMakeFiles/ErrorOrder_2D_DGAdvective_Circle_Line_ShallowWater_btest_OBJECT.dir/ErrorOrder_2D_DGAdvective_Circle_Line_ShallowWater_btest.cpp.o
[ 89%] Built target ErrorOrder_2D_DGAdvective_Circle_Line_ShallowWater_btest_OBJECT
[ 89%] Linking CXX executable ErrorOrder_2D_DGAdvective_Circle_Line_ShallowWater_btest
[ 89%] Built target ErrorOrder_2D_DGAdvective_Circle_Line_ShallowWater_btest_build
[ 89%] Checking style of test/system/Asymptotic/ErrorOrder_2D_DGAdvective_Flat_Line_AD_btest.cpp
[ 89%] Built target ErrorOrder_2D_DGAdvective_Flat_Line_AD_btest_build_vera
[ 89%] Building CXX object test/system/Asymptotic/CMakeFiles/ErrorOrder_2D_DGAdvective_Flat_Line_AD_btest_OBJECT.dir/ErrorOrder_2D_DGAdvective_Flat_Line_AD_btest.cpp.o
[ 89%] Built target ErrorOrder_2D_DGAdvective_Flat_Line_AD_btest_OBJECT
[ 89%] Linking CXX executable ErrorOrder_2D_DGAdvective_Flat_Line_AD_btest
[ 89%] Built target ErrorOrder_2D_DGAdvective_Flat_Line_AD_btest_build
[ 89%] Checking style of test/system/Asymptotic/ErrorOrder_2D_DGBR2_RANS_MMS_btest.cpp
[ 89%] Built target ErrorOrder_2D_DGBR2_RANS_MMS_btest_build_vera
[ 89%] Building CXX object test/system/Asymptotic/CMakeFiles/ErrorOrder_2D_DGBR2_RANS_MMS_btest_OBJECT.dir/ErrorOrder_2D_DGBR2_RANS_MMS_btest.cpp.o
[ 89%] Built target ErrorOrder_2D_DGBR2_RANS_MMS_btest_OBJECT
[ 89%] Linking CXX executable ErrorOrder_2D_DGBR2_RANS_MMS_btest
[ 89%] Built target ErrorOrder_2D_DGBR2_RANS_MMS_btest_build
[ 89%] Checking style of test/system/Asymptotic/ErrorOrder_2D_DGBR2_Triangle_AD_Bernstein_btest.cpp
[ 89%] Built target ErrorOrder_2D_DGBR2_Triangle_AD_Bernstein_btest_build_vera
[ 89%] Building CXX object test/system/Asymptotic/CMakeFiles/ErrorOrder_2D_DGBR2_Triangle_AD_Bernstein_btest_OBJECT.dir/ErrorOrder_2D_DGBR2_Triangle_AD_Bernstein_btest.cpp.o
[ 89%] Built target ErrorOrder_2D_DGBR2_Triangle_AD_Bernstein_btest_OBJECT
[ 89%] Linking CXX executable ErrorOrder_2D_DGBR2_Triangle_AD_Bernstein_btest
[ 89%] Built target ErrorOrder_2D_DGBR2_Triangle_AD_Bernstein_btest_build
[ 89%] Checking style of test/system/Asymptotic/ErrorOrder_2D_DGBR2_Triangle_AD_btest.cpp
[ 89%] Built target ErrorOrder_2D_DGBR2_Triangle_AD_btest_build_vera
[ 89%] Building CXX object test/system/Asymptotic/CMakeFiles/ErrorOrder_2D_DGBR2_Triangle_AD_btest_OBJECT.dir/ErrorOrder_2D_DGBR2_Triangle_AD_btest.cpp.o
[ 89%] Built target ErrorOrder_2D_DGBR2_Triangle_AD_btest_OBJECT
[ 89%] Linking CXX executable ErrorOrder_2D_DGBR2_Triangle_AD_btest
[ 89%] Built target ErrorOrder_2D_DGBR2_Triangle_AD_btest_build
[ 89%] Checking style of test/system/Asymptotic/ErrorOrder_2D_EDG_Triangle_AD_btest.cpp
[ 89%] Built target ErrorOrder_2D_EDG_Triangle_AD_btest_build_vera
[ 89%] Building CXX object test/system/Asymptotic/CMakeFiles/ErrorOrder_2D_EDG_Triangle_AD_btest_OBJECT.dir/ErrorOrder_2D_EDG_Triangle_AD_btest.cpp.o
[ 89%] Built target ErrorOrder_2D_EDG_Triangle_AD_btest_OBJECT
[ 89%] Linking CXX executable ErrorOrder_2D_EDG_Triangle_AD_btest
[ 89%] Built target ErrorOrder_2D_EDG_Triangle_AD_btest_build
[ 89%] Checking style of test/system/Asymptotic/ErrorOrder_2D_HDG_Triangle_AD_btest.cpp
[ 89%] Built target ErrorOrder_2D_HDG_Triangle_AD_btest_build_vera
[ 89%] Building CXX object test/system/Asymptotic/CMakeFiles/ErrorOrder_2D_HDG_Triangle_AD_btest_OBJECT.dir/ErrorOrder_2D_HDG_Triangle_AD_btest.cpp.o
[ 89%] Built target ErrorOrder_2D_HDG_Triangle_AD_btest_OBJECT
[ 89%] Linking CXX executable ErrorOrder_2D_HDG_Triangle_AD_btest
[ 89%] Built target ErrorOrder_2D_HDG_Triangle_AD_btest_build
[ 89%] Checking style of test/system/Asymptotic/ErrorOrder_2D_L2Project_Bernstein_btest.cpp
[ 89%] Built target ErrorOrder_2D_L2Project_Bernstein_btest_build_vera
[ 89%] Building CXX object test/system/Asymptotic/CMakeFiles/ErrorOrder_2D_L2Project_Bernstein_btest_OBJECT.dir/ErrorOrder_2D_L2Project_Bernstein_btest.cpp.o
[ 89%] Built target ErrorOrder_2D_L2Project_Bernstein_btest_OBJECT
[ 89%] Linking CXX executable ErrorOrder_2D_L2Project_Bernstein_btest
[ 89%] Built target ErrorOrder_2D_L2Project_Bernstein_btest_build
[ 89%] Checking style of test/system/Asymptotic/ErrorOrder_2D_VMSDBR2_Triangle_AD_btest.cpp
[ 89%] Built target ErrorOrder_2D_VMSDBR2_Triangle_AD_btest_build_vera
[ 89%] Building CXX object test/system/Asymptotic/CMakeFiles/ErrorOrder_2D_VMSDBR2_Triangle_AD_btest_OBJECT.dir/ErrorOrder_2D_VMSDBR2_Triangle_AD_btest.cpp.o
[ 89%] Built target ErrorOrder_2D_VMSDBR2_Triangle_AD_btest_OBJECT
[ 89%] Linking CXX executable ErrorOrder_2D_VMSDBR2_Triangle_AD_btest
[ 89%] Built target ErrorOrder_2D_VMSDBR2_Triangle_AD_btest_build
[ 89%] Checking style of test/system/Asymptotic/ErrorOrder_3D_CG_Hex_AD_btest.cpp
[ 89%] Built target ErrorOrder_3D_CG_Hex_AD_btest_build_vera
[ 89%] Building CXX object test/system/Asymptotic/CMakeFiles/ErrorOrder_3D_CG_Hex_AD_btest_OBJECT.dir/ErrorOrder_3D_CG_Hex_AD_btest.cpp.o
[ 89%] Built target ErrorOrder_3D_CG_Hex_AD_btest_OBJECT
[ 89%] Linking CXX executable ErrorOrder_3D_CG_Hex_AD_btest
[ 89%] Built target ErrorOrder_3D_CG_Hex_AD_btest_build
[ 89%] Checking style of test/system/Asymptotic/ErrorOrder_3D_CG_Sphere_Triangle_AD_btest.cpp
[ 89%] Built target ErrorOrder_3D_CG_Sphere_Triangle_AD_btest_build_vera
[ 89%] Building CXX object test/system/Asymptotic/CMakeFiles/ErrorOrder_3D_CG_Sphere_Triangle_AD_btest_OBJECT.dir/ErrorOrder_3D_CG_Sphere_Triangle_AD_btest.cpp.o
[ 89%] Built target ErrorOrder_3D_CG_Sphere_Triangle_AD_btest_OBJECT
[ 89%] Linking CXX executable ErrorOrder_3D_CG_Sphere_Triangle_AD_btest
[ 89%] Built target ErrorOrder_3D_CG_Sphere_Triangle_AD_btest_build
[ 89%] Checking style of test/system/Asymptotic/ErrorOrder_3D_CG_Tet_AD_btest.cpp
[ 89%] Built target ErrorOrder_3D_CG_Tet_AD_btest_build_vera
[ 89%] Building CXX object test/system/Asymptotic/CMakeFiles/ErrorOrder_3D_CG_Tet_AD_btest_OBJECT.dir/ErrorOrder_3D_CG_Tet_AD_btest.cpp.o
[ 89%] Built target ErrorOrder_3D_CG_Tet_AD_btest_OBJECT
[ 89%] Linking CXX executable ErrorOrder_3D_CG_Tet_AD_btest
[ 89%] Built target ErrorOrder_3D_CG_Tet_AD_btest_build
[ 89%] Checking style of test/system/Asymptotic/ErrorOrder_3D_DGBR2_Periodic_Hex_AD_btest.cpp
[ 89%] Built target ErrorOrder_3D_DGBR2_Periodic_Hex_AD_btest_build_vera
[ 89%] Building CXX object test/system/Asymptotic/CMakeFiles/ErrorOrder_3D_DGBR2_Periodic_Hex_AD_btest_OBJECT.dir/ErrorOrder_3D_DGBR2_Periodic_Hex_AD_btest.cpp.o
[ 89%] Built target ErrorOrder_3D_DGBR2_Periodic_Hex_AD_btest_OBJECT
[ 89%] Linking CXX executable ErrorOrder_3D_DGBR2_Periodic_Hex_AD_btest
[ 89%] Built target ErrorOrder_3D_DGBR2_Periodic_Hex_AD_btest_build
[ 89%] Checking style of test/system/Asymptotic/ErrorOrder_3D_DGBR2_Sphere_Triangle_AD_btest.cpp
[ 89%] Built target ErrorOrder_3D_DGBR2_Sphere_Triangle_AD_btest_build_vera
[ 89%] Building CXX object test/system/Asymptotic/CMakeFiles/ErrorOrder_3D_DGBR2_Sphere_Triangle_AD_btest_OBJECT.dir/ErrorOrder_3D_DGBR2_Sphere_Triangle_AD_btest.cpp.o
[ 89%] Built target ErrorOrder_3D_DGBR2_Sphere_Triangle_AD_btest_OBJECT
[ 89%] Linking CXX executable ErrorOrder_3D_DGBR2_Sphere_Triangle_AD_btest
[ 89%] Built target ErrorOrder_3D_DGBR2_Sphere_Triangle_AD_btest_build
[ 89%] Checking style of test/system/Asymptotic/ErrorOrder_3D_DGBR2_Tet_AD_btest.cpp
[ 89%] Built target ErrorOrder_3D_DGBR2_Tet_AD_btest_build_vera
[ 89%] Building CXX object test/system/Asymptotic/CMakeFiles/ErrorOrder_3D_DGBR2_Tet_AD_btest_OBJECT.dir/ErrorOrder_3D_DGBR2_Tet_AD_btest.cpp.o
[ 89%] Built target ErrorOrder_3D_DGBR2_Tet_AD_btest_OBJECT
[ 89%] Linking CXX executable ErrorOrder_3D_DGBR2_Tet_AD_btest
[ 89%] Built target ErrorOrder_3D_DGBR2_Tet_AD_btest_build
[ 89%] Checking style of test/system/Asymptotic/ErrorOrder_4D_DG_Pentatope_btest.cpp
[ 89%] Built target ErrorOrder_4D_DG_Pentatope_btest_build_vera
[ 89%] Building CXX object test/system/Asymptotic/CMakeFiles/ErrorOrder_4D_DG_Pentatope_btest_OBJECT.dir/ErrorOrder_4D_DG_Pentatope_btest.cpp.o
[ 89%] Built target ErrorOrder_4D_DG_Pentatope_btest_OBJECT
[ 89%] Linking CXX executable ErrorOrder_4D_DG_Pentatope_btest
[ 89%] Built target ErrorOrder_4D_DG_Pentatope_btest_build
[ 89%] Checking style of test/system/Asymptotic/Solve2D_DGAdvective_LinearRobin_mitLG_sansLG_Consistency_AD_btest.cpp
[ 89%] Built target Solve2D_DGAdvective_LinearRobin_mitLG_sansLG_Consistency_AD_btest_build_vera
[ 89%] Building CXX object test/system/Asymptotic/CMakeFiles/Solve2D_DGAdvective_LinearRobin_mitLG_sansLG_Consistency_AD_btest_OBJECT.dir/Solve2D_DGAdvective_LinearRobin_mitLG_sansLG_Consistency_AD_btest.cpp.o
[ 89%] Built target Solve2D_DGAdvective_LinearRobin_mitLG_sansLG_Consistency_AD_btest_OBJECT
[ 89%] Linking CXX executable Solve2D_DGAdvective_LinearRobin_mitLG_sansLG_Consistency_AD_btest
[ 89%] Built target Solve2D_DGAdvective_LinearRobin_mitLG_sansLG_Consistency_AD_btest_build
[ 89%] Checking style of test/system/LocalSolve/AlgebraicEquationSet_Local_VMSDBR2_Triangle_AD_btest.cpp
[ 89%] Built target AlgebraicEquationSet_Local_VMSDBR2_Triangle_AD_btest_build_vera
Consolidate compiler generated dependencies of target BlockLib
[ 89%] Built target BlockLib
[ 91%] Built target BlockLinAlgLib_vera
Consolidate compiler generated dependencies of target BlockLinAlgLib
[ 91%] Built target BlockLinAlgLib
[ 94%] Built target pdeSensorLib_vera
Consolidate compiler generated dependencies of target pdeSensorLib
[ 94%] Built target pdeSensorLib
[ 94%] Building CXX object test/system/LocalSolve/CMakeFiles/AlgebraicEquationSet_Local_VMSDBR2_Triangle_AD_btest_OBJECT.dir/AlgebraicEquationSet_Local_VMSDBR2_Triangle_AD_btest.cpp.o
[ 94%] Built target AlgebraicEquationSet_Local_VMSDBR2_Triangle_AD_btest_OBJECT
[ 94%] Linking CXX executable AlgebraicEquationSet_Local_VMSDBR2_Triangle_AD_btest
[ 94%] Built target AlgebraicEquationSet_Local_VMSDBR2_Triangle_AD_btest_build
[ 94%] Checking style of test/system/LocalSolve/AlgebraicEquationSet_Local_VMSD_Triangle_AD_btest.cpp
[ 94%] Built target AlgebraicEquationSet_Local_VMSD_Triangle_AD_btest_build_vera
[ 94%] Building CXX object test/system/LocalSolve/CMakeFiles/AlgebraicEquationSet_Local_VMSD_Triangle_AD_btest_OBJECT.dir/AlgebraicEquationSet_Local_VMSD_Triangle_AD_btest.cpp.o
[ 94%] Built target AlgebraicEquationSet_Local_VMSD_Triangle_AD_btest_OBJECT
[ 94%] Linking CXX executable AlgebraicEquationSet_Local_VMSD_Triangle_AD_btest
[ 94%] Built target AlgebraicEquationSet_Local_VMSD_Triangle_AD_btest_build
[ 94%] Checking style of test/system/LocalSolve/Constrained_Solve_btest.cpp
[ 94%] Built target Constrained_Solve_btest_build_vera
[ 94%] Building CXX object test/system/LocalSolve/CMakeFiles/Constrained_Solve_btest_OBJECT.dir/Constrained_Solve_btest.cpp.o
In file included from /jenkins/workspace/SANS_Nightly/builddir/undefined_gnu9/buildnode/reynolds/test/system/LocalSolve/Constrained_Solve_btest.cpp:47:
/jenkins/workspace/SANS_Nightly/builddir/undefined_gnu9/buildnode/reynolds/src/pde/NS/PDEEulermitAVDiffusion2D.h:43:46: note: #pragma message: #undef USE_GRID_LAPLACIAN
   43 | #pragma message( "#undef USE_GRID_LAPLACIAN" )
      |                                              ^
In file included from /jenkins/workspace/SANS_Nightly/builddir/undefined_gnu9/buildnode/reynolds/src/pde/NS/BCEulermitAVSensor2D.h:15,
                 from /jenkins/workspace/SANS_Nightly/builddir/undefined_gnu9/buildnode/reynolds/test/system/LocalSolve/Constrained_Solve_btest.cpp:48:
/jenkins/workspace/SANS_Nightly/builddir/undefined_gnu9/buildnode/reynolds/src/pde/NS/PDEmitAVDiffusionOuter2D.h:43:46: note: #pragma message: #undef USE_GRID_LAPLACIAN
   43 | #pragma message( "#undef USE_GRID_LAPLACIAN" )
      |                                              ^
In file included from /jenkins/workspace/SANS_Nightly/builddir/undefined_gnu9/buildnode/reynolds/src/pde/NS/BCEulermitAVSensor2D.h:18,
                 from /jenkins/workspace/SANS_Nightly/builddir/undefined_gnu9/buildnode/reynolds/test/system/LocalSolve/Constrained_Solve_btest.cpp:48:
/jenkins/workspace/SANS_Nightly/builddir/undefined_gnu9/buildnode/reynolds/src/pde/ArtificialViscosity/BCmitAVSensor2D.h:32:46: note: #pragma message: #undef USE_GRID_LAPLACIAN
   32 | #pragma message( "#undef USE_GRID_LAPLACIAN" )
      |                                              ^
In file included from /jenkins/workspace/SANS_Nightly/builddir/undefined_gnu9/buildnode/reynolds/test/system/LocalSolve/Constrained_Solve_btest.cpp:54:
/jenkins/workspace/SANS_Nightly/builddir/undefined_gnu9/buildnode/reynolds/src/pde/ArtificialViscosity/AVSensor_ViscousFlux2D.h:30:46: note: #pragma message: #undef USE_GRID_LAPLACIAN
   30 | #pragma message( "#undef USE_GRID_LAPLACIAN" )
      |                                              ^
In file included from /jenkins/workspace/SANS_Nightly/builddir/undefined_gnu9/buildnode/reynolds/src/pde/ArtificialViscosity/AVSensor_Source2D.h:26,
                 from /jenkins/workspace/SANS_Nightly/builddir/undefined_gnu9/buildnode/reynolds/test/system/LocalSolve/Constrained_Solve_btest.cpp:55:
/jenkins/workspace/SANS_Nightly/builddir/undefined_gnu9/buildnode/reynolds/src/pde/ArtificialViscosity/PDEmitAVSensor2D.h:38:46: note: #pragma message: #undef USE_GRID_LAPLACIAN
   38 | #pragma message( "#undef USE_GRID_LAPLACIAN" )
      |                                              ^
In file included from /jenkins/workspace/SANS_Nightly/builddir/undefined_gnu9/buildnode/reynolds/test/system/LocalSolve/Constrained_Solve_btest.cpp:55:
/jenkins/workspace/SANS_Nightly/builddir/undefined_gnu9/buildnode/reynolds/src/pde/ArtificialViscosity/AVSensor_Source2D.h:38:46: note: #pragma message: #undef USE_GRID_LAPLACIAN
   38 | #pragma message( "#undef USE_GRID_LAPLACIAN" )
      |                                              ^
[ 94%] Built target Constrained_Solve_btest_OBJECT
[ 94%] Linking CXX executable Constrained_Solve_btest
[ 94%] Built target Constrained_Solve_btest_build
[ 94%] Checking style of test/system/LocalSolve/EdgeLocalSolve1D_Dual_Galerkin_Stabilized_Line_AD_btest.cpp
[ 94%] Built target EdgeLocalSolve1D_Dual_Galerkin_Stabilized_Line_AD_btest_build_vera
[ 94%] Building CXX object test/system/LocalSolve/CMakeFiles/EdgeLocalSolve1D_Dual_Galerkin_Stabilized_Line_AD_btest_OBJECT.dir/EdgeLocalSolve1D_Dual_Galerkin_Stabilized_Line_AD_btest.cpp.o
[ 94%] Built target EdgeLocalSolve1D_Dual_Galerkin_Stabilized_Line_AD_btest_OBJECT
[ 94%] Linking CXX executable EdgeLocalSolve1D_Dual_Galerkin_Stabilized_Line_AD_btest
[ 94%] Built target EdgeLocalSolve1D_Dual_Galerkin_Stabilized_Line_AD_btest_build
[ 94%] Checking style of test/system/LocalSolve/EdgeLocalSolve2D_Dual_Galerkin_Stabilized_AD_btest.cpp
[ 94%] Built target EdgeLocalSolve2D_Dual_Galerkin_Stabilized_AD_btest_build_vera
[ 94%] Building CXX object test/system/LocalSolve/CMakeFiles/EdgeLocalSolve2D_Dual_Galerkin_Stabilized_AD_btest_OBJECT.dir/EdgeLocalSolve2D_Dual_Galerkin_Stabilized_AD_btest.cpp.o
[ 94%] Built target EdgeLocalSolve2D_Dual_Galerkin_Stabilized_AD_btest_OBJECT
[ 94%] Linking CXX executable EdgeLocalSolve2D_Dual_Galerkin_Stabilized_AD_btest
[ 94%] Built target EdgeLocalSolve2D_Dual_Galerkin_Stabilized_AD_btest_build
[ 97%] Checking style of test/system/LocalSolve/EdgeLocalSolve2D_Dual_Galerkin_Stabilized_AR_btest.cpp
[ 97%] Built target EdgeLocalSolve2D_Dual_Galerkin_Stabilized_AR_btest_build_vera
[ 97%] Building CXX object test/system/LocalSolve/CMakeFiles/EdgeLocalSolve2D_Dual_Galerkin_Stabilized_AR_btest_OBJECT.dir/EdgeLocalSolve2D_Dual_Galerkin_Stabilized_AR_btest.cpp.o
[ 97%] Built target EdgeLocalSolve2D_Dual_Galerkin_Stabilized_AR_btest_OBJECT
[ 97%] Linking CXX executable EdgeLocalSolve2D_Dual_Galerkin_Stabilized_AR_btest
[ 97%] Built target EdgeLocalSolve2D_Dual_Galerkin_Stabilized_AR_btest_build
[ 97%] Checking style of test/system/LocalSolve/EdgeLocalSolve2D_Dual_Galerkin_Stabilized_Euler_btest.cpp
[ 97%] Built target EdgeLocalSolve2D_Dual_Galerkin_Stabilized_Euler_btest_build_vera
[ 97%] Building CXX object test/system/LocalSolve/CMakeFiles/EdgeLocalSolve2D_Dual_Galerkin_Stabilized_Euler_btest_OBJECT.dir/EdgeLocalSolve2D_Dual_Galerkin_Stabilized_Euler_btest.cpp.o
make[3]: *** [test/system/LocalSolve/CMakeFiles/EdgeLocalSolve2D_Dual_Galerkin_Stabilized_Euler_btest_OBJECT.dir/build.make:77: test/system/LocalSolve/CMakeFiles/EdgeLocalSolve2D_Dual_Galerkin_Stabilized_Euler_btest_OBJECT.dir/EdgeLocalSolve2D_Dual_Galerkin_Stabilized_Euler_btest.cpp.o] Terminated
make[2]: *** [CMakeFiles/Makefile2:143159: test/system/LocalSolve/CMakeFiles/EdgeLocalSolve2D_Dual_Galerkin_Stabilized_Euler_btest_OBJECT.dir/all] Terminated
make[1]: *** [CMakeFiles/Makefile2:133884: test/system/CMakeFiles/check_system.dir/rule] Error 2
make: *** [Makefile:53596: check_system] Error 2

real	63m7.305s
user	60m17.575s
sys	2m9.218s
+ status=1
++ find /jenkins/workspace/SANS_Nightly/builddir/undefined_gnu9/buildnode/reynolds/build/undefined_gnu9 -name Test.xml
+ mv /jenkins/workspace/SANS_Nightly/builddir/undefined_gnu9/buildnode/reynolds/build/Test_system_fulltest.xml
mv: missing destination file operand after '/jenkins/workspace/SANS_Nightly/builddir/undefined_gnu9/buildnode/reynolds/build/Test_system_fulltest.xml'
Try 'mv --help' for more information.
Process leaked file descriptors. See https://www.jenkins.io/redirect/troubleshooting/process-leaked-file-descriptors for more information
Build step 'Execute shell' marked build as failure
g++-9: fatal error: Terminated signal terminated program cc1plus
compilation terminated.
[GNU C Compiler (gcc)ClangIntel Compiler (C, Fortran)Vera++] Skipping execution of recorder since overall result is 'FAILURE'
[Valgrind] Files to copy:
[Valgrind] Analysing valgrind results
[Valgrind] Ending the valgrind analysis.
INFO: Processing BoostTest-1.x (default)
INFO: [BoostTest-1.x (default)] - No test report file(s) were found with the pattern 'build/boosttest/*.xml' relative to '/jenkins/workspace/SANS_Nightly/builddir/undefined_gnu9/buildnode/reynolds' for the testing framework 'BoostTest-1.x (default)'.
Did you enter a pattern relative to (and within) the workspace directory?
Did you generate the result report(s) for 'BoostTest-1.x (default)'?"
WARNING: All test reports are empty.
INFO: Check 'Failed Tests' threshold.
INFO: Check 'Skipped Tests' threshold.
INFO: Setting the build status to SUCCESS
[PostBuildScript] - [INFO] Executing post build scripts.
[PostBuildScript] - [INFO] Node does not have the role MASTER. Did not execute build step #0.
[PostBuildScript] - [INFO] Node does not have the role MASTER. Did not execute build step #1.
[WS-CLEANUP] Deleting project workspace...
[WS-CLEANUP] Deferred wipeout is used...
[WS-CLEANUP] done
Finished: FAILURE