Console Output

Started by upstream project "SANS_PETSc_poll" build number 629
originally caused by:
 Started by an SCM change
Running as SYSTEM
[EnvInject] - Loading node environment variables.
Building remotely on reynolds in workspace /jenkins/workspace/SANS_PETSc
[WS-CLEANUP] Deleting project workspace...
[WS-CLEANUP] Done
The recommended git tool is: NONE
using credential 3614a4cf-01de-4393-97de-73734b7dd5a2
Fetching changes from the remote Git repository
Pruning obsolete local branches
Cleaning workspace
 > JGit fetch # timeout=10
Verifying host key for acdl.mit.edu using /home/jenkins/.ssh/known_hosts 
Checking out Revision c86d5cdfd5b434db8f29257ad65b199b64ec0d76 (acdl/develop)
Commit message: "Added renat999@mit.edu to DeveloperEmailAddresses"
The recommended git tool is: NONE
using credential 3614a4cf-01de-4393-97de-73734b7dd5a2
The recommended git tool is: NONE
using credential 3614a4cf-01de-4393-97de-73734b7dd5a2
[GitCheckoutListener] Recording commits of 'git ssh://jenkins@acdl.mit.edu/home/svnroot/SANSproto/'
[GitCheckoutListener] Found previous build 'SANS_PETSc #600' that contains recorded Git commits
[GitCheckoutListener] -> Starting recording of new commits since 'c86d5cd'
[GitCheckoutListener] -> Single parent commit found - branch is already descendant of target branch head
[GitCheckoutListener] -> Using head commit 'c86d5cd' as starting point
[GitCheckoutListener] -> No new commits found
[GitCheckoutListener] -> Git commit decorator could not be created for SCM 'hudson.plugins.git.GitSCM@699e02a8'
No emails were triggered.
Triggering SANS_PETSc » release_intel,reynolds
Triggering SANS_PETSc » release_gnu11,reynolds
Triggering SANS_PETSc » release_gnu9,reynolds
Triggering SANS_PETSc » release_gnu10,reynolds
Triggering SANS_PETSc » release_clang,reynolds

SANS_PETSc » release_intel,reynolds completed with result FAILURE

SANS_PETSc » release_gnu11,reynolds completed with result SUCCESS

SANS_PETSc » release_gnu9,reynolds completed with result SUCCESS

SANS_PETSc » release_gnu10,reynolds completed with result SUCCESS

SANS_PETSc » release_clang,reynolds completed with result UNSTABLE
Email was triggered for: Failure - Any
Sending email for trigger: Failure - Any
Failed to create e-mail address for <title>SANS_PETSc</title> <!-- This groovy script gets copied into JENKINS_HOME/email-templates by SANS_Commit.sh --> <STYLE> body table, td, th, p, h1, h2 { margin:0, font:normal normal 100% Georgia, Serif, background-color: #ffffff, } h1, h2 { border-bottom:dotted 1px #999999, padding:5px, margin-top:10px, margin-bottom:10px, color: #000000, font: normal bold 130% Georgia,Serif, background-color:#f0f0f0, } tr.gray { background-color:#f0f0f0, } h2 { padding:5px, margin-top:5px, margin-bottom:5px, font: italic bold 110% Georgia,Serif, } .bg2 { color:black, background-color:#E0E0E0, font-size:110% } th { font-weight: bold, } tr, td, th { padding:2px, } td.test_passed { color:blue, } td.test_failed { color:red, } td.test_skipped { color:grey, } .console { font: normal normal 90% Courier New, monotype, padding:0px, margin:0px, } div.content, div.header { background: #ffffff, border: dotted 1px #666, margin: 2px, content: 2px, padding: 2px, } table.border, th.border, td.border { border: 1px solid black, border-collapse:collapse, } </STYLE> <BODY> <div class="header"> <!-- GENERAL INFO --> <table> <tr class="gray"> <td align="right"> <img src="https://acdl.mit.edu/csi/static/e59dfe28/images/32x32/red.gif" /> </td> <td valign="center"> <b style="font-size: 200%,">BUILD FAILURE</b> </td> </tr> <tr> <td>Build URL</td> <td> <a href="https://acdl.mit.edu/csi/job/SANS_PETSc/601/">https://acdl.mit.edu/csi/job/SANS_PETSc/601/</a> </td> </tr> <tr> <td>Project:</td> <td>SANS_PETSc</td> </tr> <tr> <td>Date of build:</td> <td>Wed, 05 Oct 2022 04:09:21 -0400</td> </tr> <tr> <td>Build duration:</td> <td>9 min 56 sec and counting</td> </tr> <tr> <td>Build cause:</td> <td> Started by upstream project "SANS_PETSc_poll" build number 629 </td> </tr> <tr> <td>Built on:</td> <td> reynolds </td> </tr> </table> </div> <!-- CHANGES TEMPLATE --> <div class="content"> <a href="https://acdl.mit.edu/csi/job/SANS_PETSc/601//changes"> <h1>Changes</h1> </a> <p>No Changes</p> </div> <!-- RESULTS TEMPLATE --> <div class="content"> <h1> <a href="https://acdl.mit.edu/csi/job/SANS_PETSc/builddir=release_clang,buildnode=reynolds/601/"> <td align="right"> <img src="https://acdl.mit.edu/csi/static/e59dfe28/images/16x16/yellow.gif" /> </td> <td valign="center"> <b>SANS_PETSc/builddir=release_clang,buildnode=reynolds #601</b> </td> </a> </h1> <tr> <td>Duration:</td> <td>4 min 2 sec</td> </tr> <!-- COBERTURA TEMPLATE --> <!-- JUnit TEMPLATE --> <!-- CONSOLE OUTPUT --> <div class="content"> <a href="https://acdl.mit.edu/csi/job/SANS_PETSc/builddir=release_clang,buildnode=reynolds/601/parsed_console"> <h2>Compiler Warnings</h2> </a> <TR><TD class="console">/jenkins/workspace/SANS_PETSc/builddir/release_clang/buildnode/reynolds/test/unit/UnitGrids/XField4D_Box_Pentatope_X1.cpp:453:9: warning: use of bitwise '|' with boolean operands [-Wbitwise-instead-of-logical]<br></TD></TR> <TR><TD class="console">/jenkins/workspace/SANS_PETSc/builddir/release_clang/buildnode/reynolds/src/MPI/operations.h:39:46: warning: 'binary_function&lt,std::vector&lt,double&gt,, std::vector&lt,double&gt,, std::vector&lt,double&gt,&gt,' is deprecated [-Wdeprecated-declarations]<br></TD></TR> <TR><TD class="console">/jenkins/workspace/SANS_PETSc/builddir/release_clang/buildnode/reynolds/src/MPI/operations.h:24:46: warning: 'binary_function&lt,std::vector&lt,double&gt,, std::vector&lt,double&gt,, std::vector&lt,double&gt,&gt,' is deprecated [-Wdeprecated-declarations]<br></TD></TR> <TR><TD class="console">/jenkins/workspace/SANS_PETSc/builddir/release_clang/buildnode/reynolds/src/tools/plus_std_vector.h:19:47: warning: 'binary_function&lt,std::vector&lt,double&gt,, std::vector&lt,double&gt,, std::vector&lt,double&gt,&gt,' is deprecated [-Wdeprecated-declarations]<br></TD></TR> <TR><TD class="console">/jenkins/workspace/SANS_PETSc/builddir/release_clang/buildnode/reynolds/src/MPI/operations.h:24:46: warning: 'binary_function&lt,std::vector&lt,int&gt,, std::vector&lt,int&gt,, std::vector&lt,int&gt,&gt,' is deprecated [-Wdeprecated-declarations]<br></TD></TR> <TR><TD class="console">/jenkins/workspace/SANS_PETSc/builddir/release_clang/buildnode/reynolds/src/tools/plus_std_vector.h:19:47: warning: 'binary_function&lt,std::vector&lt,int&gt,, std::vector&lt,int&gt,, std::vector&lt,int&gt,&gt,' is deprecated [-Wdeprecated-declarations]<br></TD></TR> </div> <!-- End of each build --> </div> <div class="content"> <h1> <a href="https://acdl.mit.edu/csi/job/SANS_PETSc/builddir=release_gnu10,buildnode=reynolds/601/"> <td align="right"> <img src="https://acdl.mit.edu/csi/static/e59dfe28/images/16x16/blue.gif" /> </td> <td valign="center"> <b>SANS_PETSc/builddir=release_gnu10,buildnode=reynolds #601</b> </td> </a> </h1> <tr> <td>Duration:</td> <td>9 min 26 sec</td> </tr> <!-- COBERTURA TEMPLATE --> <!-- JUnit TEMPLATE --> <!-- CONSOLE OUTPUT --> <!-- End of each build --> </div> <div class="content"> <h1> <a href="https://acdl.mit.edu/csi/job/SANS_PETSc/builddir=release_gnu11,buildnode=reynolds/601/"> <td align="right"> <img src="https://acdl.mit.edu/csi/static/e59dfe28/images/16x16/blue.gif" /> </td> <td valign="center"> <b>SANS_PETSc/builddir=release_gnu11,buildnode=reynolds #601</b> </td> </a> </h1> <tr> <td>Duration:</td> <td>9 min 16 sec</td> </tr> <!-- COBERTURA TEMPLATE --> <!-- JUnit TEMPLATE --> <!-- CONSOLE OUTPUT --> <!-- End of each build --> </div> <div class="content"> <h1> <a href="https://acdl.mit.edu/csi/job/SANS_PETSc/builddir=release_gnu9,buildnode=reynolds/601/"> <td align="right"> <img src="https://acdl.mit.edu/csi/static/e59dfe28/images/16x16/blue.gif" /> </td> <td valign="center"> <b>SANS_PETSc/builddir=release_gnu9,buildnode=reynolds #601</b> </td> </a> </h1> <tr> <td>Duration:</td> <td>9 min 49 sec</td> </tr> <!-- COBERTURA TEMPLATE --> <!-- JUnit TEMPLATE --> <!-- CONSOLE OUTPUT --> <!-- End of each build --> </div> <div class="content"> <h1> <a href="https://acdl.mit.edu/csi/job/SANS_PETSc/builddir=release_intel,buildnode=reynolds/601/"> <td align="right"> <img src="https://acdl.mit.edu/csi/static/e59dfe28/images/16x16/red.gif" /> </td> <td valign="center"> <b>SANS_PETSc/builddir=release_intel,buildnode=reynolds #601</b> </td> </a> </h1> <tr> <td>Duration:</td> <td>1 min 42 sec</td> </tr> <!-- COBERTURA TEMPLATE --> <!-- JUnit TEMPLATE --> <!-- CONSOLE OUTPUT --> <!-- End of each build --> </div> </BODY> , Mike.Park@nasa.gov
Sending email to: allmaras@mit.edu galbramc@mit.edu darmofal@mit.edu pcaplan@mit.edu arthuang@mit.edu savithru@mit.edu hcarson@mit.edu blsc@mit.edu shunz@mit.edu dmw72@psu.edu eam5515@psu.edu kug46@psu.edu ursachi@mit.edu cfrontin@mit.edu jzavala@mit.edu mlarocca@mit.edu ksabo@mit.edu vpr11@mit.edu jta29@psu.edu waligura@mit.edu cwomack@mit.edu deanna.sewell@colorado.edu renat999@mit.edu
[PostBuildScript] - [INFO] Executing post build scripts.
[PostBuildScript] - [INFO] Build does not have any of the results [SUCCESS]. Did not execute build step #0.
Finished: FAILURE