Console Output

Skipping 304 KB.. Full Log
[ 89%] Linking CXX executable ErrorOrder_2D_CGStabilized_RANS_MMS_btest
[ 89%] Built target ErrorOrder_2D_CGStabilized_RANS_MMS_btest_build
Scanning dependencies of target ErrorOrder_2D_DGAdvective_Annulus_Quad_btest_OBJECT
[ 91%] Building CXX object test/system/Asymptotic/CMakeFiles/ErrorOrder_2D_DGAdvective_Annulus_Quad_btest_OBJECT.dir/ErrorOrder_2D_DGAdvective_Annulus_Quad_btest.cpp.o
[ 91%] Built target ErrorOrder_2D_DGAdvective_Annulus_Quad_btest_OBJECT
Scanning dependencies of target ErrorOrder_2D_DGAdvective_Annulus_Quad_btest_build_vera
[ 91%] Checking style of test/system/Asymptotic/ErrorOrder_2D_DGAdvective_Annulus_Quad_btest.cpp
[ 91%] Built target ErrorOrder_2D_DGAdvective_Annulus_Quad_btest_build_vera
Scanning dependencies of target ErrorOrder_2D_DGAdvective_Annulus_Quad_btest_build
[ 91%] Linking CXX executable ErrorOrder_2D_DGAdvective_Annulus_Quad_btest
[ 91%] Built target ErrorOrder_2D_DGAdvective_Annulus_Quad_btest_build
Scanning dependencies of target ErrorOrder_1D_DGBR2_AD_HB_btest_build_vera
[ 91%] Checking style of test/system/Asymptotic/ErrorOrder_1D_DGBR2_AD_HB_btest.cpp
[ 91%] Built target ErrorOrder_1D_DGBR2_AD_HB_btest_build_vera
Scanning dependencies of target ErrorOrder_1D_DGBR2_AD_HB_btest_OBJECT
[ 91%] Building CXX object test/system/Asymptotic/CMakeFiles/ErrorOrder_1D_DGBR2_AD_HB_btest_OBJECT.dir/ErrorOrder_1D_DGBR2_AD_HB_btest.cpp.o
[ 91%] Built target ErrorOrder_1D_DGBR2_AD_HB_btest_OBJECT
Scanning dependencies of target ErrorOrder_1D_DGBR2_AD_HB_btest_build
[ 91%] Linking CXX executable ErrorOrder_1D_DGBR2_AD_HB_btest
[ 91%] Built target ErrorOrder_1D_DGBR2_AD_HB_btest_build
Scanning dependencies of target ErrorOrder_1D_HDG_AD_BDF_btest_build_vera
[ 91%] Checking style of test/system/Asymptotic/ErrorOrder_1D_HDG_AD_BDF_btest.cpp
[ 91%] Built target ErrorOrder_1D_HDG_AD_BDF_btest_build_vera
Scanning dependencies of target ErrorOrder_1D_HDG_AD_BDF_btest_OBJECT
[ 91%] Building CXX object test/system/Asymptotic/CMakeFiles/ErrorOrder_1D_HDG_AD_BDF_btest_OBJECT.dir/ErrorOrder_1D_HDG_AD_BDF_btest.cpp.o
[ 91%] Built target ErrorOrder_1D_HDG_AD_BDF_btest_OBJECT
Scanning dependencies of target ErrorOrder_1D_HDG_AD_BDF_btest_build
[ 91%] Linking CXX executable ErrorOrder_1D_HDG_AD_BDF_btest
[ 91%] Built target ErrorOrder_1D_HDG_AD_BDF_btest_build
Scanning dependencies of target Adjoint2D_DGBR2_Triangle_AD_btest_build_vera
[ 91%] Checking style of test/system/Asymptotic/Adjoint2D_DGBR2_Triangle_AD_btest.cpp
[ 91%] Built target Adjoint2D_DGBR2_Triangle_AD_btest_build_vera
Scanning dependencies of target Adjoint2D_DGBR2_Triangle_AD_btest_OBJECT
[ 91%] Building CXX object test/system/Asymptotic/CMakeFiles/Adjoint2D_DGBR2_Triangle_AD_btest_OBJECT.dir/Adjoint2D_DGBR2_Triangle_AD_btest.cpp.o
[ 91%] Built target Adjoint2D_DGBR2_Triangle_AD_btest_OBJECT
Scanning dependencies of target Adjoint2D_DGBR2_Triangle_AD_btest_build
[ 91%] Linking CXX executable Adjoint2D_DGBR2_Triangle_AD_btest
[ 91%] Built target Adjoint2D_DGBR2_Triangle_AD_btest_build
Scanning dependencies of target ErrorOrder_1D_CG_AD_btest_build_vera
[ 91%] Checking style of test/system/Asymptotic/ErrorOrder_1D_CG_AD_btest.cpp
[ 91%] Built target ErrorOrder_1D_CG_AD_btest_build_vera
Scanning dependencies of target ErrorOrder_1D_CG_AD_btest_OBJECT
[ 91%] Building CXX object test/system/Asymptotic/CMakeFiles/ErrorOrder_1D_CG_AD_btest_OBJECT.dir/ErrorOrder_1D_CG_AD_btest.cpp.o
[ 91%] Built target ErrorOrder_1D_CG_AD_btest_OBJECT
Scanning dependencies of target ErrorOrder_1D_CG_AD_btest_build
[ 91%] Linking CXX executable ErrorOrder_1D_CG_AD_btest
[ 91%] Built target ErrorOrder_1D_CG_AD_btest_build
Scanning dependencies of target Adjoint2D_CG_Triangle_AD_btest_build_vera
[ 91%] Checking style of test/system/Asymptotic/Adjoint2D_CG_Triangle_AD_btest.cpp
[ 91%] Built target Adjoint2D_CG_Triangle_AD_btest_build_vera
Scanning dependencies of target Adjoint2D_CG_Triangle_AD_btest_OBJECT
[ 91%] Building CXX object test/system/Asymptotic/CMakeFiles/Adjoint2D_CG_Triangle_AD_btest_OBJECT.dir/Adjoint2D_CG_Triangle_AD_btest.cpp.o
[ 91%] Built target Adjoint2D_CG_Triangle_AD_btest_OBJECT
Scanning dependencies of target Adjoint2D_CG_Triangle_AD_btest_build
[ 91%] Linking CXX executable Adjoint2D_CG_Triangle_AD_btest
[ 91%] Built target Adjoint2D_CG_Triangle_AD_btest_build
Scanning dependencies of target ErrorOrder_2D_DGBR2_Triangle_AD_btest_OBJECT
[ 91%] Building CXX object test/system/Asymptotic/CMakeFiles/ErrorOrder_2D_DGBR2_Triangle_AD_btest_OBJECT.dir/ErrorOrder_2D_DGBR2_Triangle_AD_btest.cpp.o
[ 91%] Built target ErrorOrder_2D_DGBR2_Triangle_AD_btest_OBJECT
Scanning dependencies of target ErrorOrder_2D_DGBR2_Triangle_AD_btest_build_vera
[ 91%] Checking style of test/system/Asymptotic/ErrorOrder_2D_DGBR2_Triangle_AD_btest.cpp
[ 91%] Built target ErrorOrder_2D_DGBR2_Triangle_AD_btest_build_vera
Scanning dependencies of target ErrorOrder_2D_DGBR2_Triangle_AD_btest_build
[ 91%] Linking CXX executable ErrorOrder_2D_DGBR2_Triangle_AD_btest
[ 91%] Built target ErrorOrder_2D_DGBR2_Triangle_AD_btest_build
Scanning dependencies of target Adjoint2D_HDG_Triangle_AD_sansLG_btest_build_vera
[ 91%] Checking style of test/system/Asymptotic/Adjoint2D_HDG_Triangle_AD_sansLG_btest.cpp
[ 91%] Built target Adjoint2D_HDG_Triangle_AD_sansLG_btest_build_vera
Scanning dependencies of target Adjoint2D_HDG_Triangle_AD_sansLG_btest_OBJECT
[ 91%] Building CXX object test/system/Asymptotic/CMakeFiles/Adjoint2D_HDG_Triangle_AD_sansLG_btest_OBJECT.dir/Adjoint2D_HDG_Triangle_AD_sansLG_btest.cpp.o
[ 91%] Built target Adjoint2D_HDG_Triangle_AD_sansLG_btest_OBJECT
Scanning dependencies of target Adjoint2D_HDG_Triangle_AD_sansLG_btest_build
[ 91%] Linking CXX executable Adjoint2D_HDG_Triangle_AD_sansLG_btest
[ 91%] Built target Adjoint2D_HDG_Triangle_AD_sansLG_btest_build
Scanning dependencies of target ErrorEstimateOrder_2D_DGAdvective_Triangle_AD_btest_OBJECT
[ 91%] Building CXX object test/system/Asymptotic/CMakeFiles/ErrorEstimateOrder_2D_DGAdvective_Triangle_AD_btest_OBJECT.dir/ErrorEstimateOrder_2D_DGAdvective_Triangle_AD_btest.cpp.o
[ 91%] Built target ErrorEstimateOrder_2D_DGAdvective_Triangle_AD_btest_OBJECT
Scanning dependencies of target ErrorEstimateOrder_2D_DGAdvective_Triangle_AD_btest_build_vera
[ 91%] Checking style of test/system/Asymptotic/ErrorEstimateOrder_2D_DGAdvective_Triangle_AD_btest.cpp
[ 91%] Built target ErrorEstimateOrder_2D_DGAdvective_Triangle_AD_btest_build_vera
Scanning dependencies of target ErrorEstimateOrder_2D_DGAdvective_Triangle_AD_btest_build
[ 91%] Linking CXX executable ErrorEstimateOrder_2D_DGAdvective_Triangle_AD_btest
[ 91%] Built target ErrorEstimateOrder_2D_DGAdvective_Triangle_AD_btest_build
Scanning dependencies of target ErrorOrder_3D_DGBR2_Tet_AD_btest_OBJECT
[ 91%] Building CXX object test/system/Asymptotic/CMakeFiles/ErrorOrder_3D_DGBR2_Tet_AD_btest_OBJECT.dir/ErrorOrder_3D_DGBR2_Tet_AD_btest.cpp.o
[ 91%] Built target ErrorOrder_3D_DGBR2_Tet_AD_btest_OBJECT
Scanning dependencies of target ErrorOrder_3D_DGBR2_Tet_AD_btest_build_vera
[ 91%] Checking style of test/system/Asymptotic/ErrorOrder_3D_DGBR2_Tet_AD_btest.cpp
[ 91%] Built target ErrorOrder_3D_DGBR2_Tet_AD_btest_build_vera
Scanning dependencies of target ErrorOrder_3D_DGBR2_Tet_AD_btest_build
[ 91%] Linking CXX executable ErrorOrder_3D_DGBR2_Tet_AD_btest
[ 91%] Built target ErrorOrder_3D_DGBR2_Tet_AD_btest_build
Scanning dependencies of target ErrorOrder_3D_CG_Tet_AD_btest_build_vera
[ 91%] Checking style of test/system/Asymptotic/ErrorOrder_3D_CG_Tet_AD_btest.cpp
[ 91%] Built target ErrorOrder_3D_CG_Tet_AD_btest_build_vera
Scanning dependencies of target ErrorOrder_3D_CG_Tet_AD_btest_OBJECT
[ 91%] Building CXX object test/system/Asymptotic/CMakeFiles/ErrorOrder_3D_CG_Tet_AD_btest_OBJECT.dir/ErrorOrder_3D_CG_Tet_AD_btest.cpp.o
[ 91%] Built target ErrorOrder_3D_CG_Tet_AD_btest_OBJECT
Scanning dependencies of target ErrorOrder_3D_CG_Tet_AD_btest_build
[ 91%] Linking CXX executable ErrorOrder_3D_CG_Tet_AD_btest
[ 91%] Built target ErrorOrder_3D_CG_Tet_AD_btest_build
Scanning dependencies of target ErrorOrder_3D_DGBR2_Sphere_Triangle_AD_btest_build_vera
[ 91%] Checking style of test/system/Asymptotic/ErrorOrder_3D_DGBR2_Sphere_Triangle_AD_btest.cpp
[ 91%] Built target ErrorOrder_3D_DGBR2_Sphere_Triangle_AD_btest_build_vera
Scanning dependencies of target ErrorOrder_3D_DGBR2_Sphere_Triangle_AD_btest_OBJECT
[ 91%] Building CXX object test/system/Asymptotic/CMakeFiles/ErrorOrder_3D_DGBR2_Sphere_Triangle_AD_btest_OBJECT.dir/ErrorOrder_3D_DGBR2_Sphere_Triangle_AD_btest.cpp.o
[ 91%] Built target ErrorOrder_3D_DGBR2_Sphere_Triangle_AD_btest_OBJECT
Scanning dependencies of target ErrorOrder_3D_DGBR2_Sphere_Triangle_AD_btest_build
[ 91%] Linking CXX executable ErrorOrder_3D_DGBR2_Sphere_Triangle_AD_btest
[ 91%] Built target ErrorOrder_3D_DGBR2_Sphere_Triangle_AD_btest_build
Scanning dependencies of target ErrorOrder_1D_DGBR2_Burgers_btest_build_vera
[ 91%] Checking style of test/system/Asymptotic/ErrorOrder_1D_DGBR2_Burgers_btest.cpp
[ 91%] Built target ErrorOrder_1D_DGBR2_Burgers_btest_build_vera
Scanning dependencies of target ErrorOrder_1D_DGBR2_Burgers_btest_OBJECT
[ 91%] Building CXX object test/system/Asymptotic/CMakeFiles/ErrorOrder_1D_DGBR2_Burgers_btest_OBJECT.dir/ErrorOrder_1D_DGBR2_Burgers_btest.cpp.o
[ 91%] Built target ErrorOrder_1D_DGBR2_Burgers_btest_OBJECT
Scanning dependencies of target ErrorOrder_1D_DGBR2_Burgers_btest_build
[ 91%] Linking CXX executable ErrorOrder_1D_DGBR2_Burgers_btest
[ 91%] Built target ErrorOrder_1D_DGBR2_Burgers_btest_build
Scanning dependencies of target Solve2D_DGAdvective_LinearRobin_mitLG_sansLG_Consistency_AD_btest_build_vera
[ 91%] Checking style of test/system/Asymptotic/Solve2D_DGAdvective_LinearRobin_mitLG_sansLG_Consistency_AD_btest.cpp
[ 91%] Built target Solve2D_DGAdvective_LinearRobin_mitLG_sansLG_Consistency_AD_btest_build_vera
Scanning dependencies of target Solve2D_DGAdvective_LinearRobin_mitLG_sansLG_Consistency_AD_btest_OBJECT
[ 91%] Building CXX object test/system/Asymptotic/CMakeFiles/Solve2D_DGAdvective_LinearRobin_mitLG_sansLG_Consistency_AD_btest_OBJECT.dir/Solve2D_DGAdvective_LinearRobin_mitLG_sansLG_Consistency_AD_btest.cpp.o
[ 91%] Built target Solve2D_DGAdvective_LinearRobin_mitLG_sansLG_Consistency_AD_btest_OBJECT
Scanning dependencies of target Solve2D_DGAdvective_LinearRobin_mitLG_sansLG_Consistency_AD_btest_build
[ 91%] Linking CXX executable Solve2D_DGAdvective_LinearRobin_mitLG_sansLG_Consistency_AD_btest
[ 91%] Built target Solve2D_DGAdvective_LinearRobin_mitLG_sansLG_Consistency_AD_btest_build
Scanning dependencies of target Adjoint2D_DGAdvective_Triangle_AD_btest_build_vera
[ 91%] Checking style of test/system/Asymptotic/Adjoint2D_DGAdvective_Triangle_AD_btest.cpp
[ 91%] Built target Adjoint2D_DGAdvective_Triangle_AD_btest_build_vera
Scanning dependencies of target Adjoint2D_DGAdvective_Triangle_AD_btest_OBJECT
[ 91%] Building CXX object test/system/Asymptotic/CMakeFiles/Adjoint2D_DGAdvective_Triangle_AD_btest_OBJECT.dir/Adjoint2D_DGAdvective_Triangle_AD_btest.cpp.o
[ 91%] Built target Adjoint2D_DGAdvective_Triangle_AD_btest_OBJECT
Scanning dependencies of target Adjoint2D_DGAdvective_Triangle_AD_btest_build
[ 91%] Linking CXX executable Adjoint2D_DGAdvective_Triangle_AD_btest
[ 91%] Built target Adjoint2D_DGAdvective_Triangle_AD_btest_build
Scanning dependencies of target ErrorOrder_4D_DG_Pentatope_btest_OBJECT
[ 91%] Building CXX object test/system/Asymptotic/CMakeFiles/ErrorOrder_4D_DG_Pentatope_btest_OBJECT.dir/ErrorOrder_4D_DG_Pentatope_btest.cpp.o
[ 91%] Built target ErrorOrder_4D_DG_Pentatope_btest_OBJECT
Scanning dependencies of target ErrorOrder_4D_DG_Pentatope_btest_build_vera
[ 91%] Checking style of test/system/Asymptotic/ErrorOrder_4D_DG_Pentatope_btest.cpp
[ 91%] Built target ErrorOrder_4D_DG_Pentatope_btest_build_vera
Scanning dependencies of target ErrorOrder_4D_DG_Pentatope_btest_build
[ 91%] Linking CXX executable ErrorOrder_4D_DG_Pentatope_btest
[ 91%] Built target ErrorOrder_4D_DG_Pentatope_btest_build
Scanning dependencies of target ErrorOrder_1D_HDGAdvective_Advection_btest_build_vera
[ 91%] Checking style of test/system/Asymptotic/ErrorOrder_1D_HDGAdvective_Advection_btest.cpp
[ 91%] Built target ErrorOrder_1D_HDGAdvective_Advection_btest_build_vera
Scanning dependencies of target ErrorOrder_1D_HDGAdvective_Advection_btest_OBJECT
[ 91%] Building CXX object test/system/Asymptotic/CMakeFiles/ErrorOrder_1D_HDGAdvective_Advection_btest_OBJECT.dir/ErrorOrder_1D_HDGAdvective_Advection_btest.cpp.o
[ 91%] Built target ErrorOrder_1D_HDGAdvective_Advection_btest_OBJECT
Scanning dependencies of target ErrorOrder_1D_HDGAdvective_Advection_btest_build
[ 91%] Linking CXX executable ErrorOrder_1D_HDGAdvective_Advection_btest
[ 91%] Built target ErrorOrder_1D_HDGAdvective_Advection_btest_build
Scanning dependencies of target ErrorOrder_2D_EDG_Triangle_AD_btest_OBJECT
[ 91%] Building CXX object test/system/Asymptotic/CMakeFiles/ErrorOrder_2D_EDG_Triangle_AD_btest_OBJECT.dir/ErrorOrder_2D_EDG_Triangle_AD_btest.cpp.o
[ 91%] Built target ErrorOrder_2D_EDG_Triangle_AD_btest_OBJECT
Scanning dependencies of target ErrorOrder_2D_EDG_Triangle_AD_btest_build_vera
[ 91%] Checking style of test/system/Asymptotic/ErrorOrder_2D_EDG_Triangle_AD_btest.cpp
[ 91%] Built target ErrorOrder_2D_EDG_Triangle_AD_btest_build_vera
Scanning dependencies of target ErrorOrder_2D_EDG_Triangle_AD_btest_build
[ 91%] Linking CXX executable ErrorOrder_2D_EDG_Triangle_AD_btest
[ 91%] Built target ErrorOrder_2D_EDG_Triangle_AD_btest_build
Scanning dependencies of target ErrorEstimateOrder_1D_CG_Line_AD_btest_OBJECT
[ 91%] Building CXX object test/system/Asymptotic/CMakeFiles/ErrorEstimateOrder_1D_CG_Line_AD_btest_OBJECT.dir/ErrorEstimateOrder_1D_CG_Line_AD_btest.cpp.o
[ 91%] Built target ErrorEstimateOrder_1D_CG_Line_AD_btest_OBJECT
Scanning dependencies of target ErrorEstimateOrder_1D_CG_Line_AD_btest_build_vera
[ 91%] Checking style of test/system/Asymptotic/ErrorEstimateOrder_1D_CG_Line_AD_btest.cpp
[ 91%] Built target ErrorEstimateOrder_1D_CG_Line_AD_btest_build_vera
Scanning dependencies of target ErrorEstimateOrder_1D_CG_Line_AD_btest_build
[ 91%] Linking CXX executable ErrorEstimateOrder_1D_CG_Line_AD_btest
[ 91%] Built target ErrorEstimateOrder_1D_CG_Line_AD_btest_build
Scanning dependencies of target ErrorEstimateOrder_2D_HDG_Triangle_AD_btest_build_vera
[ 91%] Checking style of test/system/Asymptotic/ErrorEstimateOrder_2D_HDG_Triangle_AD_btest.cpp
[ 91%] Built target ErrorEstimateOrder_2D_HDG_Triangle_AD_btest_build_vera
Scanning dependencies of target ErrorEstimateOrder_2D_HDG_Triangle_AD_btest_OBJECT
[ 91%] Building CXX object test/system/Asymptotic/CMakeFiles/ErrorEstimateOrder_2D_HDG_Triangle_AD_btest_OBJECT.dir/ErrorEstimateOrder_2D_HDG_Triangle_AD_btest.cpp.o
[ 91%] Built target ErrorEstimateOrder_2D_HDG_Triangle_AD_btest_OBJECT
Scanning dependencies of target ErrorEstimateOrder_2D_HDG_Triangle_AD_btest_build
[ 91%] Linking CXX executable ErrorEstimateOrder_2D_HDG_Triangle_AD_btest
[ 91%] Built target ErrorEstimateOrder_2D_HDG_Triangle_AD_btest_build
Scanning dependencies of target ErrorOrder_1D_HDG_Burgers_btest_OBJECT
[ 91%] Building CXX object test/system/Asymptotic/CMakeFiles/ErrorOrder_1D_HDG_Burgers_btest_OBJECT.dir/ErrorOrder_1D_HDG_Burgers_btest.cpp.o
[ 91%] Built target ErrorOrder_1D_HDG_Burgers_btest_OBJECT
Scanning dependencies of target ErrorOrder_1D_HDG_Burgers_btest_build_vera
[ 91%] Checking style of test/system/Asymptotic/ErrorOrder_1D_HDG_Burgers_btest.cpp
[ 91%] Built target ErrorOrder_1D_HDG_Burgers_btest_build_vera
Scanning dependencies of target ErrorOrder_1D_HDG_Burgers_btest_build
[ 91%] Linking CXX executable ErrorOrder_1D_HDG_Burgers_btest
[ 91%] Built target ErrorOrder_1D_HDG_Burgers_btest_build
Scanning dependencies of target ErrorOrder_1D_DGBR2_TwoPhase_ST_btest_build_vera
[ 91%] Checking style of test/system/Asymptotic/ErrorOrder_1D_DGBR2_TwoPhase_ST_btest.cpp
[ 91%] Built target ErrorOrder_1D_DGBR2_TwoPhase_ST_btest_build_vera
Scanning dependencies of target ErrorOrder_1D_DGBR2_TwoPhase_ST_btest_OBJECT
[ 91%] Building CXX object test/system/Asymptotic/CMakeFiles/ErrorOrder_1D_DGBR2_TwoPhase_ST_btest_OBJECT.dir/ErrorOrder_1D_DGBR2_TwoPhase_ST_btest.cpp.o
[ 91%] Built target ErrorOrder_1D_DGBR2_TwoPhase_ST_btest_OBJECT
Scanning dependencies of target ErrorOrder_1D_DGBR2_TwoPhase_ST_btest_build
[ 91%] Linking CXX executable ErrorOrder_1D_DGBR2_TwoPhase_ST_btest
[ 91%] Built target ErrorOrder_1D_DGBR2_TwoPhase_ST_btest_build
Scanning dependencies of target Adjoint1D_DGBR2_BuckleyLeverett_ST_btest_build_vera
[ 91%] Checking style of test/system/Asymptotic/Adjoint1D_DGBR2_BuckleyLeverett_ST_btest.cpp
[ 91%] Built target Adjoint1D_DGBR2_BuckleyLeverett_ST_btest_build_vera
Scanning dependencies of target Adjoint1D_DGBR2_BuckleyLeverett_ST_btest_OBJECT
[ 91%] Building CXX object test/system/Asymptotic/CMakeFiles/Adjoint1D_DGBR2_BuckleyLeverett_ST_btest_OBJECT.dir/Adjoint1D_DGBR2_BuckleyLeverett_ST_btest.cpp.o
[ 91%] Built target Adjoint1D_DGBR2_BuckleyLeverett_ST_btest_OBJECT
Scanning dependencies of target Adjoint1D_DGBR2_BuckleyLeverett_ST_btest_build
[ 94%] Linking CXX executable Adjoint1D_DGBR2_BuckleyLeverett_ST_btest
[ 94%] Built target Adjoint1D_DGBR2_BuckleyLeverett_ST_btest_build
Scanning dependencies of target ErrorOrder_3D_CG_Sphere_Triangle_AD_btest_build_vera
[ 94%] Checking style of test/system/Asymptotic/ErrorOrder_3D_CG_Sphere_Triangle_AD_btest.cpp
[ 94%] Built target ErrorOrder_3D_CG_Sphere_Triangle_AD_btest_build_vera
Scanning dependencies of target ErrorOrder_3D_CG_Sphere_Triangle_AD_btest_OBJECT
[ 94%] Building CXX object test/system/Asymptotic/CMakeFiles/ErrorOrder_3D_CG_Sphere_Triangle_AD_btest_OBJECT.dir/ErrorOrder_3D_CG_Sphere_Triangle_AD_btest.cpp.o
[ 94%] Built target ErrorOrder_3D_CG_Sphere_Triangle_AD_btest_OBJECT
Scanning dependencies of target ErrorOrder_3D_CG_Sphere_Triangle_AD_btest_build
[ 94%] Linking CXX executable ErrorOrder_3D_CG_Sphere_Triangle_AD_btest
[ 94%] Built target ErrorOrder_3D_CG_Sphere_Triangle_AD_btest_build
Scanning dependencies of target ErrorOrder_1D_HDG_AD_btest_build_vera
[ 94%] Checking style of test/system/Asymptotic/ErrorOrder_1D_HDG_AD_btest.cpp
[ 94%] Built target ErrorOrder_1D_HDG_AD_btest_build_vera
Scanning dependencies of target ErrorOrder_1D_HDG_AD_btest_OBJECT
[ 94%] Building CXX object test/system/Asymptotic/CMakeFiles/ErrorOrder_1D_HDG_AD_btest_OBJECT.dir/ErrorOrder_1D_HDG_AD_btest.cpp.o
[ 94%] Built target ErrorOrder_1D_HDG_AD_btest_OBJECT
Scanning dependencies of target ErrorOrder_1D_HDG_AD_btest_build
[ 94%] Linking CXX executable ErrorOrder_1D_HDG_AD_btest
[ 94%] Built target ErrorOrder_1D_HDG_AD_btest_build
Scanning dependencies of target ErrorOrder_1D_DGBR2_AD_BDF_btest_build_vera
[ 94%] Checking style of test/system/Asymptotic/ErrorOrder_1D_DGBR2_AD_BDF_btest.cpp
[ 94%] Built target ErrorOrder_1D_DGBR2_AD_BDF_btest_build_vera
Scanning dependencies of target ErrorOrder_1D_DGBR2_AD_BDF_btest_OBJECT
[ 94%] Building CXX object test/system/Asymptotic/CMakeFiles/ErrorOrder_1D_DGBR2_AD_BDF_btest_OBJECT.dir/ErrorOrder_1D_DGBR2_AD_BDF_btest.cpp.o
[ 94%] Built target ErrorOrder_1D_DGBR2_AD_BDF_btest_OBJECT
Scanning dependencies of target ErrorOrder_1D_DGBR2_AD_BDF_btest_build
[ 94%] Linking CXX executable ErrorOrder_1D_DGBR2_AD_BDF_btest
[ 94%] Built target ErrorOrder_1D_DGBR2_AD_BDF_btest_build
Scanning dependencies of target ErrorOrder_3D_DGBR2_Periodic_Hex_AD_btest_build_vera
[ 94%] Checking style of test/system/Asymptotic/ErrorOrder_3D_DGBR2_Periodic_Hex_AD_btest.cpp
[ 94%] Built target ErrorOrder_3D_DGBR2_Periodic_Hex_AD_btest_build_vera
Scanning dependencies of target ErrorOrder_3D_DGBR2_Periodic_Hex_AD_btest_OBJECT
[ 94%] Building CXX object test/system/Asymptotic/CMakeFiles/ErrorOrder_3D_DGBR2_Periodic_Hex_AD_btest_OBJECT.dir/ErrorOrder_3D_DGBR2_Periodic_Hex_AD_btest.cpp.o
[ 94%] Built target ErrorOrder_3D_DGBR2_Periodic_Hex_AD_btest_OBJECT
Scanning dependencies of target ErrorOrder_3D_DGBR2_Periodic_Hex_AD_btest_build
[ 94%] Linking CXX executable ErrorOrder_3D_DGBR2_Periodic_Hex_AD_btest
[ 94%] Built target ErrorOrder_3D_DGBR2_Periodic_Hex_AD_btest_build
Scanning dependencies of target ErrorEstimateOrder_2D_CG_Triangle_AD_btest_OBJECT
[ 97%] Building CXX object test/system/Asymptotic/CMakeFiles/ErrorEstimateOrder_2D_CG_Triangle_AD_btest_OBJECT.dir/ErrorEstimateOrder_2D_CG_Triangle_AD_btest.cpp.o
[ 97%] Built target ErrorEstimateOrder_2D_CG_Triangle_AD_btest_OBJECT
Scanning dependencies of target ErrorEstimateOrder_2D_CG_Triangle_AD_btest_build_vera
[ 97%] Checking style of test/system/Asymptotic/ErrorEstimateOrder_2D_CG_Triangle_AD_btest.cpp
[ 97%] Built target ErrorEstimateOrder_2D_CG_Triangle_AD_btest_build_vera
Scanning dependencies of target ErrorEstimateOrder_2D_CG_Triangle_AD_btest_build
[ 97%] Linking CXX executable ErrorEstimateOrder_2D_CG_Triangle_AD_btest
[ 97%] Built target ErrorEstimateOrder_2D_CG_Triangle_AD_btest_build
Scanning dependencies of target ErrorOrder_1D_CG_AD_BDF_btest_OBJECT
[ 97%] Building CXX object test/system/Asymptotic/CMakeFiles/ErrorOrder_1D_CG_AD_BDF_btest_OBJECT.dir/ErrorOrder_1D_CG_AD_BDF_btest.cpp.o
[ 97%] Built target ErrorOrder_1D_CG_AD_BDF_btest_OBJECT
Scanning dependencies of target ErrorOrder_1D_CG_AD_BDF_btest_build_vera
[ 97%] Checking style of test/system/Asymptotic/ErrorOrder_1D_CG_AD_BDF_btest.cpp
[ 97%] Built target ErrorOrder_1D_CG_AD_BDF_btest_build_vera
Scanning dependencies of target ErrorOrder_1D_CG_AD_BDF_btest_build
[ 97%] Linking CXX executable ErrorOrder_1D_CG_AD_BDF_btest
[ 97%] Built target ErrorOrder_1D_CG_AD_BDF_btest_build
Scanning dependencies of target ErrorOrder_2D_DGBR2_RANS_MMS_btest_OBJECT
[ 97%] Building CXX object test/system/Asymptotic/CMakeFiles/ErrorOrder_2D_DGBR2_RANS_MMS_btest_OBJECT.dir/ErrorOrder_2D_DGBR2_RANS_MMS_btest.cpp.o
[ 97%] Built target ErrorOrder_2D_DGBR2_RANS_MMS_btest_OBJECT
Scanning dependencies of target ErrorOrder_2D_DGBR2_RANS_MMS_btest_build_vera
[ 97%] Checking style of test/system/Asymptotic/ErrorOrder_2D_DGBR2_RANS_MMS_btest.cpp
[ 97%] Built target ErrorOrder_2D_DGBR2_RANS_MMS_btest_build_vera
Scanning dependencies of target ErrorOrder_2D_DGBR2_RANS_MMS_btest_build
[ 97%] Linking CXX executable ErrorOrder_2D_DGBR2_RANS_MMS_btest
[ 97%] Built target ErrorOrder_2D_DGBR2_RANS_MMS_btest_build
Scanning dependencies of target ErrorEstimateOrder_1D_DGBR2_Line_AD_btest_OBJECT
[ 97%] Building CXX object test/system/Asymptotic/CMakeFiles/ErrorEstimateOrder_1D_DGBR2_Line_AD_btest_OBJECT.dir/ErrorEstimateOrder_1D_DGBR2_Line_AD_btest.cpp.o
[ 97%] Built target ErrorEstimateOrder_1D_DGBR2_Line_AD_btest_OBJECT
Scanning dependencies of target ErrorEstimateOrder_1D_DGBR2_Line_AD_btest_build_vera
[ 97%] Checking style of test/system/Asymptotic/ErrorEstimateOrder_1D_DGBR2_Line_AD_btest.cpp
[ 97%] Built target ErrorEstimateOrder_1D_DGBR2_Line_AD_btest_build_vera
Scanning dependencies of target ErrorEstimateOrder_1D_DGBR2_Line_AD_btest_build
[ 97%] Linking CXX executable ErrorEstimateOrder_1D_DGBR2_Line_AD_btest
[ 97%] Built target ErrorEstimateOrder_1D_DGBR2_Line_AD_btest_build
Scanning dependencies of target ErrorOrder_3D_CG_Hex_AD_btest_OBJECT
[ 97%] Building CXX object test/system/Asymptotic/CMakeFiles/ErrorOrder_3D_CG_Hex_AD_btest_OBJECT.dir/ErrorOrder_3D_CG_Hex_AD_btest.cpp.o
[ 97%] Built target ErrorOrder_3D_CG_Hex_AD_btest_OBJECT
Scanning dependencies of target ErrorOrder_3D_CG_Hex_AD_btest_build_vera
[ 97%] Checking style of test/system/Asymptotic/ErrorOrder_3D_CG_Hex_AD_btest.cpp
[ 97%] Built target ErrorOrder_3D_CG_Hex_AD_btest_build_vera
Scanning dependencies of target ErrorOrder_3D_CG_Hex_AD_btest_build
[ 97%] Linking CXX executable ErrorOrder_3D_CG_Hex_AD_btest
[ 97%] Built target ErrorOrder_3D_CG_Hex_AD_btest_build
Scanning dependencies of target ErrorEstimateOrder_2D_CG_Nodal_Triangle_AD_btest_OBJECT
[ 97%] Building CXX object test/system/Asymptotic/CMakeFiles/ErrorEstimateOrder_2D_CG_Nodal_Triangle_AD_btest_OBJECT.dir/ErrorEstimateOrder_2D_CG_Nodal_Triangle_AD_btest.cpp.o
[ 97%] Built target ErrorEstimateOrder_2D_CG_Nodal_Triangle_AD_btest_OBJECT
Scanning dependencies of target ErrorEstimateOrder_2D_CG_Nodal_Triangle_AD_btest_build_vera
[ 97%] Checking style of test/system/Asymptotic/ErrorEstimateOrder_2D_CG_Nodal_Triangle_AD_btest.cpp
[ 97%] Built target ErrorEstimateOrder_2D_CG_Nodal_Triangle_AD_btest_build_vera
Scanning dependencies of target ErrorEstimateOrder_2D_CG_Nodal_Triangle_AD_btest_build
[ 97%] Linking CXX executable ErrorEstimateOrder_2D_CG_Nodal_Triangle_AD_btest
[ 97%] Built target ErrorEstimateOrder_2D_CG_Nodal_Triangle_AD_btest_build
Scanning dependencies of target ErrorOrder_2D_DGAdvective_Flat_Line_AD_btest_OBJECT
[ 97%] Building CXX object test/system/Asymptotic/CMakeFiles/ErrorOrder_2D_DGAdvective_Flat_Line_AD_btest_OBJECT.dir/ErrorOrder_2D_DGAdvective_Flat_Line_AD_btest.cpp.o
[ 97%] Built target ErrorOrder_2D_DGAdvective_Flat_Line_AD_btest_OBJECT
Scanning dependencies of target ErrorOrder_2D_DGAdvective_Flat_Line_AD_btest_build_vera
[ 97%] Checking style of test/system/Asymptotic/ErrorOrder_2D_DGAdvective_Flat_Line_AD_btest.cpp
[ 97%] Built target ErrorOrder_2D_DGAdvective_Flat_Line_AD_btest_build_vera
Scanning dependencies of target ErrorOrder_2D_DGAdvective_Flat_Line_AD_btest_build
[ 97%] Linking CXX executable ErrorOrder_2D_DGAdvective_Flat_Line_AD_btest
[ 97%] Built target ErrorOrder_2D_DGAdvective_Flat_Line_AD_btest_build
Scanning dependencies of target ErrorOrder_1D_DGBR2_AD_btest_OBJECT
[ 97%] Building CXX object test/system/Asymptotic/CMakeFiles/ErrorOrder_1D_DGBR2_AD_btest_OBJECT.dir/ErrorOrder_1D_DGBR2_AD_btest.cpp.o
[ 97%] Built target ErrorOrder_1D_DGBR2_AD_btest_OBJECT
Scanning dependencies of target ErrorOrder_1D_DGBR2_AD_btest_build_vera
[ 97%] Checking style of test/system/Asymptotic/ErrorOrder_1D_DGBR2_AD_btest.cpp
[ 97%] Built target ErrorOrder_1D_DGBR2_AD_btest_build_vera
Scanning dependencies of target ErrorOrder_1D_DGBR2_AD_btest_build
[ 97%] Linking CXX executable ErrorOrder_1D_DGBR2_AD_btest
[ 97%] Built target ErrorOrder_1D_DGBR2_AD_btest_build
Scanning dependencies of target ErrorOrder_2D_HDG_Triangle_AD_btest_build_vera
[ 97%] Checking style of test/system/Asymptotic/ErrorOrder_2D_HDG_Triangle_AD_btest.cpp
[ 97%] Built target ErrorOrder_2D_HDG_Triangle_AD_btest_build_vera
Scanning dependencies of target ErrorOrder_2D_HDG_Triangle_AD_btest_OBJECT
[ 97%] Building CXX object test/system/Asymptotic/CMakeFiles/ErrorOrder_2D_HDG_Triangle_AD_btest_OBJECT.dir/ErrorOrder_2D_HDG_Triangle_AD_btest.cpp.o
[ 97%] Built target ErrorOrder_2D_HDG_Triangle_AD_btest_OBJECT
Scanning dependencies of target ErrorOrder_2D_HDG_Triangle_AD_btest_build
[ 97%] Linking CXX executable ErrorOrder_2D_HDG_Triangle_AD_btest
[ 97%] Built target ErrorOrder_2D_HDG_Triangle_AD_btest_build
Scanning dependencies of target ErrorOrder_2D_DGAdvective_Annulus_Triangle_btest_OBJECT
[ 97%] Building CXX object test/system/Asymptotic/CMakeFiles/ErrorOrder_2D_DGAdvective_Annulus_Triangle_btest_OBJECT.dir/ErrorOrder_2D_DGAdvective_Annulus_Triangle_btest.cpp.o
[ 97%] Built target ErrorOrder_2D_DGAdvective_Annulus_Triangle_btest_OBJECT
Scanning dependencies of target ErrorOrder_2D_DGAdvective_Annulus_Triangle_btest_build_vera
[ 97%] Checking style of test/system/Asymptotic/ErrorOrder_2D_DGAdvective_Annulus_Triangle_btest.cpp
[ 97%] Built target ErrorOrder_2D_DGAdvective_Annulus_Triangle_btest_build_vera
Scanning dependencies of target ErrorOrder_2D_DGAdvective_Annulus_Triangle_btest_build
[ 97%] Linking CXX executable ErrorOrder_2D_DGAdvective_Annulus_Triangle_btest
[ 97%] Built target ErrorOrder_2D_DGAdvective_Annulus_Triangle_btest_build
Scanning dependencies of target ErrorOrder_2D_DGAdvective_Circle_Line_AD_btest_OBJECT
[ 97%] Building CXX object test/system/Asymptotic/CMakeFiles/ErrorOrder_2D_DGAdvective_Circle_Line_AD_btest_OBJECT.dir/ErrorOrder_2D_DGAdvective_Circle_Line_AD_btest.cpp.o
[ 97%] Built target ErrorOrder_2D_DGAdvective_Circle_Line_AD_btest_OBJECT
Scanning dependencies of target ErrorOrder_2D_DGAdvective_Circle_Line_AD_btest_build_vera
[ 97%] Checking style of test/system/Asymptotic/ErrorOrder_2D_DGAdvective_Circle_Line_AD_btest.cpp
[ 97%] Built target ErrorOrder_2D_DGAdvective_Circle_Line_AD_btest_build_vera
Scanning dependencies of target ErrorOrder_2D_DGAdvective_Circle_Line_AD_btest_build
[ 97%] Linking CXX executable ErrorOrder_2D_DGAdvective_Circle_Line_AD_btest
[ 97%] Built target ErrorOrder_2D_DGAdvective_Circle_Line_AD_btest_build
Scanning dependencies of target ErrorEstimateOrder_2D_CG_Triangle_RD_btest_OBJECT
[ 97%] Building CXX object test/system/Asymptotic/CMakeFiles/ErrorEstimateOrder_2D_CG_Triangle_RD_btest_OBJECT.dir/ErrorEstimateOrder_2D_CG_Triangle_RD_btest.cpp.o
[ 97%] Built target ErrorEstimateOrder_2D_CG_Triangle_RD_btest_OBJECT
Scanning dependencies of target ErrorEstimateOrder_2D_CG_Triangle_RD_btest_build_vera
[ 97%] Checking style of test/system/Asymptotic/ErrorEstimateOrder_2D_CG_Triangle_RD_btest.cpp
[ 97%] Built target ErrorEstimateOrder_2D_CG_Triangle_RD_btest_build_vera
Scanning dependencies of target ErrorEstimateOrder_2D_CG_Triangle_RD_btest_build
[ 97%] Linking CXX executable ErrorEstimateOrder_2D_CG_Triangle_RD_btest
[ 97%] Built target ErrorEstimateOrder_2D_CG_Triangle_RD_btest_build
Scanning dependencies of target ErrorOrder_2D_CG_Triangle_AD_btest_OBJECT
[ 97%] Building CXX object test/system/Asymptotic/CMakeFiles/ErrorOrder_2D_CG_Triangle_AD_btest_OBJECT.dir/ErrorOrder_2D_CG_Triangle_AD_btest.cpp.o
[ 97%] Built target ErrorOrder_2D_CG_Triangle_AD_btest_OBJECT
Scanning dependencies of target ErrorOrder_2D_CG_Triangle_AD_btest_build_vera
[ 97%] Checking style of test/system/Asymptotic/ErrorOrder_2D_CG_Triangle_AD_btest.cpp
[ 97%] Built target ErrorOrder_2D_CG_Triangle_AD_btest_build_vera
Scanning dependencies of target ErrorOrder_2D_CG_Triangle_AD_btest_build
[ 97%] Linking CXX executable ErrorOrder_2D_CG_Triangle_AD_btest
[ 97%] Built target ErrorOrder_2D_CG_Triangle_AD_btest_build
Scanning dependencies of target ErrorOrder_1D_DGBR2_BuckleyLeverett_ST_btest_build_vera
[ 97%] Checking style of test/system/Asymptotic/ErrorOrder_1D_DGBR2_BuckleyLeverett_ST_btest.cpp
[ 97%] Built target ErrorOrder_1D_DGBR2_BuckleyLeverett_ST_btest_build_vera
Scanning dependencies of target ErrorOrder_1D_DGBR2_BuckleyLeverett_ST_btest_OBJECT
[ 97%] Building CXX object test/system/Asymptotic/CMakeFiles/ErrorOrder_1D_DGBR2_BuckleyLeverett_ST_btest_OBJECT.dir/ErrorOrder_1D_DGBR2_BuckleyLeverett_ST_btest.cpp.o
[ 97%] Built target ErrorOrder_1D_DGBR2_BuckleyLeverett_ST_btest_OBJECT
Scanning dependencies of target ErrorOrder_1D_DGBR2_BuckleyLeverett_ST_btest_build
[ 97%] Linking CXX executable ErrorOrder_1D_DGBR2_BuckleyLeverett_ST_btest
[ 97%] Built target ErrorOrder_1D_DGBR2_BuckleyLeverett_ST_btest_build
Scanning dependencies of target ErrorOrder_2D_CG_Quad_AD_btest_build_vera
[ 97%] Checking style of test/system/Asymptotic/ErrorOrder_2D_CG_Quad_AD_btest.cpp
[ 97%] Built target ErrorOrder_2D_CG_Quad_AD_btest_build_vera
Scanning dependencies of target ErrorOrder_2D_CG_Quad_AD_btest_OBJECT
[ 97%] Building CXX object test/system/Asymptotic/CMakeFiles/ErrorOrder_2D_CG_Quad_AD_btest_OBJECT.dir/ErrorOrder_2D_CG_Quad_AD_btest.cpp.o
[ 97%] Built target ErrorOrder_2D_CG_Quad_AD_btest_OBJECT
Scanning dependencies of target ErrorOrder_2D_CG_Quad_AD_btest_build
[ 97%] Linking CXX executable ErrorOrder_2D_CG_Quad_AD_btest
[ 97%] Built target ErrorOrder_2D_CG_Quad_AD_btest_build
Scanning dependencies of target ErrorEstimateOrder_2D_DGBR2_Triangle_AD_btest_OBJECT
[ 97%] Building CXX object test/system/Asymptotic/CMakeFiles/ErrorEstimateOrder_2D_DGBR2_Triangle_AD_btest_OBJECT.dir/ErrorEstimateOrder_2D_DGBR2_Triangle_AD_btest.cpp.o
[ 97%] Built target ErrorEstimateOrder_2D_DGBR2_Triangle_AD_btest_OBJECT
Scanning dependencies of target ErrorEstimateOrder_2D_DGBR2_Triangle_AD_btest_build_vera
[ 97%] Checking style of test/system/Asymptotic/ErrorEstimateOrder_2D_DGBR2_Triangle_AD_btest.cpp
[ 97%] Built target ErrorEstimateOrder_2D_DGBR2_Triangle_AD_btest_build_vera
Scanning dependencies of target ErrorEstimateOrder_2D_DGBR2_Triangle_AD_btest_build
[ 97%] Linking CXX executable ErrorEstimateOrder_2D_DGBR2_Triangle_AD_btest
[ 97%] Built target ErrorEstimateOrder_2D_DGBR2_Triangle_AD_btest_build
Scanning dependencies of target ErrorOrder_2D_DGAdvective_Circle_Line_ShallowWater_btest_build_vera
[ 97%] Checking style of test/system/Asymptotic/ErrorOrder_2D_DGAdvective_Circle_Line_ShallowWater_btest.cpp
[ 97%] Built target ErrorOrder_2D_DGAdvective_Circle_Line_ShallowWater_btest_build_vera
Scanning dependencies of target ErrorOrder_2D_DGAdvective_Circle_Line_ShallowWater_btest_OBJECT
[ 97%] Building CXX object test/system/Asymptotic/CMakeFiles/ErrorOrder_2D_DGAdvective_Circle_Line_ShallowWater_btest_OBJECT.dir/ErrorOrder_2D_DGAdvective_Circle_Line_ShallowWater_btest.cpp.o
[ 97%] Built target ErrorOrder_2D_DGAdvective_Circle_Line_ShallowWater_btest_OBJECT
Scanning dependencies of target ErrorOrder_2D_DGAdvective_Circle_Line_ShallowWater_btest_build
[ 97%] Linking CXX executable ErrorOrder_2D_DGAdvective_Circle_Line_ShallowWater_btest
[ 97%] Built target ErrorOrder_2D_DGAdvective_Circle_Line_ShallowWater_btest_build
Scanning dependencies of target ErrorOrder_1D_DGAdvective_ShallowWater_btest_build_vera
[ 97%] Checking style of test/system/Asymptotic/ErrorOrder_1D_DGAdvective_ShallowWater_btest.cpp
[ 97%] Built target ErrorOrder_1D_DGAdvective_ShallowWater_btest_build_vera
Scanning dependencies of target ErrorOrder_1D_DGAdvective_ShallowWater_btest_OBJECT
[ 97%] Building CXX object test/system/Asymptotic/CMakeFiles/ErrorOrder_1D_DGAdvective_ShallowWater_btest_OBJECT.dir/ErrorOrder_1D_DGAdvective_ShallowWater_btest.cpp.o
[ 97%] Built target ErrorOrder_1D_DGAdvective_ShallowWater_btest_OBJECT
Scanning dependencies of target ErrorOrder_1D_DGAdvective_ShallowWater_btest_build
[ 97%] Linking CXX executable ErrorOrder_1D_DGAdvective_ShallowWater_btest
[ 97%] Built target ErrorOrder_1D_DGAdvective_ShallowWater_btest_build
Scanning dependencies of target ElementLocalSolve2D_DGBR2_Triangle_AD_btest_OBJECT
[ 97%] Building CXX object test/system/LocalSolve/CMakeFiles/ElementLocalSolve2D_DGBR2_Triangle_AD_btest_OBJECT.dir/ElementLocalSolve2D_DGBR2_Triangle_AD_btest.cpp.o
[ 97%] Built target ElementLocalSolve2D_DGBR2_Triangle_AD_btest_OBJECT
[ 97%] Generating CXX unity source src/Discretization/cotire/BlockLib_CXX_unity.cxx
[ 97%] Generating CXX prefix source src/Discretization/cotire/BlockLib_CXX_prefix.cxx
[ 97%] Generating CXX prefix header src/Discretization/cotire/BlockLib_CXX_prefix.hxx
[ 97%] Building CXX precompiled header src/Discretization/cotire/BlockLib_CXX_prefix.hxx.pch
Scanning dependencies of target BlockLib
[100%] Building CXX object src/Discretization/CMakeFiles/BlockLib.dir/Block/AlgebraicEquationSet_Block2x2_Real_Real.cpp.o
[100%] Building CXX object src/Discretization/CMakeFiles/BlockLib.dir/Block/AlgebraicEquationSet_Block2x2_VecS3_Real.cpp.o
[100%] Building CXX object src/Discretization/CMakeFiles/BlockLib.dir/Block/AlgebraicEquationSet_Block2x2_VecS4_Real.cpp.o
[100%] Linking CXX static library libBlockLib.a
[100%] Built target BlockLib
Scanning dependencies of target BlockLinAlgLib_vera
[100%] Checking style of src/LinearAlgebra/BlockLinAlg/MatrixBlock_3x3.h
[100%] Checking style of src/LinearAlgebra/BlockLinAlg/MatrixBlock_2x2.h
[100%] Checking style of src/LinearAlgebra/BlockLinAlg/MatrixBlock_2x2_InverseLU.h
[100%] Checking style of src/LinearAlgebra/BlockLinAlg/MatrixBlock_2x2_Inverse.h
[100%] Checking style of src/LinearAlgebra/BlockLinAlg/BlockLinAlg_Type.h
[100%] Checking style of src/LinearAlgebra/BlockLinAlg/MatrixBlock_2x2_Decompose_LU.h
[100%] Checking style of src/LinearAlgebra/BlockLinAlg/VectorBlock_4.h
[100%] Checking style of src/LinearAlgebra/BlockLinAlg/MatrixBlock_2x2_Transpose.h
[100%] Checking style of src/LinearAlgebra/BlockLinAlg/MatrixBlock_2x2_InverseLUP.h
[100%] Checking style of src/LinearAlgebra/BlockLinAlg/MatrixBlock_4x4.h
[100%] Checking style of src/LinearAlgebra/BlockLinAlg/BlockLinAlg_Add.h
[100%] Checking style of src/LinearAlgebra/BlockLinAlg/BlockLinAlg_Mul.h
[100%] Checking style of src/LinearAlgebra/BlockLinAlg/MatrixBlock_2x2_Decompose_LUP.h
[100%] Checking style of src/LinearAlgebra/BlockLinAlg/VectorBlock_3.h
[100%] Checking style of src/LinearAlgebra/BlockLinAlg/VectorBlock_2.h
[100%] Checking style of src/LinearAlgebra/BlockLinAlg/MatrixBlock_2x2_InverseLUP.cpp
[100%] Checking style of src/LinearAlgebra/BlockLinAlg/MatrixBlock_2x2_Decompose_LUP.cpp
[100%] Checking style of src/LinearAlgebra/BlockLinAlg/MatrixBlock_2x2_Decompose_LU.cpp
[100%] Checking style of src/LinearAlgebra/BlockLinAlg/MatrixBlock_2x2_InverseLU.cpp
[100%] Built target BlockLinAlgLib_vera
[100%] Generating CXX unity source src/LinearAlgebra/BlockLinAlg/cotire/BlockLinAlgLib_CXX_unity.cxx
[100%] Generating CXX prefix source src/LinearAlgebra/BlockLinAlg/cotire/BlockLinAlgLib_CXX_prefix.cxx
[100%] Generating CXX prefix header src/LinearAlgebra/BlockLinAlg/cotire/BlockLinAlgLib_CXX_prefix.hxx
[100%] Building CXX precompiled header src/LinearAlgebra/BlockLinAlg/cotire/BlockLinAlgLib_CXX_prefix.hxx.pch
Scanning dependencies of target BlockLinAlgLib
[100%] Building CXX object src/LinearAlgebra/BlockLinAlg/CMakeFiles/BlockLinAlgLib.dir/MatrixBlock_2x2_Decompose_LU.cpp.o
[100%] Building CXX object src/LinearAlgebra/BlockLinAlg/CMakeFiles/BlockLinAlgLib.dir/MatrixBlock_2x2_Decompose_LUP.cpp.o
[100%] Building CXX object src/LinearAlgebra/BlockLinAlg/CMakeFiles/BlockLinAlgLib.dir/MatrixBlock_2x2_InverseLU.cpp.o
[100%] Building CXX object src/LinearAlgebra/BlockLinAlg/CMakeFiles/BlockLinAlgLib.dir/MatrixBlock_2x2_InverseLUP.cpp.o
[100%] Linking CXX static library libBlockLinAlgLib.a
[100%] Built target BlockLinAlgLib
Scanning dependencies of target pdeSensorLib_vera
[100%] Checking style of src/pde/Sensor/Sensor_ViscousFlux1D.h
[100%] Checking style of src/pde/Sensor/Source1D_JumpSensor.h
[100%] Checking style of src/pde/Sensor/BCSensorParameter2D.h
[100%] Checking style of src/pde/Sensor/Sensor_Source1D.h
[100%] Checking style of src/pde/Sensor/Source2D_JumpSensor.h
[100%] Checking style of src/pde/Sensor/Sensor_Source2D.h
[100%] Checking style of src/pde/Sensor/PDESensorParameter2D.h
[100%] Checking style of src/pde/Sensor/Sensor_AdvectiveFlux2D.h
[100%] Checking style of src/pde/Sensor/Sensor_ViscousFlux2D.h
[100%] Checking style of src/pde/Sensor/BCSensorParameter1D.h
[100%] Checking style of src/pde/Sensor/SensorParameter_Traits.h
[100%] Checking style of src/pde/Sensor/PDESensorParameter1D.h
[100%] Checking style of src/pde/Sensor/Sensor_AdvectiveFlux1D.h
[100%] Checking style of src/pde/Sensor/Sensor_ViscousFlux1D.cpp
[100%] Checking style of src/pde/Sensor/Sensor_ViscousFlux2D.cpp
[100%] Checking style of src/pde/Sensor/Sensor_AdvectiveFlux1D.cpp
[100%] Checking style of src/pde/Sensor/PDESensorParameter1D.cpp
[100%] Checking style of src/pde/Sensor/Sensor_AdvectiveFlux2D.cpp
[100%] Checking style of src/pde/Sensor/BCSensorParameter2D.cpp
[100%] Checking style of src/pde/Sensor/BCSensorParameter1D.cpp
[100%] Checking style of src/pde/Sensor/PDESensorParameter2D.cpp
[100%] Built target pdeSensorLib_vera
[100%] Generating CXX unity source src/pde/Sensor/cotire/pdeSensorLib_CXX_unity.cxx
[100%] Generating CXX prefix source src/pde/Sensor/cotire/pdeSensorLib_CXX_prefix.cxx
[100%] Generating CXX prefix header src/pde/Sensor/cotire/pdeSensorLib_CXX_prefix.hxx
[100%] Building CXX precompiled header src/pde/Sensor/cotire/pdeSensorLib_CXX_prefix.hxx.pch
Scanning dependencies of target pdeSensorLib
[100%] Building CXX object src/pde/Sensor/CMakeFiles/pdeSensorLib.dir/BCSensorParameter1D.cpp.o
[100%] Building CXX object src/pde/Sensor/CMakeFiles/pdeSensorLib.dir/BCSensorParameter2D.cpp.o
[100%] Building CXX object src/pde/Sensor/CMakeFiles/pdeSensorLib.dir/PDESensorParameter1D.cpp.o
[100%] Building CXX object src/pde/Sensor/CMakeFiles/pdeSensorLib.dir/PDESensorParameter2D.cpp.o
[100%] Building CXX object src/pde/Sensor/CMakeFiles/pdeSensorLib.dir/Sensor_AdvectiveFlux1D.cpp.o
[100%] Building CXX object src/pde/Sensor/CMakeFiles/pdeSensorLib.dir/Sensor_AdvectiveFlux2D.cpp.o
[100%] Building CXX object src/pde/Sensor/CMakeFiles/pdeSensorLib.dir/Sensor_ViscousFlux1D.cpp.o
[100%] Building CXX object src/pde/Sensor/CMakeFiles/pdeSensorLib.dir/Sensor_ViscousFlux2D.cpp.o
[100%] Linking CXX static library libpdeSensorLib.a
[100%] Built target pdeSensorLib
Scanning dependencies of target ElementLocalSolve2D_DGBR2_Triangle_AD_btest_build_vera
[100%] Checking style of test/system/LocalSolve/ElementLocalSolve2D_DGBR2_Triangle_AD_btest.cpp
[100%] Built target ElementLocalSolve2D_DGBR2_Triangle_AD_btest_build_vera
Scanning dependencies of target ElementLocalSolve2D_DGBR2_Triangle_AD_btest_build
[100%] Linking CXX executable ElementLocalSolve2D_DGBR2_Triangle_AD_btest
[100%] Built target ElementLocalSolve2D_DGBR2_Triangle_AD_btest_build
Scanning dependencies of target EdgeLocalSolve2D_Dual_Galerkin_Stabilized_Euler_btest_build_vera
[100%] Checking style of test/system/LocalSolve/EdgeLocalSolve2D_Dual_Galerkin_Stabilized_Euler_btest.cpp
[100%] Built target EdgeLocalSolve2D_Dual_Galerkin_Stabilized_Euler_btest_build_vera
Scanning dependencies of target EdgeLocalSolve2D_Dual_Galerkin_Stabilized_Euler_btest_OBJECT
[100%] Building CXX object test/system/LocalSolve/CMakeFiles/EdgeLocalSolve2D_Dual_Galerkin_Stabilized_Euler_btest_OBJECT.dir/EdgeLocalSolve2D_Dual_Galerkin_Stabilized_Euler_btest.cpp.o
[100%] Built target EdgeLocalSolve2D_Dual_Galerkin_Stabilized_Euler_btest_OBJECT
Scanning dependencies of target EdgeLocalSolve2D_Dual_Galerkin_Stabilized_Euler_btest_build
[100%] Linking CXX executable EdgeLocalSolve2D_Dual_Galerkin_Stabilized_Euler_btest
[100%] Built target EdgeLocalSolve2D_Dual_Galerkin_Stabilized_Euler_btest_build
Scanning dependencies of target LocalSolve1D_Split_DGBR2_AD_btest_build_vera
[100%] Checking style of test/system/LocalSolve/LocalSolve1D_Split_DGBR2_AD_btest.cpp
[100%] Built target LocalSolve1D_Split_DGBR2_AD_btest_build_vera
Scanning dependencies of target LocalSolve1D_Split_DGBR2_AD_btest_OBJECT
[100%] Building CXX object test/system/LocalSolve/CMakeFiles/LocalSolve1D_Split_DGBR2_AD_btest_OBJECT.dir/LocalSolve1D_Split_DGBR2_AD_btest.cpp.o
[100%] Built target LocalSolve1D_Split_DGBR2_AD_btest_OBJECT
Scanning dependencies of target LocalSolve1D_Split_DGBR2_AD_btest_build
[100%] Linking CXX executable LocalSolve1D_Split_DGBR2_AD_btest
[100%] Built target LocalSolve1D_Split_DGBR2_AD_btest_build
Scanning dependencies of target EdgeLocalSolve2D_Dual_Galerkin_Stabilized_AR_btest_build_vera
[100%] Checking style of test/system/LocalSolve/EdgeLocalSolve2D_Dual_Galerkin_Stabilized_AR_btest.cpp
[100%] Built target EdgeLocalSolve2D_Dual_Galerkin_Stabilized_AR_btest_build_vera
Scanning dependencies of target EdgeLocalSolve2D_Dual_Galerkin_Stabilized_AR_btest_OBJECT
[100%] Building CXX object test/system/LocalSolve/CMakeFiles/EdgeLocalSolve2D_Dual_Galerkin_Stabilized_AR_btest_OBJECT.dir/EdgeLocalSolve2D_Dual_Galerkin_Stabilized_AR_btest.cpp.o
[100%] Built target EdgeLocalSolve2D_Dual_Galerkin_Stabilized_AR_btest_OBJECT
Scanning dependencies of target EdgeLocalSolve2D_Dual_Galerkin_Stabilized_AR_btest_build
[100%] Linking CXX executable EdgeLocalSolve2D_Dual_Galerkin_Stabilized_AR_btest
[100%] Built target EdgeLocalSolve2D_Dual_Galerkin_Stabilized_AR_btest_build
Scanning dependencies of target LocalSolve3D_HDG_Tet_AD_btest_build_vera
[100%] Checking style of test/system/LocalSolve/LocalSolve3D_HDG_Tet_AD_btest.cpp
[100%] Built target LocalSolve3D_HDG_Tet_AD_btest_build_vera
Scanning dependencies of target LocalSolve3D_HDG_Tet_AD_btest_OBJECT
[100%] Building CXX object test/system/LocalSolve/CMakeFiles/LocalSolve3D_HDG_Tet_AD_btest_OBJECT.dir/LocalSolve3D_HDG_Tet_AD_btest.cpp.o
[100%] Built target LocalSolve3D_HDG_Tet_AD_btest_OBJECT
Scanning dependencies of target LocalSolve3D_HDG_Tet_AD_btest_build
[100%] Linking CXX executable LocalSolve3D_HDG_Tet_AD_btest
[100%] Built target LocalSolve3D_HDG_Tet_AD_btest_build
Scanning dependencies of target EdgeLocalSolve3D_Dual_Galerkin_Stabilized_AD_btest_build_vera
[100%] Checking style of test/system/LocalSolve/EdgeLocalSolve3D_Dual_Galerkin_Stabilized_AD_btest.cpp
[100%] Built target EdgeLocalSolve3D_Dual_Galerkin_Stabilized_AD_btest_build_vera
Scanning dependencies of target EdgeLocalSolve3D_Dual_Galerkin_Stabilized_AD_btest_OBJECT
[100%] Building CXX object test/system/LocalSolve/CMakeFiles/EdgeLocalSolve3D_Dual_Galerkin_Stabilized_AD_btest_OBJECT.dir/EdgeLocalSolve3D_Dual_Galerkin_Stabilized_AD_btest.cpp.o
[100%] Built target EdgeLocalSolve3D_Dual_Galerkin_Stabilized_AD_btest_OBJECT
Scanning dependencies of target EdgeLocalSolve3D_Dual_Galerkin_Stabilized_AD_btest_build
[100%] Linking CXX executable EdgeLocalSolve3D_Dual_Galerkin_Stabilized_AD_btest
[100%] Built target EdgeLocalSolve3D_Dual_Galerkin_Stabilized_AD_btest_build
Scanning dependencies of target ElementLocalSolve3D_DGBR2_Tet_AD_btest_build_vera
[100%] Checking style of test/system/LocalSolve/ElementLocalSolve3D_DGBR2_Tet_AD_btest.cpp
[100%] Built target ElementLocalSolve3D_DGBR2_Tet_AD_btest_build_vera
Scanning dependencies of target ElementLocalSolve3D_DGBR2_Tet_AD_btest_OBJECT
[100%] Building CXX object test/system/LocalSolve/CMakeFiles/ElementLocalSolve3D_DGBR2_Tet_AD_btest_OBJECT.dir/ElementLocalSolve3D_DGBR2_Tet_AD_btest.cpp.o
[100%] Built target ElementLocalSolve3D_DGBR2_Tet_AD_btest_OBJECT
Scanning dependencies of target ElementLocalSolve3D_DGBR2_Tet_AD_btest_build
[100%] Linking CXX executable ElementLocalSolve3D_DGBR2_Tet_AD_btest
[100%] Built target ElementLocalSolve3D_DGBR2_Tet_AD_btest_build
Scanning dependencies of target LocalSolve2D_HDG_Triangle_AD_btest_build_vera
[100%] Checking style of test/system/LocalSolve/LocalSolve2D_HDG_Triangle_AD_btest.cpp
[100%] Built target LocalSolve2D_HDG_Triangle_AD_btest_build_vera
Scanning dependencies of target LocalSolve2D_HDG_Triangle_AD_btest_OBJECT
[100%] Building CXX object test/system/LocalSolve/CMakeFiles/LocalSolve2D_HDG_Triangle_AD_btest_OBJECT.dir/LocalSolve2D_HDG_Triangle_AD_btest.cpp.o
[100%] Built target LocalSolve2D_HDG_Triangle_AD_btest_OBJECT
Scanning dependencies of target LocalSolve2D_HDG_Triangle_AD_btest_build
[100%] Linking CXX executable LocalSolve2D_HDG_Triangle_AD_btest
[100%] Built target LocalSolve2D_HDG_Triangle_AD_btest_build
Scanning dependencies of target EdgeLocalSolve1D_Primal_DGBR2_Line_AD_btest_OBJECT
[100%] Building CXX object test/system/LocalSolve/CMakeFiles/EdgeLocalSolve1D_Primal_DGBR2_Line_AD_btest_OBJECT.dir/EdgeLocalSolve1D_Primal_DGBR2_Line_AD_btest.cpp.o
[100%] Built target EdgeLocalSolve1D_Primal_DGBR2_Line_AD_btest_OBJECT
Scanning dependencies of target EdgeLocalSolve1D_Primal_DGBR2_Line_AD_btest_build_vera
[100%] Checking style of test/system/LocalSolve/EdgeLocalSolve1D_Primal_DGBR2_Line_AD_btest.cpp
[100%] Built target EdgeLocalSolve1D_Primal_DGBR2_Line_AD_btest_build_vera
Scanning dependencies of target EdgeLocalSolve1D_Primal_DGBR2_Line_AD_btest_build
[100%] Linking CXX executable EdgeLocalSolve1D_Primal_DGBR2_Line_AD_btest
[100%] Built target EdgeLocalSolve1D_Primal_DGBR2_Line_AD_btest_build
Scanning dependencies of target LocalSolve1D_HDG_AD_btest_build_vera
[100%] Checking style of test/system/LocalSolve/LocalSolve1D_HDG_AD_btest.cpp
[100%] Built target LocalSolve1D_HDG_AD_btest_build_vera
Scanning dependencies of target LocalSolve1D_HDG_AD_btest_OBJECT
[100%] Building CXX object test/system/LocalSolve/CMakeFiles/LocalSolve1D_HDG_AD_btest_OBJECT.dir/LocalSolve1D_HDG_AD_btest.cpp.o
[100%] Built target LocalSolve1D_HDG_AD_btest_OBJECT
Scanning dependencies of target LocalSolve1D_HDG_AD_btest_build
[100%] Linking CXX executable LocalSolve1D_HDG_AD_btest
[100%] Built target LocalSolve1D_HDG_AD_btest_build
Scanning dependencies of target LocalSolve1D_Split_HDG_AD_btest_OBJECT
[100%] Building CXX object test/system/LocalSolve/CMakeFiles/LocalSolve1D_Split_HDG_AD_btest_OBJECT.dir/LocalSolve1D_Split_HDG_AD_btest.cpp.o
[100%] Built target LocalSolve1D_Split_HDG_AD_btest_OBJECT
Scanning dependencies of target LocalSolve1D_Split_HDG_AD_btest_build_vera
[100%] Checking style of test/system/LocalSolve/LocalSolve1D_Split_HDG_AD_btest.cpp
[100%] Built target LocalSolve1D_Split_HDG_AD_btest_build_vera
Scanning dependencies of target LocalSolve1D_Split_HDG_AD_btest_build
[100%] Linking CXX executable LocalSolve1D_Split_HDG_AD_btest
[100%] Built target LocalSolve1D_Split_HDG_AD_btest_build
Scanning dependencies of target LocalSolve3D_Split_HDG_Tet_AD_btest_build_vera
[100%] Checking style of test/system/LocalSolve/LocalSolve3D_Split_HDG_Tet_AD_btest.cpp
[100%] Built target LocalSolve3D_Split_HDG_Tet_AD_btest_build_vera
Scanning dependencies of target LocalSolve3D_Split_HDG_Tet_AD_btest_OBJECT
[100%] Building CXX object test/system/LocalSolve/CMakeFiles/LocalSolve3D_Split_HDG_Tet_AD_btest_OBJECT.dir/LocalSolve3D_Split_HDG_Tet_AD_btest.cpp.o
[100%] Built target LocalSolve3D_Split_HDG_Tet_AD_btest_OBJECT
Scanning dependencies of target LocalSolve3D_Split_HDG_Tet_AD_btest_build
[100%] Linking CXX executable LocalSolve3D_Split_HDG_Tet_AD_btest
[100%] Built target LocalSolve3D_Split_HDG_Tet_AD_btest_build
Scanning dependencies of target LocalSolve2D_Split_HDG_Triangle_AD_btest_OBJECT
[100%] Building CXX object test/system/LocalSolve/CMakeFiles/LocalSolve2D_Split_HDG_Triangle_AD_btest_OBJECT.dir/LocalSolve2D_Split_HDG_Triangle_AD_btest.cpp.o
[100%] Built target LocalSolve2D_Split_HDG_Triangle_AD_btest_OBJECT
Scanning dependencies of target LocalSolve2D_Split_HDG_Triangle_AD_btest_build_vera
[100%] Checking style of test/system/LocalSolve/LocalSolve2D_Split_HDG_Triangle_AD_btest.cpp
[100%] Built target LocalSolve2D_Split_HDG_Triangle_AD_btest_build_vera
Scanning dependencies of target LocalSolve2D_Split_HDG_Triangle_AD_btest_build
[100%] Linking CXX executable LocalSolve2D_Split_HDG_Triangle_AD_btest
[100%] Built target LocalSolve2D_Split_HDG_Triangle_AD_btest_build
Scanning dependencies of target ElementDualLocalSolve3D_Galerkin_Stabilized_Triangle_AD_btest_OBJECT
[100%] Building CXX object test/system/LocalSolve/CMakeFiles/ElementDualLocalSolve3D_Galerkin_Stabilized_Triangle_AD_btest_OBJECT.dir/ElementDualLocalSolve3D_Galerkin_Stabilized_Triangle_AD_btest.cpp.o
[100%] Built target ElementDualLocalSolve3D_Galerkin_Stabilized_Triangle_AD_btest_OBJECT
Scanning dependencies of target ElementDualLocalSolve3D_Galerkin_Stabilized_Triangle_AD_btest_build_vera
[100%] Checking style of test/system/LocalSolve/ElementDualLocalSolve3D_Galerkin_Stabilized_Triangle_AD_btest.cpp
[100%] Built target ElementDualLocalSolve3D_Galerkin_Stabilized_Triangle_AD_btest_build_vera
Scanning dependencies of target ElementDualLocalSolve3D_Galerkin_Stabilized_Triangle_AD_btest_build
[100%] Linking CXX executable ElementDualLocalSolve3D_Galerkin_Stabilized_Triangle_AD_btest
[100%] Built target ElementDualLocalSolve3D_Galerkin_Stabilized_Triangle_AD_btest_build
Scanning dependencies of target EdgeLocalSolve2D_Primal_Galerkin_Stabilized_Triangle_AD_btest_OBJECT
[100%] Building CXX object test/system/LocalSolve/CMakeFiles/EdgeLocalSolve2D_Primal_Galerkin_Stabilized_Triangle_AD_btest_OBJECT.dir/EdgeLocalSolve2D_Primal_Galerkin_Stabilized_Triangle_AD_btest.cpp.o
[100%] Built target EdgeLocalSolve2D_Primal_Galerkin_Stabilized_Triangle_AD_btest_OBJECT
Scanning dependencies of target EdgeLocalSolve2D_Primal_Galerkin_Stabilized_Triangle_AD_btest_build_vera
[100%] Checking style of test/system/LocalSolve/EdgeLocalSolve2D_Primal_Galerkin_Stabilized_Triangle_AD_btest.cpp
[100%] Built target EdgeLocalSolve2D_Primal_Galerkin_Stabilized_Triangle_AD_btest_build_vera
Scanning dependencies of target EdgeLocalSolve2D_Primal_Galerkin_Stabilized_Triangle_AD_btest_build
[100%] Linking CXX executable EdgeLocalSolve2D_Primal_Galerkin_Stabilized_Triangle_AD_btest
[100%] Built target EdgeLocalSolve2D_Primal_Galerkin_Stabilized_Triangle_AD_btest_build
Scanning dependencies of target EdgeLocalSolve2D_Primal_DGBR2_Triangle_AD_btest_build_vera
[100%] Checking style of test/system/LocalSolve/EdgeLocalSolve2D_Primal_DGBR2_Triangle_AD_btest.cpp
[100%] Built target EdgeLocalSolve2D_Primal_DGBR2_Triangle_AD_btest_build_vera
Scanning dependencies of target EdgeLocalSolve2D_Primal_DGBR2_Triangle_AD_btest_OBJECT
[100%] Building CXX object test/system/LocalSolve/CMakeFiles/EdgeLocalSolve2D_Primal_DGBR2_Triangle_AD_btest_OBJECT.dir/EdgeLocalSolve2D_Primal_DGBR2_Triangle_AD_btest.cpp.o
[100%] Built target EdgeLocalSolve2D_Primal_DGBR2_Triangle_AD_btest_OBJECT
Scanning dependencies of target EdgeLocalSolve2D_Primal_DGBR2_Triangle_AD_btest_build
[100%] Linking CXX executable EdgeLocalSolve2D_Primal_DGBR2_Triangle_AD_btest
[100%] Built target EdgeLocalSolve2D_Primal_DGBR2_Triangle_AD_btest_build
Scanning dependencies of target LocalSolve2D_Split_DGBR2_Triangle_AD_AV_btest_build_vera
[100%] Checking style of test/system/LocalSolve/LocalSolve2D_Split_DGBR2_Triangle_AD_AV_btest.cpp
[100%] Built target LocalSolve2D_Split_DGBR2_Triangle_AD_AV_btest_build_vera
Scanning dependencies of target LocalSolve2D_Split_DGBR2_Triangle_AD_AV_btest_OBJECT
[100%] Building CXX object test/system/LocalSolve/CMakeFiles/LocalSolve2D_Split_DGBR2_Triangle_AD_AV_btest_OBJECT.dir/LocalSolve2D_Split_DGBR2_Triangle_AD_AV_btest.cpp.o
[100%] Built target LocalSolve2D_Split_DGBR2_Triangle_AD_AV_btest_OBJECT
Scanning dependencies of target LocalSolve2D_Split_DGBR2_Triangle_AD_AV_btest_build
[100%] Linking CXX executable LocalSolve2D_Split_DGBR2_Triangle_AD_AV_btest
[100%] Built target LocalSolve2D_Split_DGBR2_Triangle_AD_AV_btest_build
Scanning dependencies of target ElementDualLocalSolve2D_Galerkin_Stabilized_Triangle_AD_btest_build_vera
[100%] Checking style of test/system/LocalSolve/ElementDualLocalSolve2D_Galerkin_Stabilized_Triangle_AD_btest.cpp
[100%] Built target ElementDualLocalSolve2D_Galerkin_Stabilized_Triangle_AD_btest_build_vera
Scanning dependencies of target ElementDualLocalSolve2D_Galerkin_Stabilized_Triangle_AD_btest_OBJECT
[100%] Building CXX object test/system/LocalSolve/CMakeFiles/ElementDualLocalSolve2D_Galerkin_Stabilized_Triangle_AD_btest_OBJECT.dir/ElementDualLocalSolve2D_Galerkin_Stabilized_Triangle_AD_btest.cpp.o
[100%] Built target ElementDualLocalSolve2D_Galerkin_Stabilized_Triangle_AD_btest_OBJECT
Scanning dependencies of target ElementDualLocalSolve2D_Galerkin_Stabilized_Triangle_AD_btest_build
[100%] Linking CXX executable ElementDualLocalSolve2D_Galerkin_Stabilized_Triangle_AD_btest
[100%] Built target ElementDualLocalSolve2D_Galerkin_Stabilized_Triangle_AD_btest_build
Scanning dependencies of target EdgeLocalSolve2D_Dual_Galerkin_Stabilized_AD_btest_OBJECT
[100%] Building CXX object test/system/LocalSolve/CMakeFiles/EdgeLocalSolve2D_Dual_Galerkin_Stabilized_AD_btest_OBJECT.dir/EdgeLocalSolve2D_Dual_Galerkin_Stabilized_AD_btest.cpp.o
[100%] Built target EdgeLocalSolve2D_Dual_Galerkin_Stabilized_AD_btest_OBJECT
Scanning dependencies of target EdgeLocalSolve2D_Dual_Galerkin_Stabilized_AD_btest_build_vera
[100%] Checking style of test/system/LocalSolve/EdgeLocalSolve2D_Dual_Galerkin_Stabilized_AD_btest.cpp
[100%] Built target EdgeLocalSolve2D_Dual_Galerkin_Stabilized_AD_btest_build_vera
Scanning dependencies of target EdgeLocalSolve2D_Dual_Galerkin_Stabilized_AD_btest_build
[100%] Linking CXX executable EdgeLocalSolve2D_Dual_Galerkin_Stabilized_AD_btest
[100%] Built target EdgeLocalSolve2D_Dual_Galerkin_Stabilized_AD_btest_build
Scanning dependencies of target ElementLocalSolve1D_DGBR2_Triangle_AD_btest_build_vera
[100%] Checking style of test/system/LocalSolve/ElementLocalSolve1D_DGBR2_Triangle_AD_btest.cpp
[100%] Built target ElementLocalSolve1D_DGBR2_Triangle_AD_btest_build_vera
Scanning dependencies of target ElementLocalSolve1D_DGBR2_Triangle_AD_btest_OBJECT
[100%] Building CXX object test/system/LocalSolve/CMakeFiles/ElementLocalSolve1D_DGBR2_Triangle_AD_btest_OBJECT.dir/ElementLocalSolve1D_DGBR2_Triangle_AD_btest.cpp.o
[100%] Built target ElementLocalSolve1D_DGBR2_Triangle_AD_btest_OBJECT
Scanning dependencies of target ElementLocalSolve1D_DGBR2_Triangle_AD_btest_build
[100%] Linking CXX executable ElementLocalSolve1D_DGBR2_Triangle_AD_btest
[100%] Built target ElementLocalSolve1D_DGBR2_Triangle_AD_btest_build
Scanning dependencies of target ElementLocalSolve3D_DGAdvective_Tet_AD_btest_OBJECT
[100%] Building CXX object test/system/LocalSolve/CMakeFiles/ElementLocalSolve3D_DGAdvective_Tet_AD_btest_OBJECT.dir/ElementLocalSolve3D_DGAdvective_Tet_AD_btest.cpp.o
[100%] Built target ElementLocalSolve3D_DGAdvective_Tet_AD_btest_OBJECT
Scanning dependencies of target ElementLocalSolve3D_DGAdvective_Tet_AD_btest_build_vera
[100%] Checking style of test/system/LocalSolve/ElementLocalSolve3D_DGAdvective_Tet_AD_btest.cpp
[100%] Built target ElementLocalSolve3D_DGAdvective_Tet_AD_btest_build_vera
Scanning dependencies of target ElementLocalSolve3D_DGAdvective_Tet_AD_btest_build
[100%] Linking CXX executable ElementLocalSolve3D_DGAdvective_Tet_AD_btest
[100%] Built target ElementLocalSolve3D_DGAdvective_Tet_AD_btest_build
Scanning dependencies of target EdgeLocalSolve1D_Dual_Galerkin_Stabilized_Line_AD_btest_build_vera
[100%] Checking style of test/system/LocalSolve/EdgeLocalSolve1D_Dual_Galerkin_Stabilized_Line_AD_btest.cpp
[100%] Built target EdgeLocalSolve1D_Dual_Galerkin_Stabilized_Line_AD_btest_build_vera
Scanning dependencies of target EdgeLocalSolve1D_Dual_Galerkin_Stabilized_Line_AD_btest_OBJECT
[100%] Building CXX object test/system/LocalSolve/CMakeFiles/EdgeLocalSolve1D_Dual_Galerkin_Stabilized_Line_AD_btest_OBJECT.dir/EdgeLocalSolve1D_Dual_Galerkin_Stabilized_Line_AD_btest.cpp.o
[100%] Built target EdgeLocalSolve1D_Dual_Galerkin_Stabilized_Line_AD_btest_OBJECT
Scanning dependencies of target EdgeLocalSolve1D_Dual_Galerkin_Stabilized_Line_AD_btest_build
[100%] Linking CXX executable EdgeLocalSolve1D_Dual_Galerkin_Stabilized_Line_AD_btest
[100%] Built target EdgeLocalSolve1D_Dual_Galerkin_Stabilized_Line_AD_btest_build
Scanning dependencies of target Block_1D_Decoupled_AD_btest_build_vera
[100%] Checking style of test/system/BlockSolve/Block_1D_Decoupled_AD_btest.cpp
[100%] Built target Block_1D_Decoupled_AD_btest_build_vera
Scanning dependencies of target Block_1D_Decoupled_AD_btest_OBJECT
[100%] Building CXX object test/system/BlockSolve/CMakeFiles/Block_1D_Decoupled_AD_btest_OBJECT.dir/Block_1D_Decoupled_AD_btest.cpp.o
[100%] Built target Block_1D_Decoupled_AD_btest_OBJECT
Scanning dependencies of target Block_1D_Decoupled_AD_btest_build
[100%] Linking CXX executable Block_1D_Decoupled_AD_btest
[100%] Built target Block_1D_Decoupled_AD_btest_build
Scanning dependencies of target Block_1D_Decoupled_Burgers_btest_OBJECT
[100%] Building CXX object test/system/BlockSolve/CMakeFiles/Block_1D_Decoupled_Burgers_btest_OBJECT.dir/Block_1D_Decoupled_Burgers_btest.cpp.o
[100%] Built target Block_1D_Decoupled_Burgers_btest_OBJECT
Scanning dependencies of target Block_1D_Decoupled_Burgers_btest_build_vera
[100%] Checking style of test/system/BlockSolve/Block_1D_Decoupled_Burgers_btest.cpp
[100%] Built target Block_1D_Decoupled_Burgers_btest_build_vera
Scanning dependencies of target Block_1D_Decoupled_Burgers_btest_build
[100%] Linking CXX executable Block_1D_Decoupled_Burgers_btest
[100%] Built target Block_1D_Decoupled_Burgers_btest_build
Scanning dependencies of target AnalyticSolve2D_DGAdvective_Triangle_Euler_UniformStream_btest_build_vera
[100%] Checking style of test/system/AnalyticSolve/AnalyticSolve2D_DGAdvective_Triangle_Euler_UniformStream_btest.cpp
[100%] Built target AnalyticSolve2D_DGAdvective_Triangle_Euler_UniformStream_btest_build_vera
[100%] Generating CXX unity source src/Discretization/cotire/DGBR2NSLib_CXX_unity.cxx
[100%] Generating CXX prefix source src/Discretization/cotire/DGBR2NSLib_CXX_prefix.cxx
[100%] Generating CXX prefix header src/Discretization/cotire/DGBR2NSLib_CXX_prefix.hxx
[100%] Building CXX precompiled header src/Discretization/cotire/DGBR2NSLib_CXX_prefix.hxx.pch
Scanning dependencies of target DGBR2NSLib
[100%] Building CXX object src/Discretization/CMakeFiles/DGBR2NSLib.dir/DG/DGBR2_Instantiate/AlgebraicEquationSet_DGBR2_NavierStokes2D_ConservativeConstVisc.cpp.o
[100%] Building CXX object src/Discretization/CMakeFiles/DGBR2NSLib.dir/DG/DGBR2_Instantiate/AlgebraicEquationSet_DGBR2_NavierStokes2D_PrimitiveConstVisc.cpp.o
[100%] Building CXX object src/Discretization/CMakeFiles/DGBR2NSLib.dir/DG/DGBR2_Instantiate/AlgebraicEquationSet_DGBR2_NavierStokes3D_PrimitiveConstVisc.cpp.o
[100%] Building CXX object src/Discretization/CMakeFiles/DGBR2NSLib.dir/DG/DGBR2_Instantiate/AlgebraicEquationSet_DGBR2_NavierStokes3D_PrimitiveSutherland.cpp.o
[100%] Building CXX object src/Discretization/CMakeFiles/DGBR2NSLib.dir/DG/DGBR2_Instantiate/AlgebraicEquationSet_DGBR2_NavierStokes3D_SurrogateSutherland.cpp.o
[100%] Linking CXX static library libDGBR2NSLib.a
[100%] Built target DGBR2NSLib
Scanning dependencies of target AnalyticSolve2D_DGAdvective_Triangle_Euler_UniformStream_btest_OBJECT
[100%] Building CXX object test/system/AnalyticSolve/CMakeFiles/AnalyticSolve2D_DGAdvective_Triangle_Euler_UniformStream_btest_OBJECT.dir/AnalyticSolve2D_DGAdvective_Triangle_Euler_UniformStream_btest.cpp.o
[100%] Built target AnalyticSolve2D_DGAdvective_Triangle_Euler_UniformStream_btest_OBJECT
Scanning dependencies of target AnalyticSolve2D_DGAdvective_Triangle_Euler_UniformStream_btest_build
[100%] Linking CXX executable AnalyticSolve2D_DGAdvective_Triangle_Euler_UniformStream_btest
[100%] Built target AnalyticSolve2D_DGAdvective_Triangle_Euler_UniformStream_btest_build
Scanning dependencies of target AnalyticSolve2D_DGBR2_Triangle_NavierStokes_UniformStream_btest_build_vera
[100%] Checking style of test/system/AnalyticSolve/AnalyticSolve2D_DGBR2_Triangle_NavierStokes_UniformStream_btest.cpp
[100%] Built target AnalyticSolve2D_DGBR2_Triangle_NavierStokes_UniformStream_btest_build_vera
Scanning dependencies of target AnalyticSolve2D_DGBR2_Triangle_NavierStokes_UniformStream_btest_OBJECT
[100%] Building CXX object test/system/AnalyticSolve/CMakeFiles/AnalyticSolve2D_DGBR2_Triangle_NavierStokes_UniformStream_btest_OBJECT.dir/AnalyticSolve2D_DGBR2_Triangle_NavierStokes_UniformStream_btest.cpp.o
[100%] Built target AnalyticSolve2D_DGBR2_Triangle_NavierStokes_UniformStream_btest_OBJECT
Scanning dependencies of target AnalyticSolve2D_DGBR2_Triangle_NavierStokes_UniformStream_btest_build
[100%] Linking CXX executable AnalyticSolve2D_DGBR2_Triangle_NavierStokes_UniformStream_btest
[100%] Built target AnalyticSolve2D_DGBR2_Triangle_NavierStokes_UniformStream_btest_build
Scanning dependencies of target AnalyticSolve2D_HDG_Triangle_NavierStokes_btest_build_vera
[100%] Checking style of test/system/AnalyticSolve/AnalyticSolve2D_HDG_Triangle_NavierStokes_btest.cpp
[100%] Built target AnalyticSolve2D_HDG_Triangle_NavierStokes_btest_build_vera
Scanning dependencies of target AnalyticSolve2D_HDG_Triangle_NavierStokes_btest_OBJECT
[100%] Building CXX object test/system/AnalyticSolve/CMakeFiles/AnalyticSolve2D_HDG_Triangle_NavierStokes_btest_OBJECT.dir/AnalyticSolve2D_HDG_Triangle_NavierStokes_btest.cpp.o
[100%] Built target AnalyticSolve2D_HDG_Triangle_NavierStokes_btest_OBJECT
Scanning dependencies of target AnalyticSolve2D_HDG_Triangle_NavierStokes_btest_build
[100%] Linking CXX executable AnalyticSolve2D_HDG_Triangle_NavierStokes_btest
[100%] Built target AnalyticSolve2D_HDG_Triangle_NavierStokes_btest_build
Scanning dependencies of target AnalyticSolve2D_DGAdvective_IBL_StagnationFlow_LamiBL_btest_OBJECT
[100%] Building CXX object test/system/AnalyticSolve/CMakeFiles/AnalyticSolve2D_DGAdvective_IBL_StagnationFlow_LamiBL_btest_OBJECT.dir/AnalyticSolve2D_DGAdvective_IBL_StagnationFlow_LamiBL_btest.cpp.o
[100%] Built target AnalyticSolve2D_DGAdvective_IBL_StagnationFlow_LamiBL_btest_OBJECT
Scanning dependencies of target AnalyticSolve2D_DGAdvective_IBL_StagnationFlow_LamiBL_btest_build_vera
[100%] Checking style of test/system/AnalyticSolve/AnalyticSolve2D_DGAdvective_IBL_StagnationFlow_LamiBL_btest.cpp
[100%] Built target AnalyticSolve2D_DGAdvective_IBL_StagnationFlow_LamiBL_btest_build_vera
Scanning dependencies of target AnalyticSolve2D_DGAdvective_IBL_StagnationFlow_LamiBL_btest_build
[100%] Linking CXX executable AnalyticSolve2D_DGAdvective_IBL_StagnationFlow_LamiBL_btest
[100%] Built target AnalyticSolve2D_DGAdvective_IBL_StagnationFlow_LamiBL_btest_build
Scanning dependencies of target AnalyticSolve2D_DGAdvective_IBL_StagnationFlow_SingleElem_LamiBL_btest_OBJECT
[100%] Building CXX object test/system/AnalyticSolve/CMakeFiles/AnalyticSolve2D_DGAdvective_IBL_StagnationFlow_SingleElem_LamiBL_btest_OBJECT.dir/AnalyticSolve2D_DGAdvective_IBL_StagnationFlow_SingleElem_LamiBL_btest.cpp.o
[100%] Built target AnalyticSolve2D_DGAdvective_IBL_StagnationFlow_SingleElem_LamiBL_btest_OBJECT
Scanning dependencies of target AnalyticSolve2D_DGAdvective_IBL_StagnationFlow_SingleElem_LamiBL_btest_build_vera
[100%] Checking style of test/system/AnalyticSolve/AnalyticSolve2D_DGAdvective_IBL_StagnationFlow_SingleElem_LamiBL_btest.cpp
[100%] Built target AnalyticSolve2D_DGAdvective_IBL_StagnationFlow_SingleElem_LamiBL_btest_build_vera
Scanning dependencies of target AnalyticSolve2D_DGAdvective_IBL_StagnationFlow_SingleElem_LamiBL_btest_build
[100%] Linking CXX executable AnalyticSolve2D_DGAdvective_IBL_StagnationFlow_SingleElem_LamiBL_btest
[100%] Built target AnalyticSolve2D_DGAdvective_IBL_StagnationFlow_SingleElem_LamiBL_btest_build
Scanning dependencies of target AnalyticSolve2D_HDG_Triangle_NavierStokes_UniformStream_btest_OBJECT
[100%] Building CXX object test/system/AnalyticSolve/CMakeFiles/AnalyticSolve2D_HDG_Triangle_NavierStokes_UniformStream_btest_OBJECT.dir/AnalyticSolve2D_HDG_Triangle_NavierStokes_UniformStream_btest.cpp.o
[100%] Built target AnalyticSolve2D_HDG_Triangle_NavierStokes_UniformStream_btest_OBJECT
Scanning dependencies of target AnalyticSolve2D_HDG_Triangle_NavierStokes_UniformStream_btest_build_vera
[100%] Checking style of test/system/AnalyticSolve/AnalyticSolve2D_HDG_Triangle_NavierStokes_UniformStream_btest.cpp
[100%] Built target AnalyticSolve2D_HDG_Triangle_NavierStokes_UniformStream_btest_build_vera
Scanning dependencies of target AnalyticSolve2D_HDG_Triangle_NavierStokes_UniformStream_btest_build
[100%] Linking CXX executable AnalyticSolve2D_HDG_Triangle_NavierStokes_UniformStream_btest
[100%] Built target AnalyticSolve2D_HDG_Triangle_NavierStokes_UniformStream_btest_build
Scanning dependencies of target AnalyticSolve_HDG_AD_btest_build_vera
[100%] Checking style of test/system/AnalyticSolve/AnalyticSolve_HDG_AD_btest.cpp
[100%] Built target AnalyticSolve_HDG_AD_btest_build_vera
Scanning dependencies of target AnalyticSolve_HDG_AD_btest_OBJECT
[100%] Building CXX object test/system/AnalyticSolve/CMakeFiles/AnalyticSolve_HDG_AD_btest_OBJECT.dir/AnalyticSolve_HDG_AD_btest.cpp.o
[100%] Built target AnalyticSolve_HDG_AD_btest_OBJECT
Scanning dependencies of target AnalyticSolve_HDG_AD_btest_build
[100%] Linking CXX executable AnalyticSolve_HDG_AD_btest
[100%] Built target AnalyticSolve_HDG_AD_btest_build
Scanning dependencies of target AnalyticSolve2D_DGBR2_Triangle_NavierStokes_btest_build_vera
[100%] Checking style of test/system/AnalyticSolve/AnalyticSolve2D_DGBR2_Triangle_NavierStokes_btest.cpp
[100%] Built target AnalyticSolve2D_DGBR2_Triangle_NavierStokes_btest_build_vera
Scanning dependencies of target AnalyticSolve2D_DGBR2_Triangle_NavierStokes_btest_OBJECT
[100%] Building CXX object test/system/AnalyticSolve/CMakeFiles/AnalyticSolve2D_DGBR2_Triangle_NavierStokes_btest_OBJECT.dir/AnalyticSolve2D_DGBR2_Triangle_NavierStokes_btest.cpp.o
[100%] Built target AnalyticSolve2D_DGBR2_Triangle_NavierStokes_btest_OBJECT
Scanning dependencies of target AnalyticSolve2D_DGBR2_Triangle_NavierStokes_btest_build
[100%] Linking CXX executable AnalyticSolve2D_DGBR2_Triangle_NavierStokes_btest
[100%] Built target AnalyticSolve2D_DGBR2_Triangle_NavierStokes_btest_build
Scanning dependencies of target PDEEulermitAVDiffusion2D_Consistency_btest_build_vera
[100%] Checking style of test/system/CodeConsistency/PDEEulermitAVDiffusion2D_Consistency_btest.cpp
[100%] Built target PDEEulermitAVDiffusion2D_Consistency_btest_build_vera
Scanning dependencies of target PDEEulermitAVDiffusion2D_Consistency_btest_OBJECT
[100%] Building CXX object test/system/CodeConsistency/CMakeFiles/PDEEulermitAVDiffusion2D_Consistency_btest_OBJECT.dir/PDEEulermitAVDiffusion2D_Consistency_btest.cpp.o
[100%] Built target PDEEulermitAVDiffusion2D_Consistency_btest_OBJECT
Scanning dependencies of target PDEEulermitAVDiffusion2D_Consistency_btest_build
[100%] Linking CXX executable PDEEulermitAVDiffusion2D_Consistency_btest
[100%] Built target PDEEulermitAVDiffusion2D_Consistency_btest_build
Scanning dependencies of target PDEmitAVSensor3D_Consistency_RANSSA_btest_OBJECT
[100%] Building CXX object test/system/CodeConsistency/CMakeFiles/PDEmitAVSensor3D_Consistency_RANSSA_btest_OBJECT.dir/PDEmitAVSensor3D_Consistency_RANSSA_btest.cpp.o
[100%] Built target PDEmitAVSensor3D_Consistency_RANSSA_btest_OBJECT
Scanning dependencies of target PDEmitAVSensor3D_Consistency_RANSSA_btest_build_vera
[100%] Checking style of test/system/CodeConsistency/PDEmitAVSensor3D_Consistency_RANSSA_btest.cpp
[100%] Built target PDEmitAVSensor3D_Consistency_RANSSA_btest_build_vera
Scanning dependencies of target PDEmitAVSensor3D_Consistency_RANSSA_btest_build
[100%] Linking CXX executable PDEmitAVSensor3D_Consistency_RANSSA_btest
[100%] Built target PDEmitAVSensor3D_Consistency_RANSSA_btest_build
Scanning dependencies of target PDEmitAVSensor2D_Consistency_btest_OBJECT
[100%] Building CXX object test/system/CodeConsistency/CMakeFiles/PDEmitAVSensor2D_Consistency_btest_OBJECT.dir/PDEmitAVSensor2D_Consistency_btest.cpp.o
[100%] Built target PDEmitAVSensor2D_Consistency_btest_OBJECT
Scanning dependencies of target PDEmitAVSensor2D_Consistency_btest_build_vera
[100%] Checking style of test/system/CodeConsistency/PDEmitAVSensor2D_Consistency_btest.cpp
[100%] Built target PDEmitAVSensor2D_Consistency_btest_build_vera
Scanning dependencies of target PDEmitAVSensor2D_Consistency_btest_build
[100%] Linking CXX executable PDEmitAVSensor2D_Consistency_btest
[100%] Built target PDEmitAVSensor2D_Consistency_btest_build
Scanning dependencies of target Solve2D_Uncoupled_DGAdvectiveIBL_NACA0004_LamiBL_btest_build_vera
[100%] Checking style of test/system/CodeConsistency/Solve2D_Uncoupled_DGAdvectiveIBL_NACA0004_LamiBL_btest.cpp
[100%] Built target Solve2D_Uncoupled_DGAdvectiveIBL_NACA0004_LamiBL_btest_build_vera
Scanning dependencies of target Solve2D_Uncoupled_DGAdvectiveIBL_NACA0004_LamiBL_btest_OBJECT
[100%] Building CXX object test/system/CodeConsistency/CMakeFiles/Solve2D_Uncoupled_DGAdvectiveIBL_NACA0004_LamiBL_btest_OBJECT.dir/Solve2D_Uncoupled_DGAdvectiveIBL_NACA0004_LamiBL_btest.cpp.o
[100%] Built target Solve2D_Uncoupled_DGAdvectiveIBL_NACA0004_LamiBL_btest_OBJECT
Scanning dependencies of target Solve2D_Uncoupled_DGAdvectiveIBL_NACA0004_LamiBL_btest_build
[100%] Linking CXX executable Solve2D_Uncoupled_DGAdvectiveIBL_NACA0004_LamiBL_btest
[100%] Built target Solve2D_Uncoupled_DGAdvectiveIBL_NACA0004_LamiBL_btest_build
Scanning dependencies of target PDEEulermitAVDiffusion3D_Consistency_btest_OBJECT
[100%] Building CXX object test/system/CodeConsistency/CMakeFiles/PDEEulermitAVDiffusion3D_Consistency_btest_OBJECT.dir/PDEEulermitAVDiffusion3D_Consistency_btest.cpp.o
[100%] Built target PDEEulermitAVDiffusion3D_Consistency_btest_OBJECT
Scanning dependencies of target PDEEulermitAVDiffusion3D_Consistency_btest_build_vera
[100%] Checking style of test/system/CodeConsistency/PDEEulermitAVDiffusion3D_Consistency_btest.cpp
[100%] Built target PDEEulermitAVDiffusion3D_Consistency_btest_build_vera
Scanning dependencies of target PDEEulermitAVDiffusion3D_Consistency_btest_build
[100%] Linking CXX executable PDEEulermitAVDiffusion3D_Consistency_btest
[100%] Built target PDEEulermitAVDiffusion3D_Consistency_btest_build
Scanning dependencies of target BCEulermitAVDiffusion3D_Consistency_btest_OBJECT
[100%] Building CXX object test/system/CodeConsistency/CMakeFiles/BCEulermitAVDiffusion3D_Consistency_btest_OBJECT.dir/BCEulermitAVDiffusion3D_Consistency_btest.cpp.o
[100%] Built target BCEulermitAVDiffusion3D_Consistency_btest_OBJECT
Scanning dependencies of target BCEulermitAVDiffusion3D_Consistency_btest_build_vera
[100%] Checking style of test/system/CodeConsistency/BCEulermitAVDiffusion3D_Consistency_btest.cpp
[100%] Built target BCEulermitAVDiffusion3D_Consistency_btest_build_vera
Scanning dependencies of target BCEulermitAVDiffusion3D_Consistency_btest_build
[100%] Linking CXX executable BCEulermitAVDiffusion3D_Consistency_btest
[100%] Built target BCEulermitAVDiffusion3D_Consistency_btest_build
Scanning dependencies of target Solve2D_Coupled4x4_HDGAdv_IBL_Panel_NACA0004_LamiBL_TurbWake_btest_build_vera
[100%] Checking style of test/system/CodeConsistency/Solve2D_Coupled4x4_HDGAdv_IBL_Panel_NACA0004_LamiBL_TurbWake_btest.cpp
[100%] Built target Solve2D_Coupled4x4_HDGAdv_IBL_Panel_NACA0004_LamiBL_TurbWake_btest_build_vera
Scanning dependencies of target Solve2D_Coupled4x4_HDGAdv_IBL_Panel_NACA0004_LamiBL_TurbWake_btest_OBJECT
[100%] Building CXX object test/system/CodeConsistency/CMakeFiles/Solve2D_Coupled4x4_HDGAdv_IBL_Panel_NACA0004_LamiBL_TurbWake_btest_OBJECT.dir/Solve2D_Coupled4x4_HDGAdv_IBL_Panel_NACA0004_LamiBL_TurbWake_btest.cpp.o
[100%] Built target Solve2D_Coupled4x4_HDGAdv_IBL_Panel_NACA0004_LamiBL_TurbWake_btest_OBJECT
Scanning dependencies of target Solve2D_Coupled4x4_HDGAdv_IBL_Panel_NACA0004_LamiBL_TurbWake_btest_build
[100%] Linking CXX executable Solve2D_Coupled4x4_HDGAdv_IBL_Panel_NACA0004_LamiBL_TurbWake_btest
[100%] Built target Solve2D_Coupled4x4_HDGAdv_IBL_Panel_NACA0004_LamiBL_TurbWake_btest_build
Scanning dependencies of target Solve2D_Coupled4x4_IBLUniField_Panel_NACA0004_LamiBL_TurbWakeXfoilLagClosure_btest_build_vera
[100%] Checking style of test/system/CodeConsistency/Solve2D_Coupled4x4_IBLUniField_Panel_NACA0004_LamiBL_TurbWakeXfoilLagClosure_btest.cpp
[100%] Built target Solve2D_Coupled4x4_IBLUniField_Panel_NACA0004_LamiBL_TurbWakeXfoilLagClosure_btest_build_vera
Scanning dependencies of target Solve2D_Coupled4x4_IBLUniField_Panel_NACA0004_LamiBL_TurbWakeXfoilLagClosure_btest_OBJECT
[100%] Building CXX object test/system/CodeConsistency/CMakeFiles/Solve2D_Coupled4x4_IBLUniField_Panel_NACA0004_LamiBL_TurbWakeXfoilLagClosure_btest_OBJECT.dir/Solve2D_Coupled4x4_IBLUniField_Panel_NACA0004_LamiBL_TurbWakeXfoilLagClosure_btest.cpp.o
[100%] Built target Solve2D_Coupled4x4_IBLUniField_Panel_NACA0004_LamiBL_TurbWakeXfoilLagClosure_btest_OBJECT
Scanning dependencies of target Solve2D_Coupled4x4_IBLUniField_Panel_NACA0004_LamiBL_TurbWakeXfoilLagClosure_btest_build
[100%] Linking CXX executable Solve2D_Coupled4x4_IBLUniField_Panel_NACA0004_LamiBL_TurbWakeXfoilLagClosure_btest
[100%] Built target Solve2D_Coupled4x4_IBLUniField_Panel_NACA0004_LamiBL_TurbWakeXfoilLagClosure_btest_build
Scanning dependencies of target PDEmitAVSensor2D_Consistency_RANSSA_btest_OBJECT
[100%] Building CXX object test/system/CodeConsistency/CMakeFiles/PDEmitAVSensor2D_Consistency_RANSSA_btest_OBJECT.dir/PDEmitAVSensor2D_Consistency_RANSSA_btest.cpp.o
[100%] Built target PDEmitAVSensor2D_Consistency_RANSSA_btest_OBJECT
Scanning dependencies of target PDEmitAVSensor2D_Consistency_RANSSA_btest_build_vera
[100%] Checking style of test/system/CodeConsistency/PDEmitAVSensor2D_Consistency_RANSSA_btest.cpp
[100%] Built target PDEmitAVSensor2D_Consistency_RANSSA_btest_build_vera
Scanning dependencies of target PDEmitAVSensor2D_Consistency_RANSSA_btest_build
[100%] Linking CXX executable PDEmitAVSensor2D_Consistency_RANSSA_btest
[100%] Built target PDEmitAVSensor2D_Consistency_RANSSA_btest_build
Scanning dependencies of target Solve2D_Uncoupled_DGAdvectiveIBLUniField_NACA0004_LamiBL_btest_build_vera
[100%] Checking style of test/system/CodeConsistency/Solve2D_Uncoupled_DGAdvectiveIBLUniField_NACA0004_LamiBL_btest.cpp
[100%] Built target Solve2D_Uncoupled_DGAdvectiveIBLUniField_NACA0004_LamiBL_btest_build_vera
Scanning dependencies of target Solve2D_Uncoupled_DGAdvectiveIBLUniField_NACA0004_LamiBL_btest_OBJECT
[100%] Building CXX object test/system/CodeConsistency/CMakeFiles/Solve2D_Uncoupled_DGAdvectiveIBLUniField_NACA0004_LamiBL_btest_OBJECT.dir/Solve2D_Uncoupled_DGAdvectiveIBLUniField_NACA0004_LamiBL_btest.cpp.o
[100%] Built target Solve2D_Uncoupled_DGAdvectiveIBLUniField_NACA0004_LamiBL_btest_OBJECT
Scanning dependencies of target Solve2D_Uncoupled_DGAdvectiveIBLUniField_NACA0004_LamiBL_btest_build
[100%] Linking CXX executable Solve2D_Uncoupled_DGAdvectiveIBLUniField_NACA0004_LamiBL_btest
[100%] Built target Solve2D_Uncoupled_DGAdvectiveIBLUniField_NACA0004_LamiBL_btest_build
Scanning dependencies of target Solve2D_Coupled4x4_IBLUniField_LamiBL_TurbWake_PTC_btest_OBJECT
[100%] Building CXX object test/system/CodeConsistency/CMakeFiles/Solve2D_Coupled4x4_IBLUniField_LamiBL_TurbWake_PTC_btest_OBJECT.dir/Solve2D_Coupled4x4_IBLUniField_LamiBL_TurbWake_PTC_btest.cpp.o
[100%] Built target Solve2D_Coupled4x4_IBLUniField_LamiBL_TurbWake_PTC_btest_OBJECT
Scanning dependencies of target Solve2D_Coupled4x4_IBLUniField_LamiBL_TurbWake_PTC_btest_build_vera
[100%] Checking style of test/system/CodeConsistency/Solve2D_Coupled4x4_IBLUniField_LamiBL_TurbWake_PTC_btest.cpp
[100%] Built target Solve2D_Coupled4x4_IBLUniField_LamiBL_TurbWake_PTC_btest_build_vera
Scanning dependencies of target Solve2D_Coupled4x4_IBLUniField_LamiBL_TurbWake_PTC_btest_build
[100%] Linking CXX executable Solve2D_Coupled4x4_IBLUniField_LamiBL_TurbWake_PTC_btest
[100%] Built target Solve2D_Coupled4x4_IBLUniField_LamiBL_TurbWake_PTC_btest_build
Scanning dependencies of target PDEEulermitAVDiffusion2D_RANSSA_Consistency_btest_OBJECT
[100%] Building CXX object test/system/CodeConsistency/CMakeFiles/PDEEulermitAVDiffusion2D_RANSSA_Consistency_btest_OBJECT.dir/PDEEulermitAVDiffusion2D_RANSSA_Consistency_btest.cpp.o
[100%] Built target PDEEulermitAVDiffusion2D_RANSSA_Consistency_btest_OBJECT
Scanning dependencies of target PDEEulermitAVDiffusion2D_RANSSA_Consistency_btest_build_vera
[100%] Checking style of test/system/CodeConsistency/PDEEulermitAVDiffusion2D_RANSSA_Consistency_btest.cpp
[100%] Built target PDEEulermitAVDiffusion2D_RANSSA_Consistency_btest_build_vera
Scanning dependencies of target PDEEulermitAVDiffusion2D_RANSSA_Consistency_btest_build
[100%] Linking CXX executable PDEEulermitAVDiffusion2D_RANSSA_Consistency_btest
[100%] Built target PDEEulermitAVDiffusion2D_RANSSA_Consistency_btest_build
Scanning dependencies of target Solve2D_Uncoupled_DGAdvectiveIBL_NACA0004_LamiBL_PTC_btest_build_vera
[100%] Checking style of test/system/CodeConsistency/Solve2D_Uncoupled_DGAdvectiveIBL_NACA0004_LamiBL_PTC_btest.cpp
[100%] Built target Solve2D_Uncoupled_DGAdvectiveIBL_NACA0004_LamiBL_PTC_btest_build_vera
Scanning dependencies of target Solve2D_Uncoupled_DGAdvectiveIBL_NACA0004_LamiBL_PTC_btest_OBJECT
[100%] Building CXX object test/system/CodeConsistency/CMakeFiles/Solve2D_Uncoupled_DGAdvectiveIBL_NACA0004_LamiBL_PTC_btest_OBJECT.dir/Solve2D_Uncoupled_DGAdvectiveIBL_NACA0004_LamiBL_PTC_btest.cpp.o
[100%] Built target Solve2D_Uncoupled_DGAdvectiveIBL_NACA0004_LamiBL_PTC_btest_OBJECT
Scanning dependencies of target Solve2D_Uncoupled_DGAdvectiveIBL_NACA0004_LamiBL_PTC_btest_build
[100%] Linking CXX executable Solve2D_Uncoupled_DGAdvectiveIBL_NACA0004_LamiBL_PTC_btest
[100%] Built target Solve2D_Uncoupled_DGAdvectiveIBL_NACA0004_LamiBL_PTC_btest_build
Scanning dependencies of target Solve2D_Coupled4x4_IBL_Panel_NACA0004_LamiBL_TurbWakeXfoilLagClosure_btest_OBJECT
[100%] Building CXX object test/system/CodeConsistency/CMakeFiles/Solve2D_Coupled4x4_IBL_Panel_NACA0004_LamiBL_TurbWakeXfoilLagClosure_btest_OBJECT.dir/Solve2D_Coupled4x4_IBL_Panel_NACA0004_LamiBL_TurbWakeXfoilLagClosure_btest.cpp.o
[100%] Built target Solve2D_Coupled4x4_IBL_Panel_NACA0004_LamiBL_TurbWakeXfoilLagClosure_btest_OBJECT
Scanning dependencies of target Solve2D_Coupled4x4_IBL_Panel_NACA0004_LamiBL_TurbWakeXfoilLagClosure_btest_build_vera
[100%] Checking style of test/system/CodeConsistency/Solve2D_Coupled4x4_IBL_Panel_NACA0004_LamiBL_TurbWakeXfoilLagClosure_btest.cpp
[100%] Built target Solve2D_Coupled4x4_IBL_Panel_NACA0004_LamiBL_TurbWakeXfoilLagClosure_btest_build_vera
Scanning dependencies of target Solve2D_Coupled4x4_IBL_Panel_NACA0004_LamiBL_TurbWakeXfoilLagClosure_btest_build
[100%] Linking CXX executable Solve2D_Coupled4x4_IBL_Panel_NACA0004_LamiBL_TurbWakeXfoilLagClosure_btest
[100%] Built target Solve2D_Coupled4x4_IBL_Panel_NACA0004_LamiBL_TurbWakeXfoilLagClosure_btest_build
Scanning dependencies of target PDEmitAVSensor3D_Consistency_btest_OBJECT
[100%] Building CXX object test/system/CodeConsistency/CMakeFiles/PDEmitAVSensor3D_Consistency_btest_OBJECT.dir/PDEmitAVSensor3D_Consistency_btest.cpp.o
[100%] Built target PDEmitAVSensor3D_Consistency_btest_OBJECT
Scanning dependencies of target PDEmitAVSensor3D_Consistency_btest_build_vera
[100%] Checking style of test/system/CodeConsistency/PDEmitAVSensor3D_Consistency_btest.cpp
[100%] Built target PDEmitAVSensor3D_Consistency_btest_build_vera
Scanning dependencies of target PDEmitAVSensor3D_Consistency_btest_build
[100%] Linking CXX executable PDEmitAVSensor3D_Consistency_btest
[100%] Built target PDEmitAVSensor3D_Consistency_btest_build
Scanning dependencies of target Solve2D_XfoilLikePanelMethod_btest_OBJECT
[100%] Building CXX object test/system/CodeConsistency/CMakeFiles/Solve2D_XfoilLikePanelMethod_btest_OBJECT.dir/Solve2D_XfoilLikePanelMethod_btest.cpp.o
[100%] Built target Solve2D_XfoilLikePanelMethod_btest_OBJECT
Scanning dependencies of target Solve2D_XfoilLikePanelMethod_btest_build_vera
[100%] Checking style of test/system/CodeConsistency/Solve2D_XfoilLikePanelMethod_btest.cpp
[100%] Built target Solve2D_XfoilLikePanelMethod_btest_build_vera
Scanning dependencies of target Solve2D_XfoilLikePanelMethod_btest_build
[100%] Linking CXX executable Solve2D_XfoilLikePanelMethod_btest
[100%] Built target Solve2D_XfoilLikePanelMethod_btest_build
Scanning dependencies of target Solve2D_Coupled4x4_IBL_Panel_NACA0004_FittedTransition_Forced_btest_build_vera
[100%] Checking style of test/system/CodeConsistency/Solve2D_Coupled4x4_IBL_Panel_NACA0004_FittedTransition_Forced_btest.cpp
[100%] Built target Solve2D_Coupled4x4_IBL_Panel_NACA0004_FittedTransition_Forced_btest_build_vera
Scanning dependencies of target Solve2D_Coupled4x4_IBL_Panel_NACA0004_FittedTransition_Forced_btest_OBJECT
[100%] Building CXX object test/system/CodeConsistency/CMakeFiles/Solve2D_Coupled4x4_IBL_Panel_NACA0004_FittedTransition_Forced_btest_OBJECT.dir/Solve2D_Coupled4x4_IBL_Panel_NACA0004_FittedTransition_Forced_btest.cpp.o
[100%] Built target Solve2D_Coupled4x4_IBL_Panel_NACA0004_FittedTransition_Forced_btest_OBJECT
Scanning dependencies of target Solve2D_Coupled4x4_IBL_Panel_NACA0004_FittedTransition_Forced_btest_build
[100%] Linking CXX executable Solve2D_Coupled4x4_IBL_Panel_NACA0004_FittedTransition_Forced_btest
[100%] Built target Solve2D_Coupled4x4_IBL_Panel_NACA0004_FittedTransition_Forced_btest_build
Scanning dependencies of target PDEmitAVSensor1D_Consistency_btest_OBJECT
[100%] Building CXX object test/system/CodeConsistency/CMakeFiles/PDEmitAVSensor1D_Consistency_btest_OBJECT.dir/PDEmitAVSensor1D_Consistency_btest.cpp.o
[100%] Built target PDEmitAVSensor1D_Consistency_btest_OBJECT
Scanning dependencies of target PDEmitAVSensor1D_Consistency_btest_build_vera
[100%] Checking style of test/system/CodeConsistency/PDEmitAVSensor1D_Consistency_btest.cpp
[100%] Built target PDEmitAVSensor1D_Consistency_btest_build_vera
Scanning dependencies of target PDEmitAVSensor1D_Consistency_btest_build
[100%] Linking CXX executable PDEmitAVSensor1D_Consistency_btest
[100%] Built target PDEmitAVSensor1D_Consistency_btest_build
Scanning dependencies of target Solve2D_Uncoupled_HDGAdvectiveIBL_NACA0004_LamiBL_btest_OBJECT
[100%] Building CXX object test/system/CodeConsistency/CMakeFiles/Solve2D_Uncoupled_HDGAdvectiveIBL_NACA0004_LamiBL_btest_OBJECT.dir/Solve2D_Uncoupled_HDGAdvectiveIBL_NACA0004_LamiBL_btest.cpp.o
[100%] Built target Solve2D_Uncoupled_HDGAdvectiveIBL_NACA0004_LamiBL_btest_OBJECT
Scanning dependencies of target Solve2D_Uncoupled_HDGAdvectiveIBL_NACA0004_LamiBL_btest_build_vera
[100%] Checking style of test/system/CodeConsistency/Solve2D_Uncoupled_HDGAdvectiveIBL_NACA0004_LamiBL_btest.cpp
[100%] Built target Solve2D_Uncoupled_HDGAdvectiveIBL_NACA0004_LamiBL_btest_build_vera
Scanning dependencies of target Solve2D_Uncoupled_HDGAdvectiveIBL_NACA0004_LamiBL_btest_build
[100%] Linking CXX executable Solve2D_Uncoupled_HDGAdvectiveIBL_NACA0004_LamiBL_btest
[100%] Built target Solve2D_Uncoupled_HDGAdvectiveIBL_NACA0004_LamiBL_btest_build
Scanning dependencies of target Solve2D_Coupled4x4_IBL_Panel_NACA0004_FittedTransition_TwoLayerNewton_btest_build_vera
[100%] Checking style of test/system/CodeConsistency/Solve2D_Coupled4x4_IBL_Panel_NACA0004_FittedTransition_TwoLayerNewton_btest.cpp
[100%] Built target Solve2D_Coupled4x4_IBL_Panel_NACA0004_FittedTransition_TwoLayerNewton_btest_build_vera
Scanning dependencies of target Solve2D_Coupled4x4_IBL_Panel_NACA0004_FittedTransition_TwoLayerNewton_btest_OBJECT
[100%] Building CXX object test/system/CodeConsistency/CMakeFiles/Solve2D_Coupled4x4_IBL_Panel_NACA0004_FittedTransition_TwoLayerNewton_btest_OBJECT.dir/Solve2D_Coupled4x4_IBL_Panel_NACA0004_FittedTransition_TwoLayerNewton_btest.cpp.o
[100%] Built target Solve2D_Coupled4x4_IBL_Panel_NACA0004_FittedTransition_TwoLayerNewton_btest_OBJECT
Scanning dependencies of target Solve2D_Coupled4x4_IBL_Panel_NACA0004_FittedTransition_TwoLayerNewton_btest_build
[100%] Linking CXX executable Solve2D_Coupled4x4_IBL_Panel_NACA0004_FittedTransition_TwoLayerNewton_btest
[100%] Built target Solve2D_Coupled4x4_IBL_Panel_NACA0004_FittedTransition_TwoLayerNewton_btest_build
Scanning dependencies of target PDEEulermitAVDiffusion3D_RANSSA_Consistency_btest_build_vera
[100%] Checking style of test/system/CodeConsistency/PDEEulermitAVDiffusion3D_RANSSA_Consistency_btest.cpp
[100%] Built target PDEEulermitAVDiffusion3D_RANSSA_Consistency_btest_build_vera
Scanning dependencies of target PDEEulermitAVDiffusion3D_RANSSA_Consistency_btest_OBJECT
[100%] Building CXX object test/system/CodeConsistency/CMakeFiles/PDEEulermitAVDiffusion3D_RANSSA_Consistency_btest_OBJECT.dir/PDEEulermitAVDiffusion3D_RANSSA_Consistency_btest.cpp.o
[100%] Built target PDEEulermitAVDiffusion3D_RANSSA_Consistency_btest_OBJECT
Scanning dependencies of target PDEEulermitAVDiffusion3D_RANSSA_Consistency_btest_build
[100%] Linking CXX executable PDEEulermitAVDiffusion3D_RANSSA_Consistency_btest
[100%] Built target PDEEulermitAVDiffusion3D_RANSSA_Consistency_btest_build
Scanning dependencies of target BCEulermitAVDiffusion2D_Consistency_btest_OBJECT
[100%] Building CXX object test/system/CodeConsistency/CMakeFiles/BCEulermitAVDiffusion2D_Consistency_btest_OBJECT.dir/BCEulermitAVDiffusion2D_Consistency_btest.cpp.o
[100%] Built target BCEulermitAVDiffusion2D_Consistency_btest_OBJECT
Scanning dependencies of target BCEulermitAVDiffusion2D_Consistency_btest_build_vera
[100%] Checking style of test/system/CodeConsistency/BCEulermitAVDiffusion2D_Consistency_btest.cpp
[100%] Built target BCEulermitAVDiffusion2D_Consistency_btest_build_vera
Scanning dependencies of target BCEulermitAVDiffusion2D_Consistency_btest_build
[100%] Linking CXX executable BCEulermitAVDiffusion2D_Consistency_btest
[100%] Built target BCEulermitAVDiffusion2D_Consistency_btest_build
Scanning dependencies of target BCEulermitAVDiffusion3D_Consistency_RANSSA_btest_OBJECT
[100%] Building CXX object test/system/CodeConsistency/CMakeFiles/BCEulermitAVDiffusion3D_Consistency_RANSSA_btest_OBJECT.dir/BCEulermitAVDiffusion3D_Consistency_RANSSA_btest.cpp.o
[100%] Built target BCEulermitAVDiffusion3D_Consistency_RANSSA_btest_OBJECT
Scanning dependencies of target BCEulermitAVDiffusion3D_Consistency_RANSSA_btest_build_vera
[100%] Checking style of test/system/CodeConsistency/BCEulermitAVDiffusion3D_Consistency_RANSSA_btest.cpp
[100%] Built target BCEulermitAVDiffusion3D_Consistency_RANSSA_btest_build_vera
Scanning dependencies of target BCEulermitAVDiffusion3D_Consistency_RANSSA_btest_build
[100%] Linking CXX executable BCEulermitAVDiffusion3D_Consistency_RANSSA_btest
[100%] Built target BCEulermitAVDiffusion3D_Consistency_RANSSA_btest_build
Scanning dependencies of target Solve2D_Coupled4x4_IBL_Panel_NACA0004_FittedTransition_LineSearchNewton_btest_OBJECT
[100%] Building CXX object test/system/CodeConsistency/CMakeFiles/Solve2D_Coupled4x4_IBL_Panel_NACA0004_FittedTransition_LineSearchNewton_btest_OBJECT.dir/Solve2D_Coupled4x4_IBL_Panel_NACA0004_FittedTransition_LineSearchNewton_btest.cpp.o
[100%] Built target Solve2D_Coupled4x4_IBL_Panel_NACA0004_FittedTransition_LineSearchNewton_btest_OBJECT
Scanning dependencies of target Solve2D_Coupled4x4_IBL_Panel_NACA0004_FittedTransition_LineSearchNewton_btest_build_vera
[100%] Checking style of test/system/CodeConsistency/Solve2D_Coupled4x4_IBL_Panel_NACA0004_FittedTransition_LineSearchNewton_btest.cpp
[100%] Built target Solve2D_Coupled4x4_IBL_Panel_NACA0004_FittedTransition_LineSearchNewton_btest_build_vera
Scanning dependencies of target Solve2D_Coupled4x4_IBL_Panel_NACA0004_FittedTransition_LineSearchNewton_btest_build
[100%] Linking CXX executable Solve2D_Coupled4x4_IBL_Panel_NACA0004_FittedTransition_LineSearchNewton_btest
[100%] Built target Solve2D_Coupled4x4_IBL_Panel_NACA0004_FittedTransition_LineSearchNewton_btest_build
Scanning dependencies of target BCEulermitAVDiffusion2D_Consistency_RANSSA_btest_OBJECT
[100%] Building CXX object test/system/CodeConsistency/CMakeFiles/BCEulermitAVDiffusion2D_Consistency_RANSSA_btest_OBJECT.dir/BCEulermitAVDiffusion2D_Consistency_RANSSA_btest.cpp.o
[100%] Built target BCEulermitAVDiffusion2D_Consistency_RANSSA_btest_OBJECT
Scanning dependencies of target BCEulermitAVDiffusion2D_Consistency_RANSSA_btest_build_vera
[100%] Checking style of test/system/CodeConsistency/BCEulermitAVDiffusion2D_Consistency_RANSSA_btest.cpp
[100%] Built target BCEulermitAVDiffusion2D_Consistency_RANSSA_btest_build_vera
Scanning dependencies of target BCEulermitAVDiffusion2D_Consistency_RANSSA_btest_build
[100%] Linking CXX executable BCEulermitAVDiffusion2D_Consistency_RANSSA_btest
[100%] Built target BCEulermitAVDiffusion2D_Consistency_RANSSA_btest_build
Scanning dependencies of target Solve2D_Coupled4x4_IBLUniField_Panel_NACA0004_CapturedTransition_btest_build_vera
[100%] Checking style of test/system/CodeConsistency/Solve2D_Coupled4x4_IBLUniField_Panel_NACA0004_CapturedTransition_btest.cpp
[100%] Built target Solve2D_Coupled4x4_IBLUniField_Panel_NACA0004_CapturedTransition_btest_build_vera
Scanning dependencies of target Solve2D_Coupled4x4_IBLUniField_Panel_NACA0004_CapturedTransition_btest_OBJECT
[100%] Building CXX object test/system/CodeConsistency/CMakeFiles/Solve2D_Coupled4x4_IBLUniField_Panel_NACA0004_CapturedTransition_btest_OBJECT.dir/Solve2D_Coupled4x4_IBLUniField_Panel_NACA0004_CapturedTransition_btest.cpp.o
[100%] Built target Solve2D_Coupled4x4_IBLUniField_Panel_NACA0004_CapturedTransition_btest_OBJECT
Scanning dependencies of target Solve2D_Coupled4x4_IBLUniField_Panel_NACA0004_CapturedTransition_btest_build
[100%] Linking CXX executable Solve2D_Coupled4x4_IBLUniField_Panel_NACA0004_CapturedTransition_btest
[100%] Built target Solve2D_Coupled4x4_IBLUniField_Panel_NACA0004_CapturedTransition_btest_build
Scanning dependencies of target check_system_build
[100%] Built target check_system_build
Scanning dependencies of target memcheck_system
   Site: reynolds
   Build name: Linux-clang++-5.0
Create new tag: 20190706-0751 - Experimental
Test project /jenkins/workspace/SANS_Weekly/builddir/debug_clang/buildnode/reynolds/build/debug_clang
        Start 1676: SolverInterface_Galerkin_Stabilized_btest_memcheck
  1/109 Test #1676: SolverInterface_Galerkin_Stabilized_btest_memcheck ............................................   Passed  142.26 sec
        Start 1678: SolverInterface_DGAdvective_btest_memcheck
  2/109 Test #1678: SolverInterface_DGAdvective_btest_memcheck ....................................................   Passed  137.85 sec
        Start 1680: SolverInterface_DGBR2_btest_memcheck
  3/109 Test #1680: SolverInterface_DGBR2_btest_memcheck ..........................................................   Passed  180.29 sec
        Start 1682: ErrorOrder_2D_CG_Triangle_AD_btest_memcheck
  4/109 Test #1682: ErrorOrder_2D_CG_Triangle_AD_btest_memcheck ...................................................   Passed  128.78 sec
        Start 1684: ErrorOrder_2D_EDG_Triangle_AD_btest_memcheck
  5/109 Test #1684: ErrorOrder_2D_EDG_Triangle_AD_btest_memcheck ..................................................   Passed  195.98 sec
        Start 1686: ErrorOrder_3D_DGBR2_Sphere_Triangle_AD_btest_memcheck
  6/109 Test #1686: ErrorOrder_3D_DGBR2_Sphere_Triangle_AD_btest_memcheck .........................................   Passed  124.19 sec
        Start 1688: ErrorOrder_3D_CG_Tet_AD_btest_memcheck
  7/109 Test #1688: ErrorOrder_3D_CG_Tet_AD_btest_memcheck ........................................................   Passed  148.37 sec
        Start 1690: ErrorOrder_4D_DG_Pentatope_btest_memcheck
  8/109 Test #1690: ErrorOrder_4D_DG_Pentatope_btest_memcheck .....................................................***Timeout 3600.16 sec

        Start 1692: ErrorEstimateOrder_2D_HDG_Triangle_AD_btest_memcheck
  9/109 Test #1692: ErrorEstimateOrder_2D_HDG_Triangle_AD_btest_memcheck ..........................................   Passed  798.81 sec
        Start 1694: ErrorOrder_1D_DGBR2_BuckleyLeverett_ST_btest_memcheck
 10/109 Test #1694: ErrorOrder_1D_DGBR2_BuckleyLeverett_ST_btest_memcheck .........................................   Passed  613.14 sec
        Start 1696: ErrorOrder_1D_HDG_AD_btest_memcheck
 11/109 Test #1696: ErrorOrder_1D_HDG_AD_btest_memcheck ...........................................................   Passed  115.68 sec
        Start 1698: ErrorOrder_1D_HDG_AD_BDF_btest_memcheck
 12/109 Test #1698: ErrorOrder_1D_HDG_AD_BDF_btest_memcheck .......................................................   Passed  418.84 sec
        Start 1700: ErrorOrder_1D_DGBR2_AD_BDF_btest_memcheck
 13/109 Test #1700: ErrorOrder_1D_DGBR2_AD_BDF_btest_memcheck .....................................................   Passed  303.64 sec
        Start 1702: ErrorEstimateOrder_2D_DGAdvective_Triangle_AD_btest_memcheck
 14/109 Test #1702: ErrorEstimateOrder_2D_DGAdvective_Triangle_AD_btest_memcheck ..................................   Passed  738.00 sec
        Start 1704: ErrorEstimateOrder_1D_CG_Line_AD_btest_memcheck
 15/109 Test #1704: ErrorEstimateOrder_1D_CG_Line_AD_btest_memcheck ...............................................   Passed  114.40 sec
        Start 1706: Adjoint2D_HDG_Triangle_AD_sansLG_btest_memcheck
 16/109 Test #1706: Adjoint2D_HDG_Triangle_AD_sansLG_btest_memcheck ...............................................   Passed  395.60 sec
        Start 1708: Adjoint1D_DGBR2_BuckleyLeverett_ST_btest_memcheck
 17/109 Test #1708: Adjoint1D_DGBR2_BuckleyLeverett_ST_btest_memcheck .............................................   Passed  272.85 sec
        Start 1710: ErrorOrder_1D_CG_AD_btest_memcheck
 18/109 Test #1710: ErrorOrder_1D_CG_AD_btest_memcheck ............................................................   Passed  112.71 sec
        Start 1712: ErrorOrder_1D_DGBR2_TwoPhase_ST_btest_memcheck
 19/109 Test #1712: ErrorOrder_1D_DGBR2_TwoPhase_ST_btest_memcheck ................................................   Passed  283.39 sec
        Start 1714: Adjoint2D_DGAdvective_Triangle_AD_btest_memcheck
 20/109 Test #1714: Adjoint2D_DGAdvective_Triangle_AD_btest_memcheck ..............................................   Passed  123.72 sec
        Start 1716: Solve2D_DGAdvective_LinearRobin_mitLG_sansLG_Consistency_AD_btest_memcheck
 21/109 Test #1716: Solve2D_DGAdvective_LinearRobin_mitLG_sansLG_Consistency_AD_btest_memcheck ....................   Passed  119.31 sec
        Start 1718: ErrorOrder_2D_HDG_Triangle_AD_btest_memcheck
 22/109 Test #1718: ErrorOrder_2D_HDG_Triangle_AD_btest_memcheck ..................................................   Passed  216.49 sec
        Start 1720: ErrorOrder_1D_HDGAdvective_Advection_btest_memcheck
 23/109 Test #1720: ErrorOrder_1D_HDGAdvective_Advection_btest_memcheck ...........................................   Passed  115.55 sec
        Start 1722: ErrorOrder_1D_CG_AD_BDF_btest_memcheck
 24/109 Test #1722: ErrorOrder_1D_CG_AD_BDF_btest_memcheck ........................................................   Passed  710.98 sec
        Start 1724: ErrorOrder_3D_CG_Sphere_Triangle_AD_btest_memcheck
 25/109 Test #1724: ErrorOrder_3D_CG_Sphere_Triangle_AD_btest_memcheck ............................................   Passed  149.79 sec
        Start 1726: ErrorEstimateOrder_1D_DGBR2_Line_AD_btest_memcheck
 26/109 Test #1726: ErrorEstimateOrder_1D_DGBR2_Line_AD_btest_memcheck ............................................   Passed  114.72 sec
        Start 1728: ErrorOrder_3D_CG_Hex_AD_btest_memcheck
 27/109 Test #1728: ErrorOrder_3D_CG_Hex_AD_btest_memcheck ........................................................   Passed  122.44 sec
        Start 1730: ErrorOrder_1D_HDG_Burgers_btest_memcheck
 28/109 Test #1730: ErrorOrder_1D_HDG_Burgers_btest_memcheck ......................................................   Passed  1265.64 sec
        Start 1732: ErrorEstimateOrder_2D_CG_Nodal_Triangle_AD_btest_memcheck
 29/109 Test #1732: ErrorEstimateOrder_2D_CG_Nodal_Triangle_AD_btest_memcheck .....................................   Passed  739.60 sec
        Start 1734: ErrorOrder_1D_DGBR2_Burgers_btest_memcheck
 30/109 Test #1734: ErrorOrder_1D_DGBR2_Burgers_btest_memcheck ....................................................   Passed  288.10 sec
        Start 1736: ErrorOrder_2D_DGAdvective_Flat_Line_AD_btest_memcheck
 31/109 Test #1736: ErrorOrder_2D_DGAdvective_Flat_Line_AD_btest_memcheck .........................................   Passed  110.62 sec
        Start 1738: ErrorOrder_3D_DGBR2_Tet_AD_btest_memcheck
 32/109 Test #1738: ErrorOrder_3D_DGBR2_Tet_AD_btest_memcheck .....................................................   Passed  120.37 sec
        Start 1740: ErrorOrder_1D_DGBR2_AD_btest_memcheck
 33/109 Test #1740: ErrorOrder_1D_DGBR2_AD_btest_memcheck .........................................................   Passed  111.61 sec
        Start 1742: ErrorOrder_2D_DGAdvective_Annulus_Triangle_btest_memcheck
 34/109 Test #1742: ErrorOrder_2D_DGAdvective_Annulus_Triangle_btest_memcheck .....................................   Passed  115.68 sec
        Start 1744: ErrorEstimateOrder_2D_CG_Triangle_RD_btest_memcheck
 35/109 Test #1744: ErrorEstimateOrder_2D_CG_Triangle_RD_btest_memcheck ...........................................   Passed  353.58 sec
        Start 1746: ErrorOrder_2D_DGAdvective_Circle_Line_AD_btest_memcheck
 36/109 Test #1746: ErrorOrder_2D_DGAdvective_Circle_Line_AD_btest_memcheck .......................................   Passed  116.55 sec
        Start 1748: ErrorOrder_2D_CG_Quad_AD_btest_memcheck
 37/109 Test #1748: ErrorOrder_2D_CG_Quad_AD_btest_memcheck .......................................................   Passed  119.72 sec
        Start 1750: ErrorEstimateOrder_2D_DGBR2_Triangle_AD_btest_memcheck
 38/109 Test #1750: ErrorEstimateOrder_2D_DGBR2_Triangle_AD_btest_memcheck ........................................   Passed  326.36 sec
        Start 1752: ErrorOrder_2D_DGAdvective_Circle_Line_ShallowWater_btest_memcheck
 39/109 Test #1752: ErrorOrder_2D_DGAdvective_Circle_Line_ShallowWater_btest_memcheck .............................   Passed  113.00 sec
        Start 1754: ErrorEstimateOrder_2D_CG_Triangle_AD_btest_memcheck
 40/109 Test #1754: ErrorEstimateOrder_2D_CG_Triangle_AD_btest_memcheck ...........................................   Passed  746.63 sec
        Start 1756: ErrorOrder_2D_DGBR2_Triangle_AD_btest_memcheck
 41/109 Test #1756: ErrorOrder_2D_DGBR2_Triangle_AD_btest_memcheck ................................................   Passed  138.07 sec
        Start 1758: ErrorOrder_1D_DGAdvective_ShallowWater_btest_memcheck
 42/109 Test #1758: ErrorOrder_1D_DGAdvective_ShallowWater_btest_memcheck .........................................   Passed  117.49 sec
        Start 1760: ErrorOrder_3D_DGBR2_Periodic_Hex_AD_btest_memcheck
 43/109 Test #1760: ErrorOrder_3D_DGBR2_Periodic_Hex_AD_btest_memcheck ............................................   Passed  128.28 sec
        Start 1762: ErrorOrder_1D_DGBR2_AD_HB_btest_memcheck
 44/109 Test #1762: ErrorOrder_1D_DGBR2_AD_HB_btest_memcheck ......................................................   Passed  147.57 sec
        Start 1764: ErrorOrder_2D_DGAdvective_Annulus_Quad_btest_memcheck
 45/109 Test #1764: ErrorOrder_2D_DGAdvective_Annulus_Quad_btest_memcheck .........................................   Passed  126.73 sec
        Start 1766: ErrorOrder_2D_CGStabilized_RANS_MMS_btest_memcheck
 46/109 Test #1766: ErrorOrder_2D_CGStabilized_RANS_MMS_btest_memcheck ............................................   Passed  181.96 sec
        Start 1768: Adjoint2D_HDG_Triangle_AD_mitState_btest_memcheck
 47/109 Test #1768: Adjoint2D_HDG_Triangle_AD_mitState_btest_memcheck .............................................   Passed  430.47 sec
        Start 1770: ErrorOrder_2D_DGBR2_RANS_MMS_btest_memcheck
 48/109 Test #1770: ErrorOrder_2D_DGBR2_RANS_MMS_btest_memcheck ...................................................   Passed  214.48 sec
        Start 1772: Adjoint2D_DGBR2_Triangle_AD_btest_memcheck
 49/109 Test #1772: Adjoint2D_DGBR2_Triangle_AD_btest_memcheck ....................................................   Passed  148.35 sec
        Start 1774: Adjoint2D_CG_Triangle_AD_btest_memcheck
 50/109 Test #1774: Adjoint2D_CG_Triangle_AD_btest_memcheck .......................................................   Passed  131.79 sec
        Start 1776: ElementLocalSolve3D_DGBR2_Tet_AD_btest_memcheck
 51/109 Test #1776: ElementLocalSolve3D_DGBR2_Tet_AD_btest_memcheck ...............................................   Passed  515.96 sec
        Start 1778: LocalSolve3D_HDG_Tet_AD_btest_memcheck
 52/109 Test #1778: LocalSolve3D_HDG_Tet_AD_btest_memcheck ........................................................   Passed  1122.10 sec
        Start 1780: LocalSolve3D_Split_HDG_Tet_AD_btest_memcheck
 53/109 Test #1780: LocalSolve3D_Split_HDG_Tet_AD_btest_memcheck ..................................................   Passed  1275.57 sec
        Start 1782: EdgeLocalSolve3D_Dual_Galerkin_Stabilized_AD_btest_memcheck
 54/109 Test #1782: EdgeLocalSolve3D_Dual_Galerkin_Stabilized_AD_btest_memcheck ...................................   Passed  278.87 sec
        Start 1784: EdgeLocalSolve1D_Primal_DGBR2_Line_AD_btest_memcheck
 55/109 Test #1784: EdgeLocalSolve1D_Primal_DGBR2_Line_AD_btest_memcheck ..........................................   Passed  121.79 sec
        Start 1786: EdgeLocalSolve2D_Dual_Galerkin_Stabilized_AR_btest_memcheck
 56/109 Test #1786: EdgeLocalSolve2D_Dual_Galerkin_Stabilized_AR_btest_memcheck ...................................   Passed  511.92 sec
        Start 1788: EdgeLocalSolve2D_Primal_Galerkin_Stabilized_Triangle_AD_btest_memcheck
 57/109 Test #1788: EdgeLocalSolve2D_Primal_Galerkin_Stabilized_Triangle_AD_btest_memcheck ........................   Passed   94.84 sec
        Start 1790: EdgeLocalSolve2D_Dual_Galerkin_Stabilized_Euler_btest_memcheck
 58/109 Test #1790: EdgeLocalSolve2D_Dual_Galerkin_Stabilized_Euler_btest_memcheck ................................   Passed  110.23 sec
        Start 1792: LocalSolve2D_Split_HDG_Triangle_AD_btest_memcheck
 59/109 Test #1792: LocalSolve2D_Split_HDG_Triangle_AD_btest_memcheck .............................................   Passed  266.60 sec
        Start 1794: LocalSolve1D_Split_DGBR2_AD_btest_memcheck
 60/109 Test #1794: LocalSolve1D_Split_DGBR2_AD_btest_memcheck ....................................................   Passed  117.32 sec
        Start 1796: LocalSolve1D_HDG_AD_btest_memcheck
 61/109 Test #1796: LocalSolve1D_HDG_AD_btest_memcheck ............................................................   Passed  131.04 sec
        Start 1798: LocalSolve2D_HDG_Triangle_AD_btest_memcheck
 62/109 Test #1798: LocalSolve2D_HDG_Triangle_AD_btest_memcheck ...................................................   Passed  180.36 sec
        Start 1800: ElementLocalSolve1D_DGBR2_Triangle_AD_btest_memcheck
 63/109 Test #1800: ElementLocalSolve1D_DGBR2_Triangle_AD_btest_memcheck ..........................................   Passed  125.10 sec
        Start 1802: LocalSolve1D_Split_HDG_AD_btest_memcheck
 64/109 Test #1802: LocalSolve1D_Split_HDG_AD_btest_memcheck ......................................................   Passed  124.32 sec
        Start 1804: LocalSolve2D_Split_DGBR2_Triangle_AD_AV_btest_memcheck
 65/109 Test #1804: LocalSolve2D_Split_DGBR2_Triangle_AD_AV_btest_memcheck ........................................   Passed  622.46 sec
        Start 1806: EdgeLocalSolve2D_Primal_DGBR2_Triangle_AD_btest_memcheck
 66/109 Test #1806: EdgeLocalSolve2D_Primal_DGBR2_Triangle_AD_btest_memcheck ......................................   Passed  571.02 sec
        Start 1808: ElementLocalSolve3D_DGAdvective_Tet_AD_btest_memcheck
 67/109 Test #1808: ElementLocalSolve3D_DGAdvective_Tet_AD_btest_memcheck .........................................   Passed  256.93 sec
        Start 1810: EdgeLocalSolve1D_Dual_Galerkin_Stabilized_Line_AD_btest_memcheck
 68/109 Test #1810: EdgeLocalSolve1D_Dual_Galerkin_Stabilized_Line_AD_btest_memcheck ..............................   Passed  128.65 sec
        Start 1812: ElementDualLocalSolve3D_Galerkin_Stabilized_Triangle_AD_btest_memcheck
 69/109 Test #1812: ElementDualLocalSolve3D_Galerkin_Stabilized_Triangle_AD_btest_memcheck ........................   Passed  6684.46 sec
        Start 1814: EdgeLocalSolve2D_Dual_Galerkin_Stabilized_AD_btest_memcheck
 70/109 Test #1814: EdgeLocalSolve2D_Dual_Galerkin_Stabilized_AD_btest_memcheck ...................................   Passed  805.92 sec
        Start 1816: ElementLocalSolve2D_DGBR2_Triangle_AD_btest_memcheck
 71/109 Test #1816: ElementLocalSolve2D_DGBR2_Triangle_AD_btest_memcheck ..........................................   Passed  425.98 sec
        Start 1818: ElementDualLocalSolve2D_Galerkin_Stabilized_Triangle_AD_btest_memcheck
 72/109 Test #1818: ElementDualLocalSolve2D_Galerkin_Stabilized_Triangle_AD_btest_memcheck ........................   Passed  482.78 sec
        Start 1820: Block_1D_Decoupled_Burgers_btest_memcheck
 73/109 Test #1820: Block_1D_Decoupled_Burgers_btest_memcheck .....................................................   Passed  1058.99 sec
        Start 1822: Block_1D_Decoupled_AD_btest_memcheck
 74/109 Test #1822: Block_1D_Decoupled_AD_btest_memcheck ..........................................................   Passed  114.84 sec
        Start 1824: AnalyticSolve2D_HDG_Triangle_NavierStokes_UniformStream_btest_memcheck
 75/109 Test #1824: AnalyticSolve2D_HDG_Triangle_NavierStokes_UniformStream_btest_memcheck ........................   Passed  127.35 sec
        Start 1826: AnalyticSolve2D_DGAdvective_IBL_StagnationFlow_SingleElem_LamiBL_btest_memcheck
 76/109 Test #1826: AnalyticSolve2D_DGAdvective_IBL_StagnationFlow_SingleElem_LamiBL_btest_memcheck ...............   Passed  125.79 sec
        Start 1828: AnalyticSolve2D_HDG_Triangle_NavierStokes_btest_memcheck
 77/109 Test #1828: AnalyticSolve2D_HDG_Triangle_NavierStokes_btest_memcheck ......................................   Passed  927.50 sec
        Start 1830: AnalyticSolve2D_DGBR2_Triangle_NavierStokes_UniformStream_btest_memcheck
 78/109 Test #1830: AnalyticSolve2D_DGBR2_Triangle_NavierStokes_UniformStream_btest_memcheck ......................   Passed  119.71 sec
        Start 1832: AnalyticSolve2D_DGAdvective_Triangle_Euler_UniformStream_btest_memcheck
 79/109 Test #1832: AnalyticSolve2D_DGAdvective_Triangle_Euler_UniformStream_btest_memcheck .......................   Passed  191.42 sec
        Start 1834: AnalyticSolve2D_DGAdvective_IBL_StagnationFlow_LamiBL_btest_memcheck
 80/109 Test #1834: AnalyticSolve2D_DGAdvective_IBL_StagnationFlow_LamiBL_btest_memcheck ..........................   Passed  129.51 sec
        Start 1836: AnalyticSolve_HDG_AD_btest_memcheck
 81/109 Test #1836: AnalyticSolve_HDG_AD_btest_memcheck ...........................................................   Passed  115.68 sec
        Start 1838: AnalyticSolve2D_DGBR2_Triangle_NavierStokes_btest_memcheck
 82/109 Test #1838: AnalyticSolve2D_DGBR2_Triangle_NavierStokes_btest_memcheck ....................................   Passed  179.06 sec
        Start 1840: BCEulermitAVDiffusion3D_Consistency_btest_memcheck
 83/109 Test #1840: BCEulermitAVDiffusion3D_Consistency_btest_memcheck ............................................   Passed   13.00 sec
        Start 1842: Solve2D_Uncoupled_DGAdvectiveIBLUniField_NACA0004_LamiBL_btest_memcheck
 84/109 Test #1842: Solve2D_Uncoupled_DGAdvectiveIBLUniField_NACA0004_LamiBL_btest_memcheck .......................   Passed  248.95 sec
        Start 1844: Solve2D_Coupled4x4_HDGAdv_IBL_Panel_NACA0004_LamiBL_TurbWake_btest_memcheck
 85/109 Test #1844: Solve2D_Coupled4x4_HDGAdv_IBL_Panel_NACA0004_LamiBL_TurbWake_btest_memcheck ...................   Passed  1044.60 sec
        Start 1846: Solve2D_Coupled4x4_IBLUniField_Panel_NACA0004_LamiBL_TurbWakeXfoilLagClosure_btest_memcheck
 86/109 Test #1846: Solve2D_Coupled4x4_IBLUniField_Panel_NACA0004_LamiBL_TurbWakeXfoilLagClosure_btest_memcheck ...   Passed  1004.07 sec
        Start 1848: Solve2D_Coupled4x4_IBLUniField_LamiBL_TurbWake_PTC_btest_memcheck
 87/109 Test #1848: Solve2D_Coupled4x4_IBLUniField_LamiBL_TurbWake_PTC_btest_memcheck .............................   Passed  1874.13 sec
        Start 1850: Solve2D_Uncoupled_DGAdvectiveIBL_NACA0004_LamiBL_btest_memcheck
 88/109 Test #1850: Solve2D_Uncoupled_DGAdvectiveIBL_NACA0004_LamiBL_btest_memcheck ...............................   Passed  306.21 sec
        Start 1852: PDEmitAVSensor2D_Consistency_RANSSA_btest_memcheck
 89/109 Test #1852: PDEmitAVSensor2D_Consistency_RANSSA_btest_memcheck ............................................   Passed   13.85 sec
        Start 1854: Solve2D_Uncoupled_DGAdvectiveIBL_NACA0004_LamiBL_PTC_btest_memcheck
 90/109 Test #1854: Solve2D_Uncoupled_DGAdvectiveIBL_NACA0004_LamiBL_PTC_btest_memcheck ...........................   Passed  861.69 sec
        Start 1856: BCEulermitAVDiffusion2D_Consistency_btest_memcheck
 91/109 Test #1856: BCEulermitAVDiffusion2D_Consistency_btest_memcheck ............................................   Passed   13.70 sec
        Start 1858: Solve2D_Coupled4x4_IBL_Panel_NACA0004_LamiBL_TurbWakeXfoilLagClosure_btest_memcheck
 92/109 Test #1858: Solve2D_Coupled4x4_IBL_Panel_NACA0004_LamiBL_TurbWakeXfoilLagClosure_btest_memcheck ...........   Passed  2057.11 sec
        Start 1860: PDEmitAVSensor1D_Consistency_btest_memcheck
 93/109 Test #1860: PDEmitAVSensor1D_Consistency_btest_memcheck ...................................................   Passed   11.97 sec
        Start 1862: PDEEulermitAVDiffusion3D_RANSSA_Consistency_btest_memcheck
 94/109 Test #1862: PDEEulermitAVDiffusion3D_RANSSA_Consistency_btest_memcheck ....................................   Passed   10.88 sec
        Start 1864: Solve2D_Uncoupled_HDGAdvectiveIBL_NACA0004_LamiBL_btest_memcheck
 95/109 Test #1864: Solve2D_Uncoupled_HDGAdvectiveIBL_NACA0004_LamiBL_btest_memcheck ..............................   Passed  276.07 sec
        Start 1866: PDEEulermitAVDiffusion3D_Consistency_btest_memcheck
 96/109 Test #1866: PDEEulermitAVDiffusion3D_Consistency_btest_memcheck ...........................................   Passed   12.25 sec
        Start 1868: Solve2D_Coupled4x4_IBL_Panel_NACA0004_FittedTransition_Forced_btest_memcheck
 97/109 Test #1868: Solve2D_Coupled4x4_IBL_Panel_NACA0004_FittedTransition_Forced_btest_memcheck ..................   Passed  3368.01 sec
        Start 1870: Solve2D_Coupled4x4_IBL_Panel_NACA0004_FittedTransition_TwoLayerNewton_btest_memcheck
 98/109 Test #1870: Solve2D_Coupled4x4_IBL_Panel_NACA0004_FittedTransition_TwoLayerNewton_btest_memcheck ..........   Passed  1524.81 sec
        Start 1872: BCEulermitAVDiffusion2D_Consistency_RANSSA_btest_memcheck
 99/109 Test #1872: BCEulermitAVDiffusion2D_Consistency_RANSSA_btest_memcheck .....................................   Passed    9.97 sec
        Start 1874: Solve2D_Coupled4x4_IBLUniField_Panel_NACA0004_CapturedTransition_btest_memcheck
100/109 Test #1874: Solve2D_Coupled4x4_IBLUniField_Panel_NACA0004_CapturedTransition_btest_memcheck ...............   Passed  1638.50 sec
        Start 1876: BCEulermitAVDiffusion3D_Consistency_RANSSA_btest_memcheck
101/109 Test #1876: BCEulermitAVDiffusion3D_Consistency_RANSSA_btest_memcheck .....................................   Passed   10.06 sec
        Start 1878: PDEEulermitAVDiffusion1D_Consistency_btest_memcheck
102/109 Test #1878: PDEEulermitAVDiffusion1D_Consistency_btest_memcheck ...........................................   Passed    8.75 sec
        Start 1880: PDEEulermitAVDiffusion2D_RANSSA_Consistency_btest_memcheck
103/109 Test #1880: PDEEulermitAVDiffusion2D_RANSSA_Consistency_btest_memcheck ....................................   Passed    9.05 sec
        Start 1882: Solve2D_Coupled4x4_IBL_Panel_NACA0004_FittedTransition_LineSearchNewton_btest_memcheck
104/109 Test #1882: Solve2D_Coupled4x4_IBL_Panel_NACA0004_FittedTransition_LineSearchNewton_btest_memcheck ........   Passed  1099.67 sec
        Start 1884: PDEmitAVSensor2D_Consistency_btest_memcheck
105/109 Test #1884: PDEmitAVSensor2D_Consistency_btest_memcheck ...................................................   Passed   15.44 sec
        Start 1886: PDEmitAVSensor3D_Consistency_RANSSA_btest_memcheck
106/109 Test #1886: PDEmitAVSensor3D_Consistency_RANSSA_btest_memcheck ............................................   Passed   11.72 sec
        Start 1888: Solve2D_XfoilLikePanelMethod_btest_memcheck
107/109 Test #1888: Solve2D_XfoilLikePanelMethod_btest_memcheck ...................................................   Passed  827.96 sec
        Start 1890: PDEmitAVSensor3D_Consistency_btest_memcheck
108/109 Test #1890: PDEmitAVSensor3D_Consistency_btest_memcheck ...................................................   Passed   14.22 sec
        Start 1892: PDEEulermitAVDiffusion2D_Consistency_btest_memcheck
109/109 Test #1892: PDEEulermitAVDiffusion2D_Consistency_btest_memcheck ...........................................   Passed   11.22 sec

99% tests passed, 1 tests failed out of 109

Label Time Summary:
SANSMemCheck_system    = 51132.59 sec (109 tests)

Total Test time (real) = 51135.82 sec

The following tests FAILED:
	1690 - ErrorOrder_4D_DG_Pentatope_btest_memcheck (Timeout)
Errors while running CTest
test/system/CMakeFiles/memcheck_system.dir/build.make:57: recipe for target 'test/system/CMakeFiles/memcheck_system' failed
make[3]: *** [test/system/CMakeFiles/memcheck_system] Error 8
CMakeFiles/Makefile2:173965: recipe for target 'test/system/CMakeFiles/memcheck_system.dir/all' failed
make[2]: *** [test/system/CMakeFiles/memcheck_system.dir/all] Error 2
CMakeFiles/Makefile2:173972: recipe for target 'test/system/CMakeFiles/memcheck_system.dir/rule' failed
make[1]: *** [test/system/CMakeFiles/memcheck_system.dir/rule] Error 2
Makefile:61026: recipe for target 'memcheck_system' failed
make: *** [memcheck_system] Error 2

real	946m19.527s
user	901m9.156s
sys	9m27.056s
+ status=1
++ find /jenkins/workspace/SANS_Weekly/builddir/debug_clang/buildnode/reynolds/build/debug_clang -name Test.xml
+ mv /jenkins/workspace/SANS_Weekly/builddir/debug_clang/buildnode/reynolds/build/debug_clang/Testing/20190706-0751/Test.xml /jenkins/workspace/SANS_Weekly/builddir/debug_clang/buildnode/reynolds/build/Test_system_memcheck.xml
+ '[' 1 -eq 1 ']'
+ exit 1
Build step 'Execute shell' marked build as failure
[WARNINGS] Skipping publisher since build result is FAILURE
[Valgrind] Files to copy:
[Valgrind] build/debug_clang/test/valgrind.12213.memcheck.xml
[Valgrind] build/debug_clang/test/valgrind.12428.memcheck.xml
[Valgrind] build/debug_clang/test/valgrind.12809.memcheck.xml
[Valgrind] build/debug_clang/test/valgrind.12973.memcheck.xml
[Valgrind] build/debug_clang/test/valgrind.13838.memcheck.xml
[Valgrind] build/debug_clang/test/valgrind.14177.memcheck.xml
[Valgrind] build/debug_clang/test/valgrind.14465.memcheck.xml
[Valgrind] build/debug_clang/test/valgrind.14635.memcheck.xml
[Valgrind] build/debug_clang/test/valgrind.14992.memcheck.xml
[Valgrind] build/debug_clang/test/valgrind.15412.memcheck.xml
[Valgrind] build/debug_clang/test/valgrind.15752.memcheck.xml
[Valgrind] build/debug_clang/test/valgrind.15779.memcheck.xml
[Valgrind] build/debug_clang/test/valgrind.15904.memcheck.xml
[Valgrind] build/debug_clang/test/valgrind.15907.memcheck.xml
[Valgrind] build/debug_clang/test/valgrind.15911.memcheck.xml
[Valgrind] build/debug_clang/test/valgrind.16251.memcheck.xml
[Valgrind] build/debug_clang/test/valgrind.16363.memcheck.xml
[Valgrind] build/debug_clang/test/valgrind.16400.memcheck.xml
[Valgrind] build/debug_clang/test/valgrind.16432.memcheck.xml
[Valgrind] build/debug_clang/test/valgrind.16675.memcheck.xml
[Valgrind] build/debug_clang/test/valgrind.16771.memcheck.xml
[Valgrind] build/debug_clang/test/valgrind.16831.memcheck.xml
[Valgrind] build/debug_clang/test/valgrind.17153.memcheck.xml
[Valgrind] build/debug_clang/test/valgrind.1719.memcheck.xml
[Valgrind] build/debug_clang/test/valgrind.17717.memcheck.xml
[Valgrind] build/debug_clang/test/valgrind.17722.memcheck.xml
[Valgrind] build/debug_clang/test/valgrind.18240.memcheck.xml
[Valgrind] build/debug_clang/test/valgrind.18585.memcheck.xml
[Valgrind] build/debug_clang/test/valgrind.18917.memcheck.xml
[Valgrind] build/debug_clang/test/valgrind.19707.memcheck.xml
[Valgrind] build/debug_clang/test/valgrind.19896.memcheck.xml
[Valgrind] build/debug_clang/test/valgrind.20645.memcheck.xml
[Valgrind] build/debug_clang/test/valgrind.21111.memcheck.xml
[Valgrind] build/debug_clang/test/valgrind.21170.memcheck.xml
[Valgrind] build/debug_clang/test/valgrind.21560.memcheck.xml
[Valgrind] build/debug_clang/test/valgrind.22123.memcheck.xml
[Valgrind] build/debug_clang/test/valgrind.22129.memcheck.xml
[Valgrind] build/debug_clang/test/valgrind.22207.memcheck.xml
[Valgrind] build/debug_clang/test/valgrind.22618.memcheck.xml
[Valgrind] build/debug_clang/test/valgrind.24387.memcheck.xml
[Valgrind] build/debug_clang/test/valgrind.24597.memcheck.xml
[Valgrind] build/debug_clang/test/valgrind.24710.memcheck.xml
[Valgrind] build/debug_clang/test/valgrind.24785.memcheck.xml
[Valgrind] build/debug_clang/test/valgrind.24834.memcheck.xml
[Valgrind] build/debug_clang/test/valgrind.24952.memcheck.xml
[Valgrind] build/debug_clang/test/valgrind.25276.memcheck.xml
[Valgrind] build/debug_clang/test/valgrind.25450.memcheck.xml
[Valgrind] build/debug_clang/test/valgrind.25797.memcheck.xml
[Valgrind] build/debug_clang/test/valgrind.26216.memcheck.xml
[Valgrind] build/debug_clang/test/valgrind.26406.memcheck.xml
[Valgrind] build/debug_clang/test/valgrind.26483.memcheck.xml
[Valgrind] build/debug_clang/test/valgrind.27019.memcheck.xml
[Valgrind] build/debug_clang/test/valgrind.27210.memcheck.xml
[Valgrind] build/debug_clang/test/valgrind.27246.memcheck.xml
[Valgrind] build/debug_clang/test/valgrind.28328.memcheck.xml
[Valgrind] build/debug_clang/test/valgrind.28812.memcheck.xml
[Valgrind] build/debug_clang/test/valgrind.29037.memcheck.xml
[Valgrind] build/debug_clang/test/valgrind.29065.memcheck.xml
[Valgrind] build/debug_clang/test/valgrind.2955.memcheck.xml
[Valgrind] build/debug_clang/test/valgrind.30219.memcheck.xml
[Valgrind] build/debug_clang/test/valgrind.30272.memcheck.xml
[Valgrind] build/debug_clang/test/valgrind.30318.memcheck.xml
[Valgrind] build/debug_clang/test/valgrind.30329.memcheck.xml
[Valgrind] build/debug_clang/test/valgrind.30705.memcheck.xml
[Valgrind] build/debug_clang/test/valgrind.3107.memcheck.xml
[Valgrind] build/debug_clang/test/valgrind.31329.memcheck.xml
[Valgrind] build/debug_clang/test/valgrind.31848.memcheck.xml
[Valgrind] build/debug_clang/test/valgrind.322.memcheck.xml
[Valgrind] build/debug_clang/test/valgrind.3222.memcheck.xml
[Valgrind] build/debug_clang/test/valgrind.32946.memcheck.xml
[Valgrind] build/debug_clang/test/valgrind.33032.memcheck.xml
[Valgrind] build/debug_clang/test/valgrind.33515.memcheck.xml
[Valgrind] build/debug_clang/test/valgrind.3359.memcheck.xml
[Valgrind] build/debug_clang/test/valgrind.33800.memcheck.xml
[Valgrind] build/debug_clang/test/valgrind.34839.memcheck.xml
[Valgrind] build/debug_clang/test/valgrind.35744.memcheck.xml
[Valgrind] build/debug_clang/test/valgrind.36076.memcheck.xml
[Valgrind] build/debug_clang/test/valgrind.36498.memcheck.xml
[Valgrind] build/debug_clang/test/valgrind.36655.memcheck.xml
[Valgrind] build/debug_clang/test/valgrind.36870.memcheck.xml
[Valgrind] build/debug_clang/test/valgrind.37123.memcheck.xml
[Valgrind] build/debug_clang/test/valgrind.37228.memcheck.xml
[Valgrind] build/debug_clang/test/valgrind.37441.memcheck.xml
[Valgrind] build/debug_clang/test/valgrind.37515.memcheck.xml
[Valgrind] build/debug_clang/test/valgrind.38174.memcheck.xml
[Valgrind] build/debug_clang/test/valgrind.3847.memcheck.xml
[Valgrind] build/debug_clang/test/valgrind.38529.memcheck.xml
[Valgrind] build/debug_clang/test/valgrind.38690.memcheck.xml
[Valgrind] build/debug_clang/test/valgrind.38880.memcheck.xml
[Valgrind] build/debug_clang/test/valgrind.39577.memcheck.xml
[Valgrind] build/debug_clang/test/valgrind.40125.memcheck.xml
[Valgrind] build/debug_clang/test/valgrind.40503.memcheck.xml
[Valgrind] build/debug_clang/test/valgrind.40515.memcheck.xml
[Valgrind] build/debug_clang/test/valgrind.40667.memcheck.xml
[Valgrind] build/debug_clang/test/valgrind.5283.memcheck.xml
[Valgrind] build/debug_clang/test/valgrind.5501.memcheck.xml
[Valgrind] build/debug_clang/test/valgrind.5587.memcheck.xml
[Valgrind] build/debug_clang/test/valgrind.5589.memcheck.xml
[Valgrind] build/debug_clang/test/valgrind.5727.memcheck.xml
[Valgrind] build/debug_clang/test/valgrind.6296.memcheck.xml
[Valgrind] build/debug_clang/test/valgrind.6764.memcheck.xml
[Valgrind] build/debug_clang/test/valgrind.6890.memcheck.xml
[Valgrind] build/debug_clang/test/valgrind.733.memcheck.xml
[Valgrind] build/debug_clang/test/valgrind.7988.memcheck.xml
[Valgrind] build/debug_clang/test/valgrind.8158.memcheck.xml
[Valgrind] build/debug_clang/test/valgrind.8391.memcheck.xml
[Valgrind] build/debug_clang/test/valgrind.892.memcheck.xml
[Valgrind] build/debug_clang/test/valgrind.9456.memcheck.xml
[Valgrind] build/debug_clang/test/valgrind.9879.memcheck.xml
[Valgrind] Copying build/debug_clang/test/valgrind.12213.memcheck.xml to /var/lib/jenkins/jobs/SANS_Weekly/configurations/axis-builddir/debug_clang/axis-buildnode/reynolds/builds/244/valgrind-plugin/valgrind-results/build/debug_clang/test/valgrind.12213.memcheck.xml
[Valgrind] Copying build/debug_clang/test/valgrind.12428.memcheck.xml to /var/lib/jenkins/jobs/SANS_Weekly/configurations/axis-builddir/debug_clang/axis-buildnode/reynolds/builds/244/valgrind-plugin/valgrind-results/build/debug_clang/test/valgrind.12428.memcheck.xml
[Valgrind] Copying build/debug_clang/test/valgrind.12809.memcheck.xml to /var/lib/jenkins/jobs/SANS_Weekly/configurations/axis-builddir/debug_clang/axis-buildnode/reynolds/builds/244/valgrind-plugin/valgrind-results/build/debug_clang/test/valgrind.12809.memcheck.xml
[Valgrind] Copying build/debug_clang/test/valgrind.12973.memcheck.xml to /var/lib/jenkins/jobs/SANS_Weekly/configurations/axis-builddir/debug_clang/axis-buildnode/reynolds/builds/244/valgrind-plugin/valgrind-results/build/debug_clang/test/valgrind.12973.memcheck.xml
[Valgrind] Copying build/debug_clang/test/valgrind.13838.memcheck.xml to /var/lib/jenkins/jobs/SANS_Weekly/configurations/axis-builddir/debug_clang/axis-buildnode/reynolds/builds/244/valgrind-plugin/valgrind-results/build/debug_clang/test/valgrind.13838.memcheck.xml
[Valgrind] Copying build/debug_clang/test/valgrind.14177.memcheck.xml to /var/lib/jenkins/jobs/SANS_Weekly/configurations/axis-builddir/debug_clang/axis-buildnode/reynolds/builds/244/valgrind-plugin/valgrind-results/build/debug_clang/test/valgrind.14177.memcheck.xml
[Valgrind] Copying build/debug_clang/test/valgrind.14465.memcheck.xml to /var/lib/jenkins/jobs/SANS_Weekly/configurations/axis-builddir/debug_clang/axis-buildnode/reynolds/builds/244/valgrind-plugin/valgrind-results/build/debug_clang/test/valgrind.14465.memcheck.xml
[Valgrind] Copying build/debug_clang/test/valgrind.14635.memcheck.xml to /var/lib/jenkins/jobs/SANS_Weekly/configurations/axis-builddir/debug_clang/axis-buildnode/reynolds/builds/244/valgrind-plugin/valgrind-results/build/debug_clang/test/valgrind.14635.memcheck.xml
[Valgrind] Copying build/debug_clang/test/valgrind.14992.memcheck.xml to /var/lib/jenkins/jobs/SANS_Weekly/configurations/axis-builddir/debug_clang/axis-buildnode/reynolds/builds/244/valgrind-plugin/valgrind-results/build/debug_clang/test/valgrind.14992.memcheck.xml
[Valgrind] Copying build/debug_clang/test/valgrind.15412.memcheck.xml to /var/lib/jenkins/jobs/SANS_Weekly/configurations/axis-builddir/debug_clang/axis-buildnode/reynolds/builds/244/valgrind-plugin/valgrind-results/build/debug_clang/test/valgrind.15412.memcheck.xml
[Valgrind] Copying build/debug_clang/test/valgrind.15752.memcheck.xml to /var/lib/jenkins/jobs/SANS_Weekly/configurations/axis-builddir/debug_clang/axis-buildnode/reynolds/builds/244/valgrind-plugin/valgrind-results/build/debug_clang/test/valgrind.15752.memcheck.xml
[Valgrind] Copying build/debug_clang/test/valgrind.15779.memcheck.xml to /var/lib/jenkins/jobs/SANS_Weekly/configurations/axis-builddir/debug_clang/axis-buildnode/reynolds/builds/244/valgrind-plugin/valgrind-results/build/debug_clang/test/valgrind.15779.memcheck.xml
[Valgrind] Copying build/debug_clang/test/valgrind.15904.memcheck.xml to /var/lib/jenkins/jobs/SANS_Weekly/configurations/axis-builddir/debug_clang/axis-buildnode/reynolds/builds/244/valgrind-plugin/valgrind-results/build/debug_clang/test/valgrind.15904.memcheck.xml
[Valgrind] Copying build/debug_clang/test/valgrind.15907.memcheck.xml to /var/lib/jenkins/jobs/SANS_Weekly/configurations/axis-builddir/debug_clang/axis-buildnode/reynolds/builds/244/valgrind-plugin/valgrind-results/build/debug_clang/test/valgrind.15907.memcheck.xml
[Valgrind] Copying build/debug_clang/test/valgrind.15911.memcheck.xml to /var/lib/jenkins/jobs/SANS_Weekly/configurations/axis-builddir/debug_clang/axis-buildnode/reynolds/builds/244/valgrind-plugin/valgrind-results/build/debug_clang/test/valgrind.15911.memcheck.xml
[Valgrind] Copying build/debug_clang/test/valgrind.16251.memcheck.xml to /var/lib/jenkins/jobs/SANS_Weekly/configurations/axis-builddir/debug_clang/axis-buildnode/reynolds/builds/244/valgrind-plugin/valgrind-results/build/debug_clang/test/valgrind.16251.memcheck.xml
[Valgrind] Copying build/debug_clang/test/valgrind.16363.memcheck.xml to /var/lib/jenkins/jobs/SANS_Weekly/configurations/axis-builddir/debug_clang/axis-buildnode/reynolds/builds/244/valgrind-plugin/valgrind-results/build/debug_clang/test/valgrind.16363.memcheck.xml
[Valgrind] Copying build/debug_clang/test/valgrind.16400.memcheck.xml to /var/lib/jenkins/jobs/SANS_Weekly/configurations/axis-builddir/debug_clang/axis-buildnode/reynolds/builds/244/valgrind-plugin/valgrind-results/build/debug_clang/test/valgrind.16400.memcheck.xml
[Valgrind] Copying build/debug_clang/test/valgrind.16432.memcheck.xml to /var/lib/jenkins/jobs/SANS_Weekly/configurations/axis-builddir/debug_clang/axis-buildnode/reynolds/builds/244/valgrind-plugin/valgrind-results/build/debug_clang/test/valgrind.16432.memcheck.xml
[Valgrind] Copying build/debug_clang/test/valgrind.16675.memcheck.xml to /var/lib/jenkins/jobs/SANS_Weekly/configurations/axis-builddir/debug_clang/axis-buildnode/reynolds/builds/244/valgrind-plugin/valgrind-results/build/debug_clang/test/valgrind.16675.memcheck.xml
[Valgrind] Copying build/debug_clang/test/valgrind.16771.memcheck.xml to /var/lib/jenkins/jobs/SANS_Weekly/configurations/axis-builddir/debug_clang/axis-buildnode/reynolds/builds/244/valgrind-plugin/valgrind-results/build/debug_clang/test/valgrind.16771.memcheck.xml
[Valgrind] Copying build/debug_clang/test/valgrind.16831.memcheck.xml to /var/lib/jenkins/jobs/SANS_Weekly/configurations/axis-builddir/debug_clang/axis-buildnode/reynolds/builds/244/valgrind-plugin/valgrind-results/build/debug_clang/test/valgrind.16831.memcheck.xml
[Valgrind] Copying build/debug_clang/test/valgrind.17153.memcheck.xml to /var/lib/jenkins/jobs/SANS_Weekly/configurations/axis-builddir/debug_clang/axis-buildnode/reynolds/builds/244/valgrind-plugin/valgrind-results/build/debug_clang/test/valgrind.17153.memcheck.xml
[Valgrind] Copying build/debug_clang/test/valgrind.1719.memcheck.xml to /var/lib/jenkins/jobs/SANS_Weekly/configurations/axis-builddir/debug_clang/axis-buildnode/reynolds/builds/244/valgrind-plugin/valgrind-results/build/debug_clang/test/valgrind.1719.memcheck.xml
[Valgrind] Copying build/debug_clang/test/valgrind.17717.memcheck.xml to /var/lib/jenkins/jobs/SANS_Weekly/configurations/axis-builddir/debug_clang/axis-buildnode/reynolds/builds/244/valgrind-plugin/valgrind-results/build/debug_clang/test/valgrind.17717.memcheck.xml
[Valgrind] Copying build/debug_clang/test/valgrind.17722.memcheck.xml to /var/lib/jenkins/jobs/SANS_Weekly/configurations/axis-builddir/debug_clang/axis-buildnode/reynolds/builds/244/valgrind-plugin/valgrind-results/build/debug_clang/test/valgrind.17722.memcheck.xml
[Valgrind] Copying build/debug_clang/test/valgrind.18240.memcheck.xml to /var/lib/jenkins/jobs/SANS_Weekly/configurations/axis-builddir/debug_clang/axis-buildnode/reynolds/builds/244/valgrind-plugin/valgrind-results/build/debug_clang/test/valgrind.18240.memcheck.xml
[Valgrind] Copying build/debug_clang/test/valgrind.18585.memcheck.xml to /var/lib/jenkins/jobs/SANS_Weekly/configurations/axis-builddir/debug_clang/axis-buildnode/reynolds/builds/244/valgrind-plugin/valgrind-results/build/debug_clang/test/valgrind.18585.memcheck.xml
[Valgrind] Copying build/debug_clang/test/valgrind.18917.memcheck.xml to /var/lib/jenkins/jobs/SANS_Weekly/configurations/axis-builddir/debug_clang/axis-buildnode/reynolds/builds/244/valgrind-plugin/valgrind-results/build/debug_clang/test/valgrind.18917.memcheck.xml
[Valgrind] Copying build/debug_clang/test/valgrind.19707.memcheck.xml to /var/lib/jenkins/jobs/SANS_Weekly/configurations/axis-builddir/debug_clang/axis-buildnode/reynolds/builds/244/valgrind-plugin/valgrind-results/build/debug_clang/test/valgrind.19707.memcheck.xml
[Valgrind] Copying build/debug_clang/test/valgrind.19896.memcheck.xml to /var/lib/jenkins/jobs/SANS_Weekly/configurations/axis-builddir/debug_clang/axis-buildnode/reynolds/builds/244/valgrind-plugin/valgrind-results/build/debug_clang/test/valgrind.19896.memcheck.xml
[Valgrind] Copying build/debug_clang/test/valgrind.20645.memcheck.xml to /var/lib/jenkins/jobs/SANS_Weekly/configurations/axis-builddir/debug_clang/axis-buildnode/reynolds/builds/244/valgrind-plugin/valgrind-results/build/debug_clang/test/valgrind.20645.memcheck.xml
[Valgrind] Copying build/debug_clang/test/valgrind.21111.memcheck.xml to /var/lib/jenkins/jobs/SANS_Weekly/configurations/axis-builddir/debug_clang/axis-buildnode/reynolds/builds/244/valgrind-plugin/valgrind-results/build/debug_clang/test/valgrind.21111.memcheck.xml
[Valgrind] Copying build/debug_clang/test/valgrind.21170.memcheck.xml to /var/lib/jenkins/jobs/SANS_Weekly/configurations/axis-builddir/debug_clang/axis-buildnode/reynolds/builds/244/valgrind-plugin/valgrind-results/build/debug_clang/test/valgrind.21170.memcheck.xml
[Valgrind] Copying build/debug_clang/test/valgrind.21560.memcheck.xml to /var/lib/jenkins/jobs/SANS_Weekly/configurations/axis-builddir/debug_clang/axis-buildnode/reynolds/builds/244/valgrind-plugin/valgrind-results/build/debug_clang/test/valgrind.21560.memcheck.xml
[Valgrind] Copying build/debug_clang/test/valgrind.22123.memcheck.xml to /var/lib/jenkins/jobs/SANS_Weekly/configurations/axis-builddir/debug_clang/axis-buildnode/reynolds/builds/244/valgrind-plugin/valgrind-results/build/debug_clang/test/valgrind.22123.memcheck.xml
[Valgrind] Copying build/debug_clang/test/valgrind.22129.memcheck.xml to /var/lib/jenkins/jobs/SANS_Weekly/configurations/axis-builddir/debug_clang/axis-buildnode/reynolds/builds/244/valgrind-plugin/valgrind-results/build/debug_clang/test/valgrind.22129.memcheck.xml
[Valgrind] Copying build/debug_clang/test/valgrind.22207.memcheck.xml to /var/lib/jenkins/jobs/SANS_Weekly/configurations/axis-builddir/debug_clang/axis-buildnode/reynolds/builds/244/valgrind-plugin/valgrind-results/build/debug_clang/test/valgrind.22207.memcheck.xml
[Valgrind] Copying build/debug_clang/test/valgrind.22618.memcheck.xml to /var/lib/jenkins/jobs/SANS_Weekly/configurations/axis-builddir/debug_clang/axis-buildnode/reynolds/builds/244/valgrind-plugin/valgrind-results/build/debug_clang/test/valgrind.22618.memcheck.xml
[Valgrind] Copying build/debug_clang/test/valgrind.24387.memcheck.xml to /var/lib/jenkins/jobs/SANS_Weekly/configurations/axis-builddir/debug_clang/axis-buildnode/reynolds/builds/244/valgrind-plugin/valgrind-results/build/debug_clang/test/valgrind.24387.memcheck.xml
[Valgrind] Copying build/debug_clang/test/valgrind.24597.memcheck.xml to /var/lib/jenkins/jobs/SANS_Weekly/configurations/axis-builddir/debug_clang/axis-buildnode/reynolds/builds/244/valgrind-plugin/valgrind-results/build/debug_clang/test/valgrind.24597.memcheck.xml
[Valgrind] Copying build/debug_clang/test/valgrind.24710.memcheck.xml to /var/lib/jenkins/jobs/SANS_Weekly/configurations/axis-builddir/debug_clang/axis-buildnode/reynolds/builds/244/valgrind-plugin/valgrind-results/build/debug_clang/test/valgrind.24710.memcheck.xml
[Valgrind] Copying build/debug_clang/test/valgrind.24785.memcheck.xml to /var/lib/jenkins/jobs/SANS_Weekly/configurations/axis-builddir/debug_clang/axis-buildnode/reynolds/builds/244/valgrind-plugin/valgrind-results/build/debug_clang/test/valgrind.24785.memcheck.xml
[Valgrind] Copying build/debug_clang/test/valgrind.24834.memcheck.xml to /var/lib/jenkins/jobs/SANS_Weekly/configurations/axis-builddir/debug_clang/axis-buildnode/reynolds/builds/244/valgrind-plugin/valgrind-results/build/debug_clang/test/valgrind.24834.memcheck.xml
[Valgrind] Copying build/debug_clang/test/valgrind.24952.memcheck.xml to /var/lib/jenkins/jobs/SANS_Weekly/configurations/axis-builddir/debug_clang/axis-buildnode/reynolds/builds/244/valgrind-plugin/valgrind-results/build/debug_clang/test/valgrind.24952.memcheck.xml
[Valgrind] Copying build/debug_clang/test/valgrind.25276.memcheck.xml to /var/lib/jenkins/jobs/SANS_Weekly/configurations/axis-builddir/debug_clang/axis-buildnode/reynolds/builds/244/valgrind-plugin/valgrind-results/build/debug_clang/test/valgrind.25276.memcheck.xml
[Valgrind] Copying build/debug_clang/test/valgrind.25450.memcheck.xml to /var/lib/jenkins/jobs/SANS_Weekly/configurations/axis-builddir/debug_clang/axis-buildnode/reynolds/builds/244/valgrind-plugin/valgrind-results/build/debug_clang/test/valgrind.25450.memcheck.xml
[Valgrind] Copying build/debug_clang/test/valgrind.25797.memcheck.xml to /var/lib/jenkins/jobs/SANS_Weekly/configurations/axis-builddir/debug_clang/axis-buildnode/reynolds/builds/244/valgrind-plugin/valgrind-results/build/debug_clang/test/valgrind.25797.memcheck.xml
[Valgrind] Copying build/debug_clang/test/valgrind.26216.memcheck.xml to /var/lib/jenkins/jobs/SANS_Weekly/configurations/axis-builddir/debug_clang/axis-buildnode/reynolds/builds/244/valgrind-plugin/valgrind-results/build/debug_clang/test/valgrind.26216.memcheck.xml
[Valgrind] Copying build/debug_clang/test/valgrind.26406.memcheck.xml to /var/lib/jenkins/jobs/SANS_Weekly/configurations/axis-builddir/debug_clang/axis-buildnode/reynolds/builds/244/valgrind-plugin/valgrind-results/build/debug_clang/test/valgrind.26406.memcheck.xml
[Valgrind] Copying build/debug_clang/test/valgrind.26483.memcheck.xml to /var/lib/jenkins/jobs/SANS_Weekly/configurations/axis-builddir/debug_clang/axis-buildnode/reynolds/builds/244/valgrind-plugin/valgrind-results/build/debug_clang/test/valgrind.26483.memcheck.xml
[Valgrind] Copying build/debug_clang/test/valgrind.27019.memcheck.xml to /var/lib/jenkins/jobs/SANS_Weekly/configurations/axis-builddir/debug_clang/axis-buildnode/reynolds/builds/244/valgrind-plugin/valgrind-results/build/debug_clang/test/valgrind.27019.memcheck.xml
[Valgrind] Copying build/debug_clang/test/valgrind.27210.memcheck.xml to /var/lib/jenkins/jobs/SANS_Weekly/configurations/axis-builddir/debug_clang/axis-buildnode/reynolds/builds/244/valgrind-plugin/valgrind-results/build/debug_clang/test/valgrind.27210.memcheck.xml
[Valgrind] Copying build/debug_clang/test/valgrind.27246.memcheck.xml to /var/lib/jenkins/jobs/SANS_Weekly/configurations/axis-builddir/debug_clang/axis-buildnode/reynolds/builds/244/valgrind-plugin/valgrind-results/build/debug_clang/test/valgrind.27246.memcheck.xml
[Valgrind] Copying build/debug_clang/test/valgrind.28328.memcheck.xml to /var/lib/jenkins/jobs/SANS_Weekly/configurations/axis-builddir/debug_clang/axis-buildnode/reynolds/builds/244/valgrind-plugin/valgrind-results/build/debug_clang/test/valgrind.28328.memcheck.xml
[Valgrind] Copying build/debug_clang/test/valgrind.28812.memcheck.xml to /var/lib/jenkins/jobs/SANS_Weekly/configurations/axis-builddir/debug_clang/axis-buildnode/reynolds/builds/244/valgrind-plugin/valgrind-results/build/debug_clang/test/valgrind.28812.memcheck.xml
[Valgrind] Copying build/debug_clang/test/valgrind.29037.memcheck.xml to /var/lib/jenkins/jobs/SANS_Weekly/configurations/axis-builddir/debug_clang/axis-buildnode/reynolds/builds/244/valgrind-plugin/valgrind-results/build/debug_clang/test/valgrind.29037.memcheck.xml
[Valgrind] Copying build/debug_clang/test/valgrind.29065.memcheck.xml to /var/lib/jenkins/jobs/SANS_Weekly/configurations/axis-builddir/debug_clang/axis-buildnode/reynolds/builds/244/valgrind-plugin/valgrind-results/build/debug_clang/test/valgrind.29065.memcheck.xml
[Valgrind] Copying build/debug_clang/test/valgrind.2955.memcheck.xml to /var/lib/jenkins/jobs/SANS_Weekly/configurations/axis-builddir/debug_clang/axis-buildnode/reynolds/builds/244/valgrind-plugin/valgrind-results/build/debug_clang/test/valgrind.2955.memcheck.xml
[Valgrind] Copying build/debug_clang/test/valgrind.30219.memcheck.xml to /var/lib/jenkins/jobs/SANS_Weekly/configurations/axis-builddir/debug_clang/axis-buildnode/reynolds/builds/244/valgrind-plugin/valgrind-results/build/debug_clang/test/valgrind.30219.memcheck.xml
[Valgrind] Copying build/debug_clang/test/valgrind.30272.memcheck.xml to /var/lib/jenkins/jobs/SANS_Weekly/configurations/axis-builddir/debug_clang/axis-buildnode/reynolds/builds/244/valgrind-plugin/valgrind-results/build/debug_clang/test/valgrind.30272.memcheck.xml
[Valgrind] Copying build/debug_clang/test/valgrind.30318.memcheck.xml to /var/lib/jenkins/jobs/SANS_Weekly/configurations/axis-builddir/debug_clang/axis-buildnode/reynolds/builds/244/valgrind-plugin/valgrind-results/build/debug_clang/test/valgrind.30318.memcheck.xml
[Valgrind] Copying build/debug_clang/test/valgrind.30329.memcheck.xml to /var/lib/jenkins/jobs/SANS_Weekly/configurations/axis-builddir/debug_clang/axis-buildnode/reynolds/builds/244/valgrind-plugin/valgrind-results/build/debug_clang/test/valgrind.30329.memcheck.xml
[Valgrind] Copying build/debug_clang/test/valgrind.30705.memcheck.xml to /var/lib/jenkins/jobs/SANS_Weekly/configurations/axis-builddir/debug_clang/axis-buildnode/reynolds/builds/244/valgrind-plugin/valgrind-results/build/debug_clang/test/valgrind.30705.memcheck.xml
[Valgrind] Copying build/debug_clang/test/valgrind.3107.memcheck.xml to /var/lib/jenkins/jobs/SANS_Weekly/configurations/axis-builddir/debug_clang/axis-buildnode/reynolds/builds/244/valgrind-plugin/valgrind-results/build/debug_clang/test/valgrind.3107.memcheck.xml
[Valgrind] Copying build/debug_clang/test/valgrind.31329.memcheck.xml to /var/lib/jenkins/jobs/SANS_Weekly/configurations/axis-builddir/debug_clang/axis-buildnode/reynolds/builds/244/valgrind-plugin/valgrind-results/build/debug_clang/test/valgrind.31329.memcheck.xml
[Valgrind] Copying build/debug_clang/test/valgrind.31848.memcheck.xml to /var/lib/jenkins/jobs/SANS_Weekly/configurations/axis-builddir/debug_clang/axis-buildnode/reynolds/builds/244/valgrind-plugin/valgrind-results/build/debug_clang/test/valgrind.31848.memcheck.xml
[Valgrind] Copying build/debug_clang/test/valgrind.322.memcheck.xml to /var/lib/jenkins/jobs/SANS_Weekly/configurations/axis-builddir/debug_clang/axis-buildnode/reynolds/builds/244/valgrind-plugin/valgrind-results/build/debug_clang/test/valgrind.322.memcheck.xml
[Valgrind] Copying build/debug_clang/test/valgrind.3222.memcheck.xml to /var/lib/jenkins/jobs/SANS_Weekly/configurations/axis-builddir/debug_clang/axis-buildnode/reynolds/builds/244/valgrind-plugin/valgrind-results/build/debug_clang/test/valgrind.3222.memcheck.xml
[Valgrind] Copying build/debug_clang/test/valgrind.32946.memcheck.xml to /var/lib/jenkins/jobs/SANS_Weekly/configurations/axis-builddir/debug_clang/axis-buildnode/reynolds/builds/244/valgrind-plugin/valgrind-results/build/debug_clang/test/valgrind.32946.memcheck.xml
[Valgrind] Copying build/debug_clang/test/valgrind.33032.memcheck.xml to /var/lib/jenkins/jobs/SANS_Weekly/configurations/axis-builddir/debug_clang/axis-buildnode/reynolds/builds/244/valgrind-plugin/valgrind-results/build/debug_clang/test/valgrind.33032.memcheck.xml
[Valgrind] Copying build/debug_clang/test/valgrind.33515.memcheck.xml to /var/lib/jenkins/jobs/SANS_Weekly/configurations/axis-builddir/debug_clang/axis-buildnode/reynolds/builds/244/valgrind-plugin/valgrind-results/build/debug_clang/test/valgrind.33515.memcheck.xml
[Valgrind] Copying build/debug_clang/test/valgrind.3359.memcheck.xml to /var/lib/jenkins/jobs/SANS_Weekly/configurations/axis-builddir/debug_clang/axis-buildnode/reynolds/builds/244/valgrind-plugin/valgrind-results/build/debug_clang/test/valgrind.3359.memcheck.xml
[Valgrind] Copying build/debug_clang/test/valgrind.33800.memcheck.xml to /var/lib/jenkins/jobs/SANS_Weekly/configurations/axis-builddir/debug_clang/axis-buildnode/reynolds/builds/244/valgrind-plugin/valgrind-results/build/debug_clang/test/valgrind.33800.memcheck.xml
[Valgrind] Copying build/debug_clang/test/valgrind.34839.memcheck.xml to /var/lib/jenkins/jobs/SANS_Weekly/configurations/axis-builddir/debug_clang/axis-buildnode/reynolds/builds/244/valgrind-plugin/valgrind-results/build/debug_clang/test/valgrind.34839.memcheck.xml
[Valgrind] Copying build/debug_clang/test/valgrind.35744.memcheck.xml to /var/lib/jenkins/jobs/SANS_Weekly/configurations/axis-builddir/debug_clang/axis-buildnode/reynolds/builds/244/valgrind-plugin/valgrind-results/build/debug_clang/test/valgrind.35744.memcheck.xml
[Valgrind] Copying build/debug_clang/test/valgrind.36076.memcheck.xml to /var/lib/jenkins/jobs/SANS_Weekly/configurations/axis-builddir/debug_clang/axis-buildnode/reynolds/builds/244/valgrind-plugin/valgrind-results/build/debug_clang/test/valgrind.36076.memcheck.xml
[Valgrind] Copying build/debug_clang/test/valgrind.36498.memcheck.xml to /var/lib/jenkins/jobs/SANS_Weekly/configurations/axis-builddir/debug_clang/axis-buildnode/reynolds/builds/244/valgrind-plugin/valgrind-results/build/debug_clang/test/valgrind.36498.memcheck.xml
[Valgrind] Copying build/debug_clang/test/valgrind.36655.memcheck.xml to /var/lib/jenkins/jobs/SANS_Weekly/configurations/axis-builddir/debug_clang/axis-buildnode/reynolds/builds/244/valgrind-plugin/valgrind-results/build/debug_clang/test/valgrind.36655.memcheck.xml
[Valgrind] Copying build/debug_clang/test/valgrind.36870.memcheck.xml to /var/lib/jenkins/jobs/SANS_Weekly/configurations/axis-builddir/debug_clang/axis-buildnode/reynolds/builds/244/valgrind-plugin/valgrind-results/build/debug_clang/test/valgrind.36870.memcheck.xml
[Valgrind] Copying build/debug_clang/test/valgrind.37123.memcheck.xml to /var/lib/jenkins/jobs/SANS_Weekly/configurations/axis-builddir/debug_clang/axis-buildnode/reynolds/builds/244/valgrind-plugin/valgrind-results/build/debug_clang/test/valgrind.37123.memcheck.xml
[Valgrind] Copying build/debug_clang/test/valgrind.37228.memcheck.xml to /var/lib/jenkins/jobs/SANS_Weekly/configurations/axis-builddir/debug_clang/axis-buildnode/reynolds/builds/244/valgrind-plugin/valgrind-results/build/debug_clang/test/valgrind.37228.memcheck.xml
[Valgrind] Copying build/debug_clang/test/valgrind.37441.memcheck.xml to /var/lib/jenkins/jobs/SANS_Weekly/configurations/axis-builddir/debug_clang/axis-buildnode/reynolds/builds/244/valgrind-plugin/valgrind-results/build/debug_clang/test/valgrind.37441.memcheck.xml
[Valgrind] Copying build/debug_clang/test/valgrind.37515.memcheck.xml to /var/lib/jenkins/jobs/SANS_Weekly/configurations/axis-builddir/debug_clang/axis-buildnode/reynolds/builds/244/valgrind-plugin/valgrind-results/build/debug_clang/test/valgrind.37515.memcheck.xml
[Valgrind] Copying build/debug_clang/test/valgrind.38174.memcheck.xml to /var/lib/jenkins/jobs/SANS_Weekly/configurations/axis-builddir/debug_clang/axis-buildnode/reynolds/builds/244/valgrind-plugin/valgrind-results/build/debug_clang/test/valgrind.38174.memcheck.xml
[Valgrind] Copying build/debug_clang/test/valgrind.3847.memcheck.xml to /var/lib/jenkins/jobs/SANS_Weekly/configurations/axis-builddir/debug_clang/axis-buildnode/reynolds/builds/244/valgrind-plugin/valgrind-results/build/debug_clang/test/valgrind.3847.memcheck.xml
[Valgrind] Copying build/debug_clang/test/valgrind.38529.memcheck.xml to /var/lib/jenkins/jobs/SANS_Weekly/configurations/axis-builddir/debug_clang/axis-buildnode/reynolds/builds/244/valgrind-plugin/valgrind-results/build/debug_clang/test/valgrind.38529.memcheck.xml
[Valgrind] Copying build/debug_clang/test/valgrind.38690.memcheck.xml to /var/lib/jenkins/jobs/SANS_Weekly/configurations/axis-builddir/debug_clang/axis-buildnode/reynolds/builds/244/valgrind-plugin/valgrind-results/build/debug_clang/test/valgrind.38690.memcheck.xml
[Valgrind] Copying build/debug_clang/test/valgrind.38880.memcheck.xml to /var/lib/jenkins/jobs/SANS_Weekly/configurations/axis-builddir/debug_clang/axis-buildnode/reynolds/builds/244/valgrind-plugin/valgrind-results/build/debug_clang/test/valgrind.38880.memcheck.xml
[Valgrind] Copying build/debug_clang/test/valgrind.39577.memcheck.xml to /var/lib/jenkins/jobs/SANS_Weekly/configurations/axis-builddir/debug_clang/axis-buildnode/reynolds/builds/244/valgrind-plugin/valgrind-results/build/debug_clang/test/valgrind.39577.memcheck.xml
[Valgrind] Copying build/debug_clang/test/valgrind.40125.memcheck.xml to /var/lib/jenkins/jobs/SANS_Weekly/configurations/axis-builddir/debug_clang/axis-buildnode/reynolds/builds/244/valgrind-plugin/valgrind-results/build/debug_clang/test/valgrind.40125.memcheck.xml
[Valgrind] Copying build/debug_clang/test/valgrind.40503.memcheck.xml to /var/lib/jenkins/jobs/SANS_Weekly/configurations/axis-builddir/debug_clang/axis-buildnode/reynolds/builds/244/valgrind-plugin/valgrind-results/build/debug_clang/test/valgrind.40503.memcheck.xml
[Valgrind] Copying build/debug_clang/test/valgrind.40515.memcheck.xml to /var/lib/jenkins/jobs/SANS_Weekly/configurations/axis-builddir/debug_clang/axis-buildnode/reynolds/builds/244/valgrind-plugin/valgrind-results/build/debug_clang/test/valgrind.40515.memcheck.xml
[Valgrind] Copying build/debug_clang/test/valgrind.40667.memcheck.xml to /var/lib/jenkins/jobs/SANS_Weekly/configurations/axis-builddir/debug_clang/axis-buildnode/reynolds/builds/244/valgrind-plugin/valgrind-results/build/debug_clang/test/valgrind.40667.memcheck.xml
[Valgrind] Copying build/debug_clang/test/valgrind.5283.memcheck.xml to /var/lib/jenkins/jobs/SANS_Weekly/configurations/axis-builddir/debug_clang/axis-buildnode/reynolds/builds/244/valgrind-plugin/valgrind-results/build/debug_clang/test/valgrind.5283.memcheck.xml
[Valgrind] Copying build/debug_clang/test/valgrind.5501.memcheck.xml to /var/lib/jenkins/jobs/SANS_Weekly/configurations/axis-builddir/debug_clang/axis-buildnode/reynolds/builds/244/valgrind-plugin/valgrind-results/build/debug_clang/test/valgrind.5501.memcheck.xml
[Valgrind] Copying build/debug_clang/test/valgrind.5587.memcheck.xml to /var/lib/jenkins/jobs/SANS_Weekly/configurations/axis-builddir/debug_clang/axis-buildnode/reynolds/builds/244/valgrind-plugin/valgrind-results/build/debug_clang/test/valgrind.5587.memcheck.xml
[Valgrind] Copying build/debug_clang/test/valgrind.5589.memcheck.xml to /var/lib/jenkins/jobs/SANS_Weekly/configurations/axis-builddir/debug_clang/axis-buildnode/reynolds/builds/244/valgrind-plugin/valgrind-results/build/debug_clang/test/valgrind.5589.memcheck.xml
[Valgrind] Copying build/debug_clang/test/valgrind.5727.memcheck.xml to /var/lib/jenkins/jobs/SANS_Weekly/configurations/axis-builddir/debug_clang/axis-buildnode/reynolds/builds/244/valgrind-plugin/valgrind-results/build/debug_clang/test/valgrind.5727.memcheck.xml
[Valgrind] Copying build/debug_clang/test/valgrind.6296.memcheck.xml to /var/lib/jenkins/jobs/SANS_Weekly/configurations/axis-builddir/debug_clang/axis-buildnode/reynolds/builds/244/valgrind-plugin/valgrind-results/build/debug_clang/test/valgrind.6296.memcheck.xml
[Valgrind] Copying build/debug_clang/test/valgrind.6764.memcheck.xml to /var/lib/jenkins/jobs/SANS_Weekly/configurations/axis-builddir/debug_clang/axis-buildnode/reynolds/builds/244/valgrind-plugin/valgrind-results/build/debug_clang/test/valgrind.6764.memcheck.xml
[Valgrind] Copying build/debug_clang/test/valgrind.6890.memcheck.xml to /var/lib/jenkins/jobs/SANS_Weekly/configurations/axis-builddir/debug_clang/axis-buildnode/reynolds/builds/244/valgrind-plugin/valgrind-results/build/debug_clang/test/valgrind.6890.memcheck.xml
[Valgrind] Copying build/debug_clang/test/valgrind.733.memcheck.xml to /var/lib/jenkins/jobs/SANS_Weekly/configurations/axis-builddir/debug_clang/axis-buildnode/reynolds/builds/244/valgrind-plugin/valgrind-results/build/debug_clang/test/valgrind.733.memcheck.xml
[Valgrind] Copying build/debug_clang/test/valgrind.7988.memcheck.xml to /var/lib/jenkins/jobs/SANS_Weekly/configurations/axis-builddir/debug_clang/axis-buildnode/reynolds/builds/244/valgrind-plugin/valgrind-results/build/debug_clang/test/valgrind.7988.memcheck.xml
[Valgrind] Copying build/debug_clang/test/valgrind.8158.memcheck.xml to /var/lib/jenkins/jobs/SANS_Weekly/configurations/axis-builddir/debug_clang/axis-buildnode/reynolds/builds/244/valgrind-plugin/valgrind-results/build/debug_clang/test/valgrind.8158.memcheck.xml
[Valgrind] Copying build/debug_clang/test/valgrind.8391.memcheck.xml to /var/lib/jenkins/jobs/SANS_Weekly/configurations/axis-builddir/debug_clang/axis-buildnode/reynolds/builds/244/valgrind-plugin/valgrind-results/build/debug_clang/test/valgrind.8391.memcheck.xml
[Valgrind] Copying build/debug_clang/test/valgrind.892.memcheck.xml to /var/lib/jenkins/jobs/SANS_Weekly/configurations/axis-builddir/debug_clang/axis-buildnode/reynolds/builds/244/valgrind-plugin/valgrind-results/build/debug_clang/test/valgrind.892.memcheck.xml
[Valgrind] Copying build/debug_clang/test/valgrind.9456.memcheck.xml to /var/lib/jenkins/jobs/SANS_Weekly/configurations/axis-builddir/debug_clang/axis-buildnode/reynolds/builds/244/valgrind-plugin/valgrind-results/build/debug_clang/test/valgrind.9456.memcheck.xml
[Valgrind] Copying build/debug_clang/test/valgrind.9879.memcheck.xml to /var/lib/jenkins/jobs/SANS_Weekly/configurations/axis-builddir/debug_clang/axis-buildnode/reynolds/builds/244/valgrind-plugin/valgrind-results/build/debug_clang/test/valgrind.9879.memcheck.xml
[Valgrind] Analysing valgrind results
[Valgrind] workspacePath: /jenkins/workspace/SANS_Weekly/builddir/debug_clang/buildnode/reynolds/
[Valgrind] Ending the valgrind analysis.
INFO: Starting to record.
INFO: Processing CTest-Version 3.x (default)
INFO: [CTest-Version 3.x (default)] - 1 test report file(s) were found with the pattern 'build/Test*.xml' relative to '/jenkins/workspace/SANS_Weekly/builddir/debug_clang/buildnode/reynolds' for the testing framework 'CTest-Version 3.x (default)'.
INFO: Check 'Failed Tests' threshold.
INFO: The total number of tests for the threshold 'Failed Tests' exceeds the specified "failure threshold" value.
INFO: Setting the build status to FAILURE
INFO: Stopping recording.
[PostBuildScript] - Executing post build scripts.
[PostBuildScript] - Build does not have any of the results []. Did not execute build step #0.
[WS-CLEANUP] Deleting project workspace...
[WS-CLEANUP] Deferred wipeout is used...
[WS-CLEANUP] done
Finished: FAILURE