Console Output

Skipping 297 KB.. Full Log
[ 94%] Checking style of src/pde/ShallowWater/PDEShallowWater2D.h
[ 94%] Checking style of src/pde/ShallowWater/ShallowWaterVariable2D.h
[ 94%] Checking style of src/pde/ShallowWater/ShallowWaterVariable1D.h
[ 94%] Checking style of src/pde/ShallowWater/ShallowWaterSolution2D_manifold.h
[ 94%] Checking style of src/pde/ShallowWater/OutputShallowWater2D_manifold.h
[ 94%] Checking style of src/pde/ShallowWater/PDEShallowWater2D_manifold.h
[ 94%] Checking style of src/pde/ShallowWater/OutputShallowWater2D.h
[ 94%] Checking style of src/pde/ShallowWater/VarInterp1D.h
[ 94%] Checking style of src/pde/ShallowWater/BCShallowWater2D_manifold.h
[ 94%] Checking style of src/pde/ShallowWater/ShallowWaterVariable2D_manifold.h
[ 94%] Checking style of src/pde/ShallowWater/OutputShallowWater1D.h
[ 94%] Checking style of src/pde/ShallowWater/VarInterp2D.h
[ 94%] Checking style of src/pde/ShallowWater/PDEShallowWater1D.h
[ 94%] Checking style of src/pde/ShallowWater/ShallowWaterSolution2D_manifold.cpp
[ 94%] Checking style of src/pde/ShallowWater/PDEShallowWater2D_manifold.cpp
[ 94%] Checking style of src/pde/ShallowWater/BCShallowWater2D_manifold.cpp
[ 94%] Checking style of src/pde/ShallowWater/ShallowWaterSolution1D.cpp
[ 94%] Checking style of src/pde/ShallowWater/BCShallowWater2D.cpp
[ 94%] Checking style of src/pde/ShallowWater/PDEShallowWater1D.cpp
[ 94%] Checking style of src/pde/ShallowWater/BCShallowWater1D.cpp
[ 94%] Checking style of src/pde/ShallowWater/ShallowWaterSolution2D.cpp
[ 94%] Checking style of src/pde/ShallowWater/PDEShallowWater2D.cpp
[ 94%] Built target ShallowWaterLib_vera
[ 94%] Generating CXX unity source src/pde/ShallowWater/cotire/ShallowWaterLib_CXX_unity.cxx
[ 94%] Generating CXX prefix source src/pde/ShallowWater/cotire/ShallowWaterLib_CXX_prefix.cxx
[ 94%] Generating CXX prefix header src/pde/ShallowWater/cotire/ShallowWaterLib_CXX_prefix.hxx
[ 94%] Building CXX precompiled header src/pde/ShallowWater/cotire/ShallowWaterLib_CXX_prefix.hxx.pch
Scanning dependencies of target ShallowWaterLib
[ 94%] Building CXX object src/pde/ShallowWater/CMakeFiles/ShallowWaterLib.dir/PDEShallowWater1D.cpp.o
[ 94%] Building CXX object src/pde/ShallowWater/CMakeFiles/ShallowWaterLib.dir/ShallowWaterSolution1D.cpp.o
[ 94%] Building CXX object src/pde/ShallowWater/CMakeFiles/ShallowWaterLib.dir/BCShallowWater1D.cpp.o
[ 94%] Building CXX object src/pde/ShallowWater/CMakeFiles/ShallowWaterLib.dir/PDEShallowWater2D.cpp.o
[ 94%] Building CXX object src/pde/ShallowWater/CMakeFiles/ShallowWaterLib.dir/ShallowWaterSolution2D.cpp.o
[ 94%] Building CXX object src/pde/ShallowWater/CMakeFiles/ShallowWaterLib.dir/BCShallowWater2D.cpp.o
[ 94%] Building CXX object src/pde/ShallowWater/CMakeFiles/ShallowWaterLib.dir/PDEShallowWater2D_manifold.cpp.o
[ 94%] Building CXX object src/pde/ShallowWater/CMakeFiles/ShallowWaterLib.dir/ShallowWaterSolution2D_manifold.cpp.o
[ 94%] Building CXX object src/pde/ShallowWater/CMakeFiles/ShallowWaterLib.dir/BCShallowWater2D_manifold.cpp.o
[ 94%] Linking CXX static library libShallowWaterLib.a
[ 94%] Built target ShallowWaterLib
Scanning dependencies of target Adjoint2D_HDG_Triangle_AD_mitState_btest_OBJECT
[ 94%] Building CXX object test/system/Asymptotic/CMakeFiles/Adjoint2D_HDG_Triangle_AD_mitState_btest_OBJECT.dir/Adjoint2D_HDG_Triangle_AD_mitState_btest.cpp.o
[ 94%] Built target Adjoint2D_HDG_Triangle_AD_mitState_btest_OBJECT
Scanning dependencies of target Adjoint2D_HDG_Triangle_AD_mitState_btest_build
[ 94%] Linking CXX executable Adjoint2D_HDG_Triangle_AD_mitState_btest
[ 94%] Built target Adjoint2D_HDG_Triangle_AD_mitState_btest_build
Scanning dependencies of target ErrorOrder_2D_CGStabilized_RANS_MMS_btest_OBJECT
[ 94%] Building CXX object test/system/Asymptotic/CMakeFiles/ErrorOrder_2D_CGStabilized_RANS_MMS_btest_OBJECT.dir/ErrorOrder_2D_CGStabilized_RANS_MMS_btest.cpp.o
[ 94%] Built target ErrorOrder_2D_CGStabilized_RANS_MMS_btest_OBJECT
Scanning dependencies of target ErrorOrder_2D_CGStabilized_RANS_MMS_btest_build_vera
[ 94%] Checking style of test/system/Asymptotic/ErrorOrder_2D_CGStabilized_RANS_MMS_btest.cpp
[ 94%] Built target ErrorOrder_2D_CGStabilized_RANS_MMS_btest_build_vera
Scanning dependencies of target ErrorOrder_2D_CGStabilized_RANS_MMS_btest_build
[ 94%] Linking CXX executable ErrorOrder_2D_CGStabilized_RANS_MMS_btest
[ 94%] Built target ErrorOrder_2D_CGStabilized_RANS_MMS_btest_build
Scanning dependencies of target ErrorOrder_2D_DGAdvective_Annulus_Quad_btest_OBJECT
[ 94%] Building CXX object test/system/Asymptotic/CMakeFiles/ErrorOrder_2D_DGAdvective_Annulus_Quad_btest_OBJECT.dir/ErrorOrder_2D_DGAdvective_Annulus_Quad_btest.cpp.o
[ 94%] Built target ErrorOrder_2D_DGAdvective_Annulus_Quad_btest_OBJECT
Scanning dependencies of target ErrorOrder_2D_DGAdvective_Annulus_Quad_btest_build_vera
[ 94%] Checking style of test/system/Asymptotic/ErrorOrder_2D_DGAdvective_Annulus_Quad_btest.cpp
[ 94%] Built target ErrorOrder_2D_DGAdvective_Annulus_Quad_btest_build_vera
Scanning dependencies of target ErrorOrder_2D_DGAdvective_Annulus_Quad_btest_build
[ 94%] Linking CXX executable ErrorOrder_2D_DGAdvective_Annulus_Quad_btest
[ 94%] Built target ErrorOrder_2D_DGAdvective_Annulus_Quad_btest_build
Scanning dependencies of target ErrorOrder_1D_DGBR2_AD_HB_btest_build_vera
[ 94%] Checking style of test/system/Asymptotic/ErrorOrder_1D_DGBR2_AD_HB_btest.cpp
[ 94%] Built target ErrorOrder_1D_DGBR2_AD_HB_btest_build_vera
Scanning dependencies of target ErrorOrder_1D_DGBR2_AD_HB_btest_OBJECT
[ 94%] Building CXX object test/system/Asymptotic/CMakeFiles/ErrorOrder_1D_DGBR2_AD_HB_btest_OBJECT.dir/ErrorOrder_1D_DGBR2_AD_HB_btest.cpp.o
[ 94%] Built target ErrorOrder_1D_DGBR2_AD_HB_btest_OBJECT
Scanning dependencies of target ErrorOrder_1D_DGBR2_AD_HB_btest_build
[ 94%] Linking CXX executable ErrorOrder_1D_DGBR2_AD_HB_btest
[ 94%] Built target ErrorOrder_1D_DGBR2_AD_HB_btest_build
Scanning dependencies of target ErrorOrder_1D_HDG_AD_BDF_btest_build_vera
[ 94%] Checking style of test/system/Asymptotic/ErrorOrder_1D_HDG_AD_BDF_btest.cpp
[ 94%] Built target ErrorOrder_1D_HDG_AD_BDF_btest_build_vera
Scanning dependencies of target ErrorOrder_1D_HDG_AD_BDF_btest_OBJECT
[ 94%] Building CXX object test/system/Asymptotic/CMakeFiles/ErrorOrder_1D_HDG_AD_BDF_btest_OBJECT.dir/ErrorOrder_1D_HDG_AD_BDF_btest.cpp.o
[ 94%] Built target ErrorOrder_1D_HDG_AD_BDF_btest_OBJECT
Scanning dependencies of target ErrorOrder_1D_HDG_AD_BDF_btest_build
[ 94%] Linking CXX executable ErrorOrder_1D_HDG_AD_BDF_btest
[ 94%] Built target ErrorOrder_1D_HDG_AD_BDF_btest_build
Scanning dependencies of target Adjoint2D_DGBR2_Triangle_AD_btest_build_vera
[ 94%] Checking style of test/system/Asymptotic/Adjoint2D_DGBR2_Triangle_AD_btest.cpp
[ 94%] Built target Adjoint2D_DGBR2_Triangle_AD_btest_build_vera
Scanning dependencies of target Adjoint2D_DGBR2_Triangle_AD_btest_OBJECT
[ 94%] Building CXX object test/system/Asymptotic/CMakeFiles/Adjoint2D_DGBR2_Triangle_AD_btest_OBJECT.dir/Adjoint2D_DGBR2_Triangle_AD_btest.cpp.o
[ 94%] Built target Adjoint2D_DGBR2_Triangle_AD_btest_OBJECT
Scanning dependencies of target Adjoint2D_DGBR2_Triangle_AD_btest_build
[ 94%] Linking CXX executable Adjoint2D_DGBR2_Triangle_AD_btest
[ 94%] Built target Adjoint2D_DGBR2_Triangle_AD_btest_build
Scanning dependencies of target ErrorOrder_1D_CG_AD_btest_build_vera
[ 94%] Checking style of test/system/Asymptotic/ErrorOrder_1D_CG_AD_btest.cpp
[ 94%] Built target ErrorOrder_1D_CG_AD_btest_build_vera
Scanning dependencies of target ErrorOrder_1D_CG_AD_btest_OBJECT
[ 94%] Building CXX object test/system/Asymptotic/CMakeFiles/ErrorOrder_1D_CG_AD_btest_OBJECT.dir/ErrorOrder_1D_CG_AD_btest.cpp.o
[ 94%] Built target ErrorOrder_1D_CG_AD_btest_OBJECT
Scanning dependencies of target ErrorOrder_1D_CG_AD_btest_build
[ 94%] Linking CXX executable ErrorOrder_1D_CG_AD_btest
[ 94%] Built target ErrorOrder_1D_CG_AD_btest_build
Scanning dependencies of target Adjoint2D_CG_Triangle_AD_btest_build_vera
[ 94%] Checking style of test/system/Asymptotic/Adjoint2D_CG_Triangle_AD_btest.cpp
[ 94%] Built target Adjoint2D_CG_Triangle_AD_btest_build_vera
Scanning dependencies of target Adjoint2D_CG_Triangle_AD_btest_OBJECT
[ 94%] Building CXX object test/system/Asymptotic/CMakeFiles/Adjoint2D_CG_Triangle_AD_btest_OBJECT.dir/Adjoint2D_CG_Triangle_AD_btest.cpp.o
[ 94%] Built target Adjoint2D_CG_Triangle_AD_btest_OBJECT
Scanning dependencies of target Adjoint2D_CG_Triangle_AD_btest_build
[ 94%] Linking CXX executable Adjoint2D_CG_Triangle_AD_btest
[ 94%] Built target Adjoint2D_CG_Triangle_AD_btest_build
Scanning dependencies of target ErrorOrder_2D_DGBR2_Triangle_AD_btest_OBJECT
[ 94%] Building CXX object test/system/Asymptotic/CMakeFiles/ErrorOrder_2D_DGBR2_Triangle_AD_btest_OBJECT.dir/ErrorOrder_2D_DGBR2_Triangle_AD_btest.cpp.o
[ 94%] Built target ErrorOrder_2D_DGBR2_Triangle_AD_btest_OBJECT
Scanning dependencies of target ErrorOrder_2D_DGBR2_Triangle_AD_btest_build_vera
[ 94%] Checking style of test/system/Asymptotic/ErrorOrder_2D_DGBR2_Triangle_AD_btest.cpp
[ 94%] Built target ErrorOrder_2D_DGBR2_Triangle_AD_btest_build_vera
Scanning dependencies of target ErrorOrder_2D_DGBR2_Triangle_AD_btest_build
[ 94%] Linking CXX executable ErrorOrder_2D_DGBR2_Triangle_AD_btest
[ 94%] Built target ErrorOrder_2D_DGBR2_Triangle_AD_btest_build
Scanning dependencies of target Adjoint2D_HDG_Triangle_AD_sansLG_btest_build_vera
[ 94%] Checking style of test/system/Asymptotic/Adjoint2D_HDG_Triangle_AD_sansLG_btest.cpp
[ 94%] Built target Adjoint2D_HDG_Triangle_AD_sansLG_btest_build_vera
Scanning dependencies of target Adjoint2D_HDG_Triangle_AD_sansLG_btest_OBJECT
[ 94%] Building CXX object test/system/Asymptotic/CMakeFiles/Adjoint2D_HDG_Triangle_AD_sansLG_btest_OBJECT.dir/Adjoint2D_HDG_Triangle_AD_sansLG_btest.cpp.o
[ 94%] Built target Adjoint2D_HDG_Triangle_AD_sansLG_btest_OBJECT
Scanning dependencies of target Adjoint2D_HDG_Triangle_AD_sansLG_btest_build
[ 94%] Linking CXX executable Adjoint2D_HDG_Triangle_AD_sansLG_btest
[ 94%] Built target Adjoint2D_HDG_Triangle_AD_sansLG_btest_build
Scanning dependencies of target ErrorEstimateOrder_2D_DGAdvective_Triangle_AD_btest_OBJECT
[ 94%] Building CXX object test/system/Asymptotic/CMakeFiles/ErrorEstimateOrder_2D_DGAdvective_Triangle_AD_btest_OBJECT.dir/ErrorEstimateOrder_2D_DGAdvective_Triangle_AD_btest.cpp.o
[ 94%] Built target ErrorEstimateOrder_2D_DGAdvective_Triangle_AD_btest_OBJECT
Scanning dependencies of target ErrorEstimateOrder_2D_DGAdvective_Triangle_AD_btest_build_vera
[ 94%] Checking style of test/system/Asymptotic/ErrorEstimateOrder_2D_DGAdvective_Triangle_AD_btest.cpp
[ 94%] Built target ErrorEstimateOrder_2D_DGAdvective_Triangle_AD_btest_build_vera
Scanning dependencies of target ErrorEstimateOrder_2D_DGAdvective_Triangle_AD_btest_build
[ 94%] Linking CXX executable ErrorEstimateOrder_2D_DGAdvective_Triangle_AD_btest
[ 94%] Built target ErrorEstimateOrder_2D_DGAdvective_Triangle_AD_btest_build
Scanning dependencies of target ErrorOrder_3D_DGBR2_Tet_AD_btest_OBJECT
[ 94%] Building CXX object test/system/Asymptotic/CMakeFiles/ErrorOrder_3D_DGBR2_Tet_AD_btest_OBJECT.dir/ErrorOrder_3D_DGBR2_Tet_AD_btest.cpp.o
[ 94%] Built target ErrorOrder_3D_DGBR2_Tet_AD_btest_OBJECT
Scanning dependencies of target ErrorOrder_3D_DGBR2_Tet_AD_btest_build_vera
[ 94%] Checking style of test/system/Asymptotic/ErrorOrder_3D_DGBR2_Tet_AD_btest.cpp
[ 94%] Built target ErrorOrder_3D_DGBR2_Tet_AD_btest_build_vera
Scanning dependencies of target ErrorOrder_3D_DGBR2_Tet_AD_btest_build
[ 94%] Linking CXX executable ErrorOrder_3D_DGBR2_Tet_AD_btest
[ 94%] Built target ErrorOrder_3D_DGBR2_Tet_AD_btest_build
Scanning dependencies of target ErrorOrder_3D_CG_Tet_AD_btest_build_vera
[ 94%] Checking style of test/system/Asymptotic/ErrorOrder_3D_CG_Tet_AD_btest.cpp
[ 94%] Built target ErrorOrder_3D_CG_Tet_AD_btest_build_vera
Scanning dependencies of target ErrorOrder_3D_CG_Tet_AD_btest_OBJECT
[ 94%] Building CXX object test/system/Asymptotic/CMakeFiles/ErrorOrder_3D_CG_Tet_AD_btest_OBJECT.dir/ErrorOrder_3D_CG_Tet_AD_btest.cpp.o
[ 94%] Built target ErrorOrder_3D_CG_Tet_AD_btest_OBJECT
Scanning dependencies of target ErrorOrder_3D_CG_Tet_AD_btest_build
[ 94%] Linking CXX executable ErrorOrder_3D_CG_Tet_AD_btest
[ 94%] Built target ErrorOrder_3D_CG_Tet_AD_btest_build
Scanning dependencies of target ErrorOrder_3D_DGBR2_Sphere_Triangle_AD_btest_build_vera
[ 94%] Checking style of test/system/Asymptotic/ErrorOrder_3D_DGBR2_Sphere_Triangle_AD_btest.cpp
[ 94%] Built target ErrorOrder_3D_DGBR2_Sphere_Triangle_AD_btest_build_vera
Scanning dependencies of target ErrorOrder_3D_DGBR2_Sphere_Triangle_AD_btest_OBJECT
[ 94%] Building CXX object test/system/Asymptotic/CMakeFiles/ErrorOrder_3D_DGBR2_Sphere_Triangle_AD_btest_OBJECT.dir/ErrorOrder_3D_DGBR2_Sphere_Triangle_AD_btest.cpp.o
[ 94%] Built target ErrorOrder_3D_DGBR2_Sphere_Triangle_AD_btest_OBJECT
Scanning dependencies of target ErrorOrder_3D_DGBR2_Sphere_Triangle_AD_btest_build
[ 94%] Linking CXX executable ErrorOrder_3D_DGBR2_Sphere_Triangle_AD_btest
[ 94%] Built target ErrorOrder_3D_DGBR2_Sphere_Triangle_AD_btest_build
Scanning dependencies of target ErrorOrder_1D_DGBR2_Burgers_btest_build_vera
[ 94%] Checking style of test/system/Asymptotic/ErrorOrder_1D_DGBR2_Burgers_btest.cpp
[ 94%] Built target ErrorOrder_1D_DGBR2_Burgers_btest_build_vera
Scanning dependencies of target ErrorOrder_1D_DGBR2_Burgers_btest_OBJECT
[ 94%] Building CXX object test/system/Asymptotic/CMakeFiles/ErrorOrder_1D_DGBR2_Burgers_btest_OBJECT.dir/ErrorOrder_1D_DGBR2_Burgers_btest.cpp.o
[ 94%] Built target ErrorOrder_1D_DGBR2_Burgers_btest_OBJECT
Scanning dependencies of target ErrorOrder_1D_DGBR2_Burgers_btest_build
[ 94%] Linking CXX executable ErrorOrder_1D_DGBR2_Burgers_btest
[ 94%] Built target ErrorOrder_1D_DGBR2_Burgers_btest_build
Scanning dependencies of target Solve2D_DGAdvective_LinearRobin_mitLG_sansLG_Consistency_AD_btest_build_vera
[ 94%] Checking style of test/system/Asymptotic/Solve2D_DGAdvective_LinearRobin_mitLG_sansLG_Consistency_AD_btest.cpp
[ 94%] Built target Solve2D_DGAdvective_LinearRobin_mitLG_sansLG_Consistency_AD_btest_build_vera
Scanning dependencies of target Solve2D_DGAdvective_LinearRobin_mitLG_sansLG_Consistency_AD_btest_OBJECT
[ 94%] Building CXX object test/system/Asymptotic/CMakeFiles/Solve2D_DGAdvective_LinearRobin_mitLG_sansLG_Consistency_AD_btest_OBJECT.dir/Solve2D_DGAdvective_LinearRobin_mitLG_sansLG_Consistency_AD_btest.cpp.o
[ 94%] Built target Solve2D_DGAdvective_LinearRobin_mitLG_sansLG_Consistency_AD_btest_OBJECT
Scanning dependencies of target Solve2D_DGAdvective_LinearRobin_mitLG_sansLG_Consistency_AD_btest_build
[ 94%] Linking CXX executable Solve2D_DGAdvective_LinearRobin_mitLG_sansLG_Consistency_AD_btest
[ 94%] Built target Solve2D_DGAdvective_LinearRobin_mitLG_sansLG_Consistency_AD_btest_build
Scanning dependencies of target Adjoint2D_DGAdvective_Triangle_AD_btest_build_vera
[ 94%] Checking style of test/system/Asymptotic/Adjoint2D_DGAdvective_Triangle_AD_btest.cpp
[ 94%] Built target Adjoint2D_DGAdvective_Triangle_AD_btest_build_vera
Scanning dependencies of target Adjoint2D_DGAdvective_Triangle_AD_btest_OBJECT
[ 94%] Building CXX object test/system/Asymptotic/CMakeFiles/Adjoint2D_DGAdvective_Triangle_AD_btest_OBJECT.dir/Adjoint2D_DGAdvective_Triangle_AD_btest.cpp.o
[ 94%] Built target Adjoint2D_DGAdvective_Triangle_AD_btest_OBJECT
Scanning dependencies of target Adjoint2D_DGAdvective_Triangle_AD_btest_build
[ 94%] Linking CXX executable Adjoint2D_DGAdvective_Triangle_AD_btest
[ 94%] Built target Adjoint2D_DGAdvective_Triangle_AD_btest_build
Scanning dependencies of target ErrorOrder_4D_DG_Pentatope_btest_OBJECT
[ 94%] Building CXX object test/system/Asymptotic/CMakeFiles/ErrorOrder_4D_DG_Pentatope_btest_OBJECT.dir/ErrorOrder_4D_DG_Pentatope_btest.cpp.o
[ 94%] Built target ErrorOrder_4D_DG_Pentatope_btest_OBJECT
Scanning dependencies of target ErrorOrder_4D_DG_Pentatope_btest_build_vera
[ 94%] Checking style of test/system/Asymptotic/ErrorOrder_4D_DG_Pentatope_btest.cpp
[ 94%] Built target ErrorOrder_4D_DG_Pentatope_btest_build_vera
Scanning dependencies of target ErrorOrder_4D_DG_Pentatope_btest_build
[ 94%] Linking CXX executable ErrorOrder_4D_DG_Pentatope_btest
[ 94%] Built target ErrorOrder_4D_DG_Pentatope_btest_build
Scanning dependencies of target ErrorOrder_1D_HDGAdvective_Advection_btest_build_vera
[ 94%] Checking style of test/system/Asymptotic/ErrorOrder_1D_HDGAdvective_Advection_btest.cpp
[ 94%] Built target ErrorOrder_1D_HDGAdvective_Advection_btest_build_vera
Scanning dependencies of target ErrorOrder_1D_HDGAdvective_Advection_btest_OBJECT
[ 94%] Building CXX object test/system/Asymptotic/CMakeFiles/ErrorOrder_1D_HDGAdvective_Advection_btest_OBJECT.dir/ErrorOrder_1D_HDGAdvective_Advection_btest.cpp.o
[ 94%] Built target ErrorOrder_1D_HDGAdvective_Advection_btest_OBJECT
Scanning dependencies of target ErrorOrder_1D_HDGAdvective_Advection_btest_build
[ 94%] Linking CXX executable ErrorOrder_1D_HDGAdvective_Advection_btest
[ 94%] Built target ErrorOrder_1D_HDGAdvective_Advection_btest_build
Scanning dependencies of target ErrorOrder_2D_EDG_Triangle_AD_btest_OBJECT
[ 94%] Building CXX object test/system/Asymptotic/CMakeFiles/ErrorOrder_2D_EDG_Triangle_AD_btest_OBJECT.dir/ErrorOrder_2D_EDG_Triangle_AD_btest.cpp.o
[ 94%] Built target ErrorOrder_2D_EDG_Triangle_AD_btest_OBJECT
Scanning dependencies of target ErrorOrder_2D_EDG_Triangle_AD_btest_build_vera
[ 94%] Checking style of test/system/Asymptotic/ErrorOrder_2D_EDG_Triangle_AD_btest.cpp
[ 94%] Built target ErrorOrder_2D_EDG_Triangle_AD_btest_build_vera
Scanning dependencies of target ErrorOrder_2D_EDG_Triangle_AD_btest_build
[ 94%] Linking CXX executable ErrorOrder_2D_EDG_Triangle_AD_btest
[ 94%] Built target ErrorOrder_2D_EDG_Triangle_AD_btest_build
Scanning dependencies of target ErrorEstimateOrder_1D_CG_Line_AD_btest_OBJECT
[ 94%] Building CXX object test/system/Asymptotic/CMakeFiles/ErrorEstimateOrder_1D_CG_Line_AD_btest_OBJECT.dir/ErrorEstimateOrder_1D_CG_Line_AD_btest.cpp.o
[ 94%] Built target ErrorEstimateOrder_1D_CG_Line_AD_btest_OBJECT
Scanning dependencies of target ErrorEstimateOrder_1D_CG_Line_AD_btest_build_vera
[ 94%] Checking style of test/system/Asymptotic/ErrorEstimateOrder_1D_CG_Line_AD_btest.cpp
[ 94%] Built target ErrorEstimateOrder_1D_CG_Line_AD_btest_build_vera
Scanning dependencies of target ErrorEstimateOrder_1D_CG_Line_AD_btest_build
[ 94%] Linking CXX executable ErrorEstimateOrder_1D_CG_Line_AD_btest
[ 94%] Built target ErrorEstimateOrder_1D_CG_Line_AD_btest_build
Scanning dependencies of target ErrorEstimateOrder_2D_HDG_Triangle_AD_btest_build_vera
[ 94%] Checking style of test/system/Asymptotic/ErrorEstimateOrder_2D_HDG_Triangle_AD_btest.cpp
[ 94%] Built target ErrorEstimateOrder_2D_HDG_Triangle_AD_btest_build_vera
Scanning dependencies of target ErrorEstimateOrder_2D_HDG_Triangle_AD_btest_OBJECT
[ 94%] Building CXX object test/system/Asymptotic/CMakeFiles/ErrorEstimateOrder_2D_HDG_Triangle_AD_btest_OBJECT.dir/ErrorEstimateOrder_2D_HDG_Triangle_AD_btest.cpp.o
[ 94%] Built target ErrorEstimateOrder_2D_HDG_Triangle_AD_btest_OBJECT
Scanning dependencies of target ErrorEstimateOrder_2D_HDG_Triangle_AD_btest_build
[ 94%] Linking CXX executable ErrorEstimateOrder_2D_HDG_Triangle_AD_btest
[ 94%] Built target ErrorEstimateOrder_2D_HDG_Triangle_AD_btest_build
Scanning dependencies of target ErrorOrder_1D_HDG_Burgers_btest_OBJECT
[ 94%] Building CXX object test/system/Asymptotic/CMakeFiles/ErrorOrder_1D_HDG_Burgers_btest_OBJECT.dir/ErrorOrder_1D_HDG_Burgers_btest.cpp.o
[ 94%] Built target ErrorOrder_1D_HDG_Burgers_btest_OBJECT
Scanning dependencies of target ErrorOrder_1D_HDG_Burgers_btest_build_vera
[ 94%] Checking style of test/system/Asymptotic/ErrorOrder_1D_HDG_Burgers_btest.cpp
[ 94%] Built target ErrorOrder_1D_HDG_Burgers_btest_build_vera
Scanning dependencies of target ErrorOrder_1D_HDG_Burgers_btest_build
[ 94%] Linking CXX executable ErrorOrder_1D_HDG_Burgers_btest
[ 94%] Built target ErrorOrder_1D_HDG_Burgers_btest_build
Scanning dependencies of target ErrorOrder_1D_DGBR2_TwoPhase_ST_btest_build_vera
[ 94%] Checking style of test/system/Asymptotic/ErrorOrder_1D_DGBR2_TwoPhase_ST_btest.cpp
[ 94%] Built target ErrorOrder_1D_DGBR2_TwoPhase_ST_btest_build_vera
Scanning dependencies of target ErrorOrder_1D_DGBR2_TwoPhase_ST_btest_OBJECT
[ 94%] Building CXX object test/system/Asymptotic/CMakeFiles/ErrorOrder_1D_DGBR2_TwoPhase_ST_btest_OBJECT.dir/ErrorOrder_1D_DGBR2_TwoPhase_ST_btest.cpp.o
[ 94%] Built target ErrorOrder_1D_DGBR2_TwoPhase_ST_btest_OBJECT
Scanning dependencies of target ErrorOrder_1D_DGBR2_TwoPhase_ST_btest_build
[ 94%] Linking CXX executable ErrorOrder_1D_DGBR2_TwoPhase_ST_btest
[ 94%] Built target ErrorOrder_1D_DGBR2_TwoPhase_ST_btest_build
Scanning dependencies of target Adjoint1D_DGBR2_BuckleyLeverett_ST_btest_build_vera
[ 94%] Checking style of test/system/Asymptotic/Adjoint1D_DGBR2_BuckleyLeverett_ST_btest.cpp
[ 94%] Built target Adjoint1D_DGBR2_BuckleyLeverett_ST_btest_build_vera
Scanning dependencies of target Adjoint1D_DGBR2_BuckleyLeverett_ST_btest_OBJECT
[ 94%] Building CXX object test/system/Asymptotic/CMakeFiles/Adjoint1D_DGBR2_BuckleyLeverett_ST_btest_OBJECT.dir/Adjoint1D_DGBR2_BuckleyLeverett_ST_btest.cpp.o
[ 94%] Built target Adjoint1D_DGBR2_BuckleyLeverett_ST_btest_OBJECT
Scanning dependencies of target Adjoint1D_DGBR2_BuckleyLeverett_ST_btest_build
[ 94%] Linking CXX executable Adjoint1D_DGBR2_BuckleyLeverett_ST_btest
[ 94%] Built target Adjoint1D_DGBR2_BuckleyLeverett_ST_btest_build
Scanning dependencies of target ErrorOrder_3D_CG_Sphere_Triangle_AD_btest_build_vera
[ 94%] Checking style of test/system/Asymptotic/ErrorOrder_3D_CG_Sphere_Triangle_AD_btest.cpp
[ 94%] Built target ErrorOrder_3D_CG_Sphere_Triangle_AD_btest_build_vera
Scanning dependencies of target ErrorOrder_3D_CG_Sphere_Triangle_AD_btest_OBJECT
[ 94%] Building CXX object test/system/Asymptotic/CMakeFiles/ErrorOrder_3D_CG_Sphere_Triangle_AD_btest_OBJECT.dir/ErrorOrder_3D_CG_Sphere_Triangle_AD_btest.cpp.o
[ 94%] Built target ErrorOrder_3D_CG_Sphere_Triangle_AD_btest_OBJECT
Scanning dependencies of target ErrorOrder_3D_CG_Sphere_Triangle_AD_btest_build
[ 94%] Linking CXX executable ErrorOrder_3D_CG_Sphere_Triangle_AD_btest
[ 94%] Built target ErrorOrder_3D_CG_Sphere_Triangle_AD_btest_build
Scanning dependencies of target ErrorOrder_1D_HDG_AD_btest_build_vera
[ 94%] Checking style of test/system/Asymptotic/ErrorOrder_1D_HDG_AD_btest.cpp
[ 94%] Built target ErrorOrder_1D_HDG_AD_btest_build_vera
Scanning dependencies of target ErrorOrder_1D_HDG_AD_btest_OBJECT
[ 94%] Building CXX object test/system/Asymptotic/CMakeFiles/ErrorOrder_1D_HDG_AD_btest_OBJECT.dir/ErrorOrder_1D_HDG_AD_btest.cpp.o
[ 94%] Built target ErrorOrder_1D_HDG_AD_btest_OBJECT
Scanning dependencies of target ErrorOrder_1D_HDG_AD_btest_build
[ 94%] Linking CXX executable ErrorOrder_1D_HDG_AD_btest
[ 94%] Built target ErrorOrder_1D_HDG_AD_btest_build
Scanning dependencies of target ErrorOrder_1D_DGBR2_AD_BDF_btest_build_vera
[ 94%] Checking style of test/system/Asymptotic/ErrorOrder_1D_DGBR2_AD_BDF_btest.cpp
[ 94%] Built target ErrorOrder_1D_DGBR2_AD_BDF_btest_build_vera
Scanning dependencies of target ErrorOrder_1D_DGBR2_AD_BDF_btest_OBJECT
[ 94%] Building CXX object test/system/Asymptotic/CMakeFiles/ErrorOrder_1D_DGBR2_AD_BDF_btest_OBJECT.dir/ErrorOrder_1D_DGBR2_AD_BDF_btest.cpp.o
[ 94%] Built target ErrorOrder_1D_DGBR2_AD_BDF_btest_OBJECT
Scanning dependencies of target ErrorOrder_1D_DGBR2_AD_BDF_btest_build
[ 94%] Linking CXX executable ErrorOrder_1D_DGBR2_AD_BDF_btest
[ 94%] Built target ErrorOrder_1D_DGBR2_AD_BDF_btest_build
Scanning dependencies of target ErrorOrder_3D_DGBR2_Periodic_Hex_AD_btest_build_vera
[ 94%] Checking style of test/system/Asymptotic/ErrorOrder_3D_DGBR2_Periodic_Hex_AD_btest.cpp
[ 94%] Built target ErrorOrder_3D_DGBR2_Periodic_Hex_AD_btest_build_vera
Scanning dependencies of target ErrorOrder_3D_DGBR2_Periodic_Hex_AD_btest_OBJECT
[ 94%] Building CXX object test/system/Asymptotic/CMakeFiles/ErrorOrder_3D_DGBR2_Periodic_Hex_AD_btest_OBJECT.dir/ErrorOrder_3D_DGBR2_Periodic_Hex_AD_btest.cpp.o
[ 94%] Built target ErrorOrder_3D_DGBR2_Periodic_Hex_AD_btest_OBJECT
Scanning dependencies of target ErrorOrder_3D_DGBR2_Periodic_Hex_AD_btest_build
[ 94%] Linking CXX executable ErrorOrder_3D_DGBR2_Periodic_Hex_AD_btest
[ 94%] Built target ErrorOrder_3D_DGBR2_Periodic_Hex_AD_btest_build
Scanning dependencies of target ErrorEstimateOrder_2D_CG_Triangle_AD_btest_OBJECT
[ 94%] Building CXX object test/system/Asymptotic/CMakeFiles/ErrorEstimateOrder_2D_CG_Triangle_AD_btest_OBJECT.dir/ErrorEstimateOrder_2D_CG_Triangle_AD_btest.cpp.o
[ 94%] Built target ErrorEstimateOrder_2D_CG_Triangle_AD_btest_OBJECT
Scanning dependencies of target ErrorEstimateOrder_2D_CG_Triangle_AD_btest_build_vera
[ 94%] Checking style of test/system/Asymptotic/ErrorEstimateOrder_2D_CG_Triangle_AD_btest.cpp
[ 94%] Built target ErrorEstimateOrder_2D_CG_Triangle_AD_btest_build_vera
Scanning dependencies of target ErrorEstimateOrder_2D_CG_Triangle_AD_btest_build
[ 94%] Linking CXX executable ErrorEstimateOrder_2D_CG_Triangle_AD_btest
[ 94%] Built target ErrorEstimateOrder_2D_CG_Triangle_AD_btest_build
Scanning dependencies of target ErrorOrder_1D_CG_AD_BDF_btest_OBJECT
[ 94%] Building CXX object test/system/Asymptotic/CMakeFiles/ErrorOrder_1D_CG_AD_BDF_btest_OBJECT.dir/ErrorOrder_1D_CG_AD_BDF_btest.cpp.o
[ 94%] Built target ErrorOrder_1D_CG_AD_BDF_btest_OBJECT
Scanning dependencies of target ErrorOrder_1D_CG_AD_BDF_btest_build_vera
[ 94%] Checking style of test/system/Asymptotic/ErrorOrder_1D_CG_AD_BDF_btest.cpp
[ 94%] Built target ErrorOrder_1D_CG_AD_BDF_btest_build_vera
Scanning dependencies of target ErrorOrder_1D_CG_AD_BDF_btest_build
[ 94%] Linking CXX executable ErrorOrder_1D_CG_AD_BDF_btest
[ 94%] Built target ErrorOrder_1D_CG_AD_BDF_btest_build
Scanning dependencies of target ErrorOrder_2D_DGBR2_RANS_MMS_btest_OBJECT
[ 94%] Building CXX object test/system/Asymptotic/CMakeFiles/ErrorOrder_2D_DGBR2_RANS_MMS_btest_OBJECT.dir/ErrorOrder_2D_DGBR2_RANS_MMS_btest.cpp.o
[ 94%] Built target ErrorOrder_2D_DGBR2_RANS_MMS_btest_OBJECT
Scanning dependencies of target ErrorOrder_2D_DGBR2_RANS_MMS_btest_build_vera
[ 94%] Checking style of test/system/Asymptotic/ErrorOrder_2D_DGBR2_RANS_MMS_btest.cpp
[ 94%] Built target ErrorOrder_2D_DGBR2_RANS_MMS_btest_build_vera
Scanning dependencies of target ErrorOrder_2D_DGBR2_RANS_MMS_btest_build
[ 94%] Linking CXX executable ErrorOrder_2D_DGBR2_RANS_MMS_btest
[ 94%] Built target ErrorOrder_2D_DGBR2_RANS_MMS_btest_build
Scanning dependencies of target ErrorEstimateOrder_1D_DGBR2_Line_AD_btest_OBJECT
[ 94%] Building CXX object test/system/Asymptotic/CMakeFiles/ErrorEstimateOrder_1D_DGBR2_Line_AD_btest_OBJECT.dir/ErrorEstimateOrder_1D_DGBR2_Line_AD_btest.cpp.o
[ 94%] Built target ErrorEstimateOrder_1D_DGBR2_Line_AD_btest_OBJECT
Scanning dependencies of target ErrorEstimateOrder_1D_DGBR2_Line_AD_btest_build_vera
[ 94%] Checking style of test/system/Asymptotic/ErrorEstimateOrder_1D_DGBR2_Line_AD_btest.cpp
[ 94%] Built target ErrorEstimateOrder_1D_DGBR2_Line_AD_btest_build_vera
Scanning dependencies of target ErrorEstimateOrder_1D_DGBR2_Line_AD_btest_build
[ 94%] Linking CXX executable ErrorEstimateOrder_1D_DGBR2_Line_AD_btest
[ 94%] Built target ErrorEstimateOrder_1D_DGBR2_Line_AD_btest_build
Scanning dependencies of target ErrorOrder_3D_CG_Hex_AD_btest_OBJECT
[ 94%] Building CXX object test/system/Asymptotic/CMakeFiles/ErrorOrder_3D_CG_Hex_AD_btest_OBJECT.dir/ErrorOrder_3D_CG_Hex_AD_btest.cpp.o
[ 94%] Built target ErrorOrder_3D_CG_Hex_AD_btest_OBJECT
Scanning dependencies of target ErrorOrder_3D_CG_Hex_AD_btest_build_vera
[ 94%] Checking style of test/system/Asymptotic/ErrorOrder_3D_CG_Hex_AD_btest.cpp
[ 94%] Built target ErrorOrder_3D_CG_Hex_AD_btest_build_vera
Scanning dependencies of target ErrorOrder_3D_CG_Hex_AD_btest_build
[ 94%] Linking CXX executable ErrorOrder_3D_CG_Hex_AD_btest
[ 94%] Built target ErrorOrder_3D_CG_Hex_AD_btest_build
Scanning dependencies of target ErrorEstimateOrder_2D_CG_Nodal_Triangle_AD_btest_OBJECT
[ 94%] Building CXX object test/system/Asymptotic/CMakeFiles/ErrorEstimateOrder_2D_CG_Nodal_Triangle_AD_btest_OBJECT.dir/ErrorEstimateOrder_2D_CG_Nodal_Triangle_AD_btest.cpp.o
[ 94%] Built target ErrorEstimateOrder_2D_CG_Nodal_Triangle_AD_btest_OBJECT
Scanning dependencies of target ErrorEstimateOrder_2D_CG_Nodal_Triangle_AD_btest_build_vera
[ 94%] Checking style of test/system/Asymptotic/ErrorEstimateOrder_2D_CG_Nodal_Triangle_AD_btest.cpp
[ 94%] Built target ErrorEstimateOrder_2D_CG_Nodal_Triangle_AD_btest_build_vera
Scanning dependencies of target ErrorEstimateOrder_2D_CG_Nodal_Triangle_AD_btest_build
[ 94%] Linking CXX executable ErrorEstimateOrder_2D_CG_Nodal_Triangle_AD_btest
[ 94%] Built target ErrorEstimateOrder_2D_CG_Nodal_Triangle_AD_btest_build
Scanning dependencies of target ErrorOrder_2D_DGAdvective_Flat_Line_AD_btest_OBJECT
[ 94%] Building CXX object test/system/Asymptotic/CMakeFiles/ErrorOrder_2D_DGAdvective_Flat_Line_AD_btest_OBJECT.dir/ErrorOrder_2D_DGAdvective_Flat_Line_AD_btest.cpp.o
[ 94%] Built target ErrorOrder_2D_DGAdvective_Flat_Line_AD_btest_OBJECT
Scanning dependencies of target ErrorOrder_2D_DGAdvective_Flat_Line_AD_btest_build_vera
[ 94%] Checking style of test/system/Asymptotic/ErrorOrder_2D_DGAdvective_Flat_Line_AD_btest.cpp
[ 94%] Built target ErrorOrder_2D_DGAdvective_Flat_Line_AD_btest_build_vera
Scanning dependencies of target ErrorOrder_2D_DGAdvective_Flat_Line_AD_btest_build
[ 94%] Linking CXX executable ErrorOrder_2D_DGAdvective_Flat_Line_AD_btest
[ 94%] Built target ErrorOrder_2D_DGAdvective_Flat_Line_AD_btest_build
Scanning dependencies of target ErrorOrder_1D_DGBR2_AD_btest_OBJECT
[ 94%] Building CXX object test/system/Asymptotic/CMakeFiles/ErrorOrder_1D_DGBR2_AD_btest_OBJECT.dir/ErrorOrder_1D_DGBR2_AD_btest.cpp.o
[ 94%] Built target ErrorOrder_1D_DGBR2_AD_btest_OBJECT
Scanning dependencies of target ErrorOrder_1D_DGBR2_AD_btest_build_vera
[ 94%] Checking style of test/system/Asymptotic/ErrorOrder_1D_DGBR2_AD_btest.cpp
[ 94%] Built target ErrorOrder_1D_DGBR2_AD_btest_build_vera
Scanning dependencies of target ErrorOrder_1D_DGBR2_AD_btest_build
[ 94%] Linking CXX executable ErrorOrder_1D_DGBR2_AD_btest
[ 94%] Built target ErrorOrder_1D_DGBR2_AD_btest_build
Scanning dependencies of target ErrorOrder_2D_HDG_Triangle_AD_btest_build_vera
[ 94%] Checking style of test/system/Asymptotic/ErrorOrder_2D_HDG_Triangle_AD_btest.cpp
[ 94%] Built target ErrorOrder_2D_HDG_Triangle_AD_btest_build_vera
Scanning dependencies of target ErrorOrder_2D_HDG_Triangle_AD_btest_OBJECT
[ 94%] Building CXX object test/system/Asymptotic/CMakeFiles/ErrorOrder_2D_HDG_Triangle_AD_btest_OBJECT.dir/ErrorOrder_2D_HDG_Triangle_AD_btest.cpp.o
[ 94%] Built target ErrorOrder_2D_HDG_Triangle_AD_btest_OBJECT
Scanning dependencies of target ErrorOrder_2D_HDG_Triangle_AD_btest_build
[ 94%] Linking CXX executable ErrorOrder_2D_HDG_Triangle_AD_btest
[ 94%] Built target ErrorOrder_2D_HDG_Triangle_AD_btest_build
Scanning dependencies of target ErrorOrder_2D_DGAdvective_Annulus_Triangle_btest_OBJECT
[ 94%] Building CXX object test/system/Asymptotic/CMakeFiles/ErrorOrder_2D_DGAdvective_Annulus_Triangle_btest_OBJECT.dir/ErrorOrder_2D_DGAdvective_Annulus_Triangle_btest.cpp.o
[ 94%] Built target ErrorOrder_2D_DGAdvective_Annulus_Triangle_btest_OBJECT
Scanning dependencies of target ErrorOrder_2D_DGAdvective_Annulus_Triangle_btest_build_vera
[ 94%] Checking style of test/system/Asymptotic/ErrorOrder_2D_DGAdvective_Annulus_Triangle_btest.cpp
[ 94%] Built target ErrorOrder_2D_DGAdvective_Annulus_Triangle_btest_build_vera
Scanning dependencies of target ErrorOrder_2D_DGAdvective_Annulus_Triangle_btest_build
[ 94%] Linking CXX executable ErrorOrder_2D_DGAdvective_Annulus_Triangle_btest
[ 94%] Built target ErrorOrder_2D_DGAdvective_Annulus_Triangle_btest_build
Scanning dependencies of target ErrorOrder_2D_DGAdvective_Circle_Line_AD_btest_OBJECT
[ 94%] Building CXX object test/system/Asymptotic/CMakeFiles/ErrorOrder_2D_DGAdvective_Circle_Line_AD_btest_OBJECT.dir/ErrorOrder_2D_DGAdvective_Circle_Line_AD_btest.cpp.o
[ 94%] Built target ErrorOrder_2D_DGAdvective_Circle_Line_AD_btest_OBJECT
Scanning dependencies of target ErrorOrder_2D_DGAdvective_Circle_Line_AD_btest_build_vera
[ 94%] Checking style of test/system/Asymptotic/ErrorOrder_2D_DGAdvective_Circle_Line_AD_btest.cpp
[ 94%] Built target ErrorOrder_2D_DGAdvective_Circle_Line_AD_btest_build_vera
Scanning dependencies of target ErrorOrder_2D_DGAdvective_Circle_Line_AD_btest_build
[ 94%] Linking CXX executable ErrorOrder_2D_DGAdvective_Circle_Line_AD_btest
[ 94%] Built target ErrorOrder_2D_DGAdvective_Circle_Line_AD_btest_build
Scanning dependencies of target ErrorEstimateOrder_2D_CG_Triangle_RD_btest_OBJECT
[ 94%] Building CXX object test/system/Asymptotic/CMakeFiles/ErrorEstimateOrder_2D_CG_Triangle_RD_btest_OBJECT.dir/ErrorEstimateOrder_2D_CG_Triangle_RD_btest.cpp.o
[ 94%] Built target ErrorEstimateOrder_2D_CG_Triangle_RD_btest_OBJECT
Scanning dependencies of target ErrorEstimateOrder_2D_CG_Triangle_RD_btest_build_vera
[ 94%] Checking style of test/system/Asymptotic/ErrorEstimateOrder_2D_CG_Triangle_RD_btest.cpp
[ 94%] Built target ErrorEstimateOrder_2D_CG_Triangle_RD_btest_build_vera
Scanning dependencies of target ErrorEstimateOrder_2D_CG_Triangle_RD_btest_build
[ 94%] Linking CXX executable ErrorEstimateOrder_2D_CG_Triangle_RD_btest
[ 94%] Built target ErrorEstimateOrder_2D_CG_Triangle_RD_btest_build
Scanning dependencies of target ErrorOrder_2D_CG_Triangle_AD_btest_OBJECT
[ 94%] Building CXX object test/system/Asymptotic/CMakeFiles/ErrorOrder_2D_CG_Triangle_AD_btest_OBJECT.dir/ErrorOrder_2D_CG_Triangle_AD_btest.cpp.o
[ 94%] Built target ErrorOrder_2D_CG_Triangle_AD_btest_OBJECT
Scanning dependencies of target ErrorOrder_2D_CG_Triangle_AD_btest_build_vera
[ 94%] Checking style of test/system/Asymptotic/ErrorOrder_2D_CG_Triangle_AD_btest.cpp
[ 94%] Built target ErrorOrder_2D_CG_Triangle_AD_btest_build_vera
Scanning dependencies of target ErrorOrder_2D_CG_Triangle_AD_btest_build
[ 94%] Linking CXX executable ErrorOrder_2D_CG_Triangle_AD_btest
[ 94%] Built target ErrorOrder_2D_CG_Triangle_AD_btest_build
Scanning dependencies of target ErrorOrder_1D_DGBR2_BuckleyLeverett_ST_btest_build_vera
[ 94%] Checking style of test/system/Asymptotic/ErrorOrder_1D_DGBR2_BuckleyLeverett_ST_btest.cpp
[ 94%] Built target ErrorOrder_1D_DGBR2_BuckleyLeverett_ST_btest_build_vera
Scanning dependencies of target ErrorOrder_1D_DGBR2_BuckleyLeverett_ST_btest_OBJECT
[ 94%] Building CXX object test/system/Asymptotic/CMakeFiles/ErrorOrder_1D_DGBR2_BuckleyLeverett_ST_btest_OBJECT.dir/ErrorOrder_1D_DGBR2_BuckleyLeverett_ST_btest.cpp.o
[ 94%] Built target ErrorOrder_1D_DGBR2_BuckleyLeverett_ST_btest_OBJECT
Scanning dependencies of target ErrorOrder_1D_DGBR2_BuckleyLeverett_ST_btest_build
[ 94%] Linking CXX executable ErrorOrder_1D_DGBR2_BuckleyLeverett_ST_btest
[ 94%] Built target ErrorOrder_1D_DGBR2_BuckleyLeverett_ST_btest_build
Scanning dependencies of target ErrorOrder_2D_CG_Quad_AD_btest_build_vera
[ 94%] Checking style of test/system/Asymptotic/ErrorOrder_2D_CG_Quad_AD_btest.cpp
[ 94%] Built target ErrorOrder_2D_CG_Quad_AD_btest_build_vera
Scanning dependencies of target ErrorOrder_2D_CG_Quad_AD_btest_OBJECT
[ 94%] Building CXX object test/system/Asymptotic/CMakeFiles/ErrorOrder_2D_CG_Quad_AD_btest_OBJECT.dir/ErrorOrder_2D_CG_Quad_AD_btest.cpp.o
[ 94%] Built target ErrorOrder_2D_CG_Quad_AD_btest_OBJECT
Scanning dependencies of target ErrorOrder_2D_CG_Quad_AD_btest_build
[ 94%] Linking CXX executable ErrorOrder_2D_CG_Quad_AD_btest
[ 94%] Built target ErrorOrder_2D_CG_Quad_AD_btest_build
Scanning dependencies of target ErrorEstimateOrder_2D_DGBR2_Triangle_AD_btest_OBJECT
[ 94%] Building CXX object test/system/Asymptotic/CMakeFiles/ErrorEstimateOrder_2D_DGBR2_Triangle_AD_btest_OBJECT.dir/ErrorEstimateOrder_2D_DGBR2_Triangle_AD_btest.cpp.o
[ 94%] Built target ErrorEstimateOrder_2D_DGBR2_Triangle_AD_btest_OBJECT
Scanning dependencies of target ErrorEstimateOrder_2D_DGBR2_Triangle_AD_btest_build_vera
[ 94%] Checking style of test/system/Asymptotic/ErrorEstimateOrder_2D_DGBR2_Triangle_AD_btest.cpp
[ 94%] Built target ErrorEstimateOrder_2D_DGBR2_Triangle_AD_btest_build_vera
Scanning dependencies of target ErrorEstimateOrder_2D_DGBR2_Triangle_AD_btest_build
[ 94%] Linking CXX executable ErrorEstimateOrder_2D_DGBR2_Triangle_AD_btest
[ 94%] Built target ErrorEstimateOrder_2D_DGBR2_Triangle_AD_btest_build
Scanning dependencies of target ErrorOrder_2D_DGAdvective_Circle_Line_ShallowWater_btest_build_vera
[ 94%] Checking style of test/system/Asymptotic/ErrorOrder_2D_DGAdvective_Circle_Line_ShallowWater_btest.cpp
[ 94%] Built target ErrorOrder_2D_DGAdvective_Circle_Line_ShallowWater_btest_build_vera
Scanning dependencies of target ErrorOrder_2D_DGAdvective_Circle_Line_ShallowWater_btest_OBJECT
[ 94%] Building CXX object test/system/Asymptotic/CMakeFiles/ErrorOrder_2D_DGAdvective_Circle_Line_ShallowWater_btest_OBJECT.dir/ErrorOrder_2D_DGAdvective_Circle_Line_ShallowWater_btest.cpp.o
[ 94%] Built target ErrorOrder_2D_DGAdvective_Circle_Line_ShallowWater_btest_OBJECT
Scanning dependencies of target ErrorOrder_2D_DGAdvective_Circle_Line_ShallowWater_btest_build
[ 94%] Linking CXX executable ErrorOrder_2D_DGAdvective_Circle_Line_ShallowWater_btest
[ 94%] Built target ErrorOrder_2D_DGAdvective_Circle_Line_ShallowWater_btest_build
Scanning dependencies of target ErrorOrder_1D_DGAdvective_ShallowWater_btest_build_vera
[ 94%] Checking style of test/system/Asymptotic/ErrorOrder_1D_DGAdvective_ShallowWater_btest.cpp
[ 94%] Built target ErrorOrder_1D_DGAdvective_ShallowWater_btest_build_vera
Scanning dependencies of target ErrorOrder_1D_DGAdvective_ShallowWater_btest_OBJECT
[ 94%] Building CXX object test/system/Asymptotic/CMakeFiles/ErrorOrder_1D_DGAdvective_ShallowWater_btest_OBJECT.dir/ErrorOrder_1D_DGAdvective_ShallowWater_btest.cpp.o
[ 94%] Built target ErrorOrder_1D_DGAdvective_ShallowWater_btest_OBJECT
Scanning dependencies of target ErrorOrder_1D_DGAdvective_ShallowWater_btest_build
[ 94%] Linking CXX executable ErrorOrder_1D_DGAdvective_ShallowWater_btest
[ 94%] Built target ErrorOrder_1D_DGAdvective_ShallowWater_btest_build
Scanning dependencies of target LocalSolve1D_Split_HDG_AD_btest_OBJECT
[ 94%] Building CXX object test/system/LocalSolve/CMakeFiles/LocalSolve1D_Split_HDG_AD_btest_OBJECT.dir/LocalSolve1D_Split_HDG_AD_btest.cpp.o
[ 94%] Built target LocalSolve1D_Split_HDG_AD_btest_OBJECT
[ 94%] Generating CXX unity source src/Discretization/cotire/BlockLib_CXX_unity.cxx
[ 94%] Generating CXX prefix source src/Discretization/cotire/BlockLib_CXX_prefix.cxx
[ 94%] Generating CXX prefix header src/Discretization/cotire/BlockLib_CXX_prefix.hxx
[ 94%] Building CXX precompiled header src/Discretization/cotire/BlockLib_CXX_prefix.hxx.pch
Scanning dependencies of target BlockLib
[ 94%] Building CXX object src/Discretization/CMakeFiles/BlockLib.dir/Block/AlgebraicEquationSet_Block2x2_Real_Real.cpp.o
[ 94%] Building CXX object src/Discretization/CMakeFiles/BlockLib.dir/Block/AlgebraicEquationSet_Block2x2_VecS3_Real.cpp.o
[ 94%] Building CXX object src/Discretization/CMakeFiles/BlockLib.dir/Block/AlgebraicEquationSet_Block2x2_VecS4_Real.cpp.o
[ 94%] Linking CXX static library libBlockLib.a
[ 94%] Built target BlockLib
Scanning dependencies of target BlockLinAlgLib_vera
[ 94%] Checking style of src/LinearAlgebra/BlockLinAlg/MatrixBlock_3x3.h
[ 94%] Checking style of src/LinearAlgebra/BlockLinAlg/MatrixBlock_2x2.h
[ 94%] Checking style of src/LinearAlgebra/BlockLinAlg/MatrixBlock_2x2_InverseLU.h
[ 94%] Checking style of src/LinearAlgebra/BlockLinAlg/MatrixBlock_2x2_Inverse.h
[ 94%] Checking style of src/LinearAlgebra/BlockLinAlg/BlockLinAlg_Type.h
[ 94%] Checking style of src/LinearAlgebra/BlockLinAlg/MatrixBlock_2x2_Decompose_LU.h
[ 94%] Checking style of src/LinearAlgebra/BlockLinAlg/VectorBlock_4.h
[ 94%] Checking style of src/LinearAlgebra/BlockLinAlg/MatrixBlock_2x2_Transpose.h
[ 94%] Checking style of src/LinearAlgebra/BlockLinAlg/MatrixBlock_2x2_InverseLUP.h
[ 94%] Checking style of src/LinearAlgebra/BlockLinAlg/MatrixBlock_4x4.h
[ 94%] Checking style of src/LinearAlgebra/BlockLinAlg/BlockLinAlg_Add.h
[ 94%] Checking style of src/LinearAlgebra/BlockLinAlg/BlockLinAlg_Mul.h
[ 94%] Checking style of src/LinearAlgebra/BlockLinAlg/MatrixBlock_2x2_Decompose_LUP.h
[ 94%] Checking style of src/LinearAlgebra/BlockLinAlg/VectorBlock_3.h
[ 94%] Checking style of src/LinearAlgebra/BlockLinAlg/VectorBlock_2.h
[ 94%] Checking style of src/LinearAlgebra/BlockLinAlg/MatrixBlock_2x2_InverseLUP.cpp
[ 94%] Checking style of src/LinearAlgebra/BlockLinAlg/MatrixBlock_2x2_Decompose_LUP.cpp
[ 94%] Checking style of src/LinearAlgebra/BlockLinAlg/MatrixBlock_2x2_Decompose_LU.cpp
[ 94%] Checking style of src/LinearAlgebra/BlockLinAlg/MatrixBlock_2x2_InverseLU.cpp
[ 94%] Built target BlockLinAlgLib_vera
[ 94%] Generating CXX unity source src/LinearAlgebra/BlockLinAlg/cotire/BlockLinAlgLib_CXX_unity.cxx
[ 94%] Generating CXX prefix source src/LinearAlgebra/BlockLinAlg/cotire/BlockLinAlgLib_CXX_prefix.cxx
[ 94%] Generating CXX prefix header src/LinearAlgebra/BlockLinAlg/cotire/BlockLinAlgLib_CXX_prefix.hxx
[ 94%] Building CXX precompiled header src/LinearAlgebra/BlockLinAlg/cotire/BlockLinAlgLib_CXX_prefix.hxx.pch
Scanning dependencies of target BlockLinAlgLib
[ 94%] Building CXX object src/LinearAlgebra/BlockLinAlg/CMakeFiles/BlockLinAlgLib.dir/MatrixBlock_2x2_Decompose_LU.cpp.o
[ 94%] Building CXX object src/LinearAlgebra/BlockLinAlg/CMakeFiles/BlockLinAlgLib.dir/MatrixBlock_2x2_Decompose_LUP.cpp.o
[ 94%] Building CXX object src/LinearAlgebra/BlockLinAlg/CMakeFiles/BlockLinAlgLib.dir/MatrixBlock_2x2_InverseLU.cpp.o
[ 94%] Building CXX object src/LinearAlgebra/BlockLinAlg/CMakeFiles/BlockLinAlgLib.dir/MatrixBlock_2x2_InverseLUP.cpp.o
[ 94%] Linking CXX static library libBlockLinAlgLib.a
[ 94%] Built target BlockLinAlgLib
Scanning dependencies of target pdeSensorLib_vera
[ 94%] Checking style of src/pde/Sensor/Sensor_ViscousFlux1D.h
[ 94%] Checking style of src/pde/Sensor/Source1D_JumpSensor.h
[ 94%] Checking style of src/pde/Sensor/BCSensorParameter2D.h
[ 94%] Checking style of src/pde/Sensor/Sensor_Source1D.h
[ 94%] Checking style of src/pde/Sensor/Source2D_JumpSensor.h
[ 94%] Checking style of src/pde/Sensor/Sensor_Source2D.h
[ 94%] Checking style of src/pde/Sensor/PDESensorParameter2D.h
[ 94%] Checking style of src/pde/Sensor/Sensor_AdvectiveFlux2D.h
[ 94%] Checking style of src/pde/Sensor/Sensor_ViscousFlux2D.h
[ 94%] Checking style of src/pde/Sensor/BCSensorParameter1D.h
[ 94%] Checking style of src/pde/Sensor/SensorParameter_Traits.h
[ 94%] Checking style of src/pde/Sensor/PDESensorParameter1D.h
[ 94%] Checking style of src/pde/Sensor/Sensor_AdvectiveFlux1D.h
[ 94%] Checking style of src/pde/Sensor/Sensor_ViscousFlux1D.cpp
[ 94%] Checking style of src/pde/Sensor/Sensor_ViscousFlux2D.cpp
[ 94%] Checking style of src/pde/Sensor/Sensor_AdvectiveFlux1D.cpp
[ 94%] Checking style of src/pde/Sensor/PDESensorParameter1D.cpp
[ 94%] Checking style of src/pde/Sensor/Sensor_AdvectiveFlux2D.cpp
[ 94%] Checking style of src/pde/Sensor/BCSensorParameter2D.cpp
[ 94%] Checking style of src/pde/Sensor/BCSensorParameter1D.cpp
[ 94%] Checking style of src/pde/Sensor/PDESensorParameter2D.cpp
[ 94%] Built target pdeSensorLib_vera
[ 94%] Generating CXX unity source src/pde/Sensor/cotire/pdeSensorLib_CXX_unity.cxx
[ 94%] Generating CXX prefix source src/pde/Sensor/cotire/pdeSensorLib_CXX_prefix.cxx
[ 94%] Generating CXX prefix header src/pde/Sensor/cotire/pdeSensorLib_CXX_prefix.hxx
[ 94%] Building CXX precompiled header src/pde/Sensor/cotire/pdeSensorLib_CXX_prefix.hxx.pch
Scanning dependencies of target pdeSensorLib
[ 94%] Building CXX object src/pde/Sensor/CMakeFiles/pdeSensorLib.dir/BCSensorParameter1D.cpp.o
[ 94%] Building CXX object src/pde/Sensor/CMakeFiles/pdeSensorLib.dir/BCSensorParameter2D.cpp.o
[ 94%] Building CXX object src/pde/Sensor/CMakeFiles/pdeSensorLib.dir/PDESensorParameter1D.cpp.o
[ 94%] Building CXX object src/pde/Sensor/CMakeFiles/pdeSensorLib.dir/PDESensorParameter2D.cpp.o
[ 94%] Building CXX object src/pde/Sensor/CMakeFiles/pdeSensorLib.dir/Sensor_AdvectiveFlux1D.cpp.o
[ 94%] Building CXX object src/pde/Sensor/CMakeFiles/pdeSensorLib.dir/Sensor_AdvectiveFlux2D.cpp.o
[ 94%] Building CXX object src/pde/Sensor/CMakeFiles/pdeSensorLib.dir/Sensor_ViscousFlux1D.cpp.o
[ 94%] Building CXX object src/pde/Sensor/CMakeFiles/pdeSensorLib.dir/Sensor_ViscousFlux2D.cpp.o
[ 94%] Linking CXX static library libpdeSensorLib.a
[ 94%] Built target pdeSensorLib
Scanning dependencies of target LocalSolve1D_Split_HDG_AD_btest_build_vera
[ 94%] Checking style of test/system/LocalSolve/LocalSolve1D_Split_HDG_AD_btest.cpp
[ 94%] Built target LocalSolve1D_Split_HDG_AD_btest_build_vera
Scanning dependencies of target LocalSolve1D_Split_HDG_AD_btest_build
[ 94%] Linking CXX executable LocalSolve1D_Split_HDG_AD_btest
[ 94%] Built target LocalSolve1D_Split_HDG_AD_btest_build
Scanning dependencies of target LocalSolve2D_Split_DGBR2_Triangle_AD_AV_btest_build_vera
[ 94%] Checking style of test/system/LocalSolve/LocalSolve2D_Split_DGBR2_Triangle_AD_AV_btest.cpp
[ 94%] Built target LocalSolve2D_Split_DGBR2_Triangle_AD_AV_btest_build_vera
Scanning dependencies of target LocalSolve2D_Split_DGBR2_Triangle_AD_AV_btest_OBJECT
[ 94%] Building CXX object test/system/LocalSolve/CMakeFiles/LocalSolve2D_Split_DGBR2_Triangle_AD_AV_btest_OBJECT.dir/LocalSolve2D_Split_DGBR2_Triangle_AD_AV_btest.cpp.o
[ 94%] Built target LocalSolve2D_Split_DGBR2_Triangle_AD_AV_btest_OBJECT
Scanning dependencies of target LocalSolve2D_Split_DGBR2_Triangle_AD_AV_btest_build
[ 94%] Linking CXX executable LocalSolve2D_Split_DGBR2_Triangle_AD_AV_btest
[ 94%] Built target LocalSolve2D_Split_DGBR2_Triangle_AD_AV_btest_build
Scanning dependencies of target LocalSolve1D_Split_DGBR2_AD_btest_build_vera
[ 94%] Checking style of test/system/LocalSolve/LocalSolve1D_Split_DGBR2_AD_btest.cpp
[ 94%] Built target LocalSolve1D_Split_DGBR2_AD_btest_build_vera
Scanning dependencies of target LocalSolve1D_Split_DGBR2_AD_btest_OBJECT
[ 94%] Building CXX object test/system/LocalSolve/CMakeFiles/LocalSolve1D_Split_DGBR2_AD_btest_OBJECT.dir/LocalSolve1D_Split_DGBR2_AD_btest.cpp.o
[ 94%] Built target LocalSolve1D_Split_DGBR2_AD_btest_OBJECT
Scanning dependencies of target LocalSolve1D_Split_DGBR2_AD_btest_build
[ 94%] Linking CXX executable LocalSolve1D_Split_DGBR2_AD_btest
[ 94%] Built target LocalSolve1D_Split_DGBR2_AD_btest_build
Scanning dependencies of target EdgeLocalSolve2D_Dual_Galerkin_Stabilized_Euler_btest_OBJECT
[ 94%] Building CXX object test/system/LocalSolve/CMakeFiles/EdgeLocalSolve2D_Dual_Galerkin_Stabilized_Euler_btest_OBJECT.dir/EdgeLocalSolve2D_Dual_Galerkin_Stabilized_Euler_btest.cpp.o
[ 94%] Built target EdgeLocalSolve2D_Dual_Galerkin_Stabilized_Euler_btest_OBJECT
Scanning dependencies of target EdgeLocalSolve2D_Dual_Galerkin_Stabilized_Euler_btest_build_vera
[ 94%] Checking style of test/system/LocalSolve/EdgeLocalSolve2D_Dual_Galerkin_Stabilized_Euler_btest.cpp
[ 94%] Built target EdgeLocalSolve2D_Dual_Galerkin_Stabilized_Euler_btest_build_vera
Scanning dependencies of target EdgeLocalSolve2D_Dual_Galerkin_Stabilized_Euler_btest_build
[ 94%] Linking CXX executable EdgeLocalSolve2D_Dual_Galerkin_Stabilized_Euler_btest
[ 94%] Built target EdgeLocalSolve2D_Dual_Galerkin_Stabilized_Euler_btest_build
Scanning dependencies of target ElementLocalSolve2D_DGBR2_Triangle_AD_btest_build_vera
[ 94%] Checking style of test/system/LocalSolve/ElementLocalSolve2D_DGBR2_Triangle_AD_btest.cpp
[ 94%] Built target ElementLocalSolve2D_DGBR2_Triangle_AD_btest_build_vera
Scanning dependencies of target ElementLocalSolve2D_DGBR2_Triangle_AD_btest_OBJECT
[ 94%] Building CXX object test/system/LocalSolve/CMakeFiles/ElementLocalSolve2D_DGBR2_Triangle_AD_btest_OBJECT.dir/ElementLocalSolve2D_DGBR2_Triangle_AD_btest.cpp.o
[ 94%] Built target ElementLocalSolve2D_DGBR2_Triangle_AD_btest_OBJECT
Scanning dependencies of target ElementLocalSolve2D_DGBR2_Triangle_AD_btest_build
[ 94%] Linking CXX executable ElementLocalSolve2D_DGBR2_Triangle_AD_btest
[ 94%] Built target ElementLocalSolve2D_DGBR2_Triangle_AD_btest_build
Scanning dependencies of target LocalSolve3D_HDG_Tet_AD_btest_build_vera
[ 94%] Checking style of test/system/LocalSolve/LocalSolve3D_HDG_Tet_AD_btest.cpp
[ 94%] Built target LocalSolve3D_HDG_Tet_AD_btest_build_vera
Scanning dependencies of target LocalSolve3D_HDG_Tet_AD_btest_OBJECT
[ 94%] Building CXX object test/system/LocalSolve/CMakeFiles/LocalSolve3D_HDG_Tet_AD_btest_OBJECT.dir/LocalSolve3D_HDG_Tet_AD_btest.cpp.o
[ 94%] Built target LocalSolve3D_HDG_Tet_AD_btest_OBJECT
Scanning dependencies of target LocalSolve3D_HDG_Tet_AD_btest_build
[ 94%] Linking CXX executable LocalSolve3D_HDG_Tet_AD_btest
[ 94%] Built target LocalSolve3D_HDG_Tet_AD_btest_build
Scanning dependencies of target EdgeLocalSolve3D_Dual_Galerkin_Stabilized_AD_btest_OBJECT
[ 94%] Building CXX object test/system/LocalSolve/CMakeFiles/EdgeLocalSolve3D_Dual_Galerkin_Stabilized_AD_btest_OBJECT.dir/EdgeLocalSolve3D_Dual_Galerkin_Stabilized_AD_btest.cpp.o
[ 94%] Built target EdgeLocalSolve3D_Dual_Galerkin_Stabilized_AD_btest_OBJECT
Scanning dependencies of target EdgeLocalSolve3D_Dual_Galerkin_Stabilized_AD_btest_build_vera
[ 94%] Checking style of test/system/LocalSolve/EdgeLocalSolve3D_Dual_Galerkin_Stabilized_AD_btest.cpp
[ 94%] Built target EdgeLocalSolve3D_Dual_Galerkin_Stabilized_AD_btest_build_vera
Scanning dependencies of target EdgeLocalSolve3D_Dual_Galerkin_Stabilized_AD_btest_build
[ 94%] Linking CXX executable EdgeLocalSolve3D_Dual_Galerkin_Stabilized_AD_btest
[ 94%] Built target EdgeLocalSolve3D_Dual_Galerkin_Stabilized_AD_btest_build
Scanning dependencies of target ElementLocalSolve3D_DGBR2_Tet_AD_btest_build_vera
[ 94%] Checking style of test/system/LocalSolve/ElementLocalSolve3D_DGBR2_Tet_AD_btest.cpp
[ 94%] Built target ElementLocalSolve3D_DGBR2_Tet_AD_btest_build_vera
Scanning dependencies of target ElementLocalSolve3D_DGBR2_Tet_AD_btest_OBJECT
[ 94%] Building CXX object test/system/LocalSolve/CMakeFiles/ElementLocalSolve3D_DGBR2_Tet_AD_btest_OBJECT.dir/ElementLocalSolve3D_DGBR2_Tet_AD_btest.cpp.o
[ 94%] Built target ElementLocalSolve3D_DGBR2_Tet_AD_btest_OBJECT
Scanning dependencies of target ElementLocalSolve3D_DGBR2_Tet_AD_btest_build
[ 94%] Linking CXX executable ElementLocalSolve3D_DGBR2_Tet_AD_btest
[ 94%] Built target ElementLocalSolve3D_DGBR2_Tet_AD_btest_build
Scanning dependencies of target LocalSolve2D_HDG_Triangle_AD_btest_build_vera
[ 94%] Checking style of test/system/LocalSolve/LocalSolve2D_HDG_Triangle_AD_btest.cpp
[ 94%] Built target LocalSolve2D_HDG_Triangle_AD_btest_build_vera
Scanning dependencies of target LocalSolve2D_HDG_Triangle_AD_btest_OBJECT
[ 94%] Building CXX object test/system/LocalSolve/CMakeFiles/LocalSolve2D_HDG_Triangle_AD_btest_OBJECT.dir/LocalSolve2D_HDG_Triangle_AD_btest.cpp.o
[ 94%] Built target LocalSolve2D_HDG_Triangle_AD_btest_OBJECT
Scanning dependencies of target LocalSolve2D_HDG_Triangle_AD_btest_build
[ 94%] Linking CXX executable LocalSolve2D_HDG_Triangle_AD_btest
[ 94%] Built target LocalSolve2D_HDG_Triangle_AD_btest_build
Scanning dependencies of target EdgeLocalSolve2D_Dual_Galerkin_Stabilized_AR_btest_OBJECT
[ 94%] Building CXX object test/system/LocalSolve/CMakeFiles/EdgeLocalSolve2D_Dual_Galerkin_Stabilized_AR_btest_OBJECT.dir/EdgeLocalSolve2D_Dual_Galerkin_Stabilized_AR_btest.cpp.o
[ 94%] Built target EdgeLocalSolve2D_Dual_Galerkin_Stabilized_AR_btest_OBJECT
Scanning dependencies of target EdgeLocalSolve2D_Dual_Galerkin_Stabilized_AR_btest_build_vera
[ 94%] Checking style of test/system/LocalSolve/EdgeLocalSolve2D_Dual_Galerkin_Stabilized_AR_btest.cpp
[ 94%] Built target EdgeLocalSolve2D_Dual_Galerkin_Stabilized_AR_btest_build_vera
Scanning dependencies of target EdgeLocalSolve2D_Dual_Galerkin_Stabilized_AR_btest_build
[ 94%] Linking CXX executable EdgeLocalSolve2D_Dual_Galerkin_Stabilized_AR_btest
[ 94%] Built target EdgeLocalSolve2D_Dual_Galerkin_Stabilized_AR_btest_build
Scanning dependencies of target LocalSolve3D_Split_HDG_Tet_AD_btest_build_vera
[ 94%] Checking style of test/system/LocalSolve/LocalSolve3D_Split_HDG_Tet_AD_btest.cpp
[ 94%] Built target LocalSolve3D_Split_HDG_Tet_AD_btest_build_vera
Scanning dependencies of target LocalSolve3D_Split_HDG_Tet_AD_btest_OBJECT
[ 94%] Building CXX object test/system/LocalSolve/CMakeFiles/LocalSolve3D_Split_HDG_Tet_AD_btest_OBJECT.dir/LocalSolve3D_Split_HDG_Tet_AD_btest.cpp.o
[ 94%] Built target LocalSolve3D_Split_HDG_Tet_AD_btest_OBJECT
Scanning dependencies of target LocalSolve3D_Split_HDG_Tet_AD_btest_build
[ 94%] Linking CXX executable LocalSolve3D_Split_HDG_Tet_AD_btest
[ 94%] Built target LocalSolve3D_Split_HDG_Tet_AD_btest_build
Scanning dependencies of target LocalSolve2D_Split_HDG_Triangle_AD_btest_OBJECT
[ 94%] Building CXX object test/system/LocalSolve/CMakeFiles/LocalSolve2D_Split_HDG_Triangle_AD_btest_OBJECT.dir/LocalSolve2D_Split_HDG_Triangle_AD_btest.cpp.o
[ 94%] Built target LocalSolve2D_Split_HDG_Triangle_AD_btest_OBJECT
Scanning dependencies of target LocalSolve2D_Split_HDG_Triangle_AD_btest_build_vera
[ 94%] Checking style of test/system/LocalSolve/LocalSolve2D_Split_HDG_Triangle_AD_btest.cpp
[ 94%] Built target LocalSolve2D_Split_HDG_Triangle_AD_btest_build_vera
Scanning dependencies of target LocalSolve2D_Split_HDG_Triangle_AD_btest_build
[ 94%] Linking CXX executable LocalSolve2D_Split_HDG_Triangle_AD_btest
[ 94%] Built target LocalSolve2D_Split_HDG_Triangle_AD_btest_build
Scanning dependencies of target ElementDualLocalSolve3D_Galerkin_Stabilized_Triangle_AD_btest_OBJECT
[ 94%] Building CXX object test/system/LocalSolve/CMakeFiles/ElementDualLocalSolve3D_Galerkin_Stabilized_Triangle_AD_btest_OBJECT.dir/ElementDualLocalSolve3D_Galerkin_Stabilized_Triangle_AD_btest.cpp.o
[ 94%] Built target ElementDualLocalSolve3D_Galerkin_Stabilized_Triangle_AD_btest_OBJECT
Scanning dependencies of target ElementDualLocalSolve3D_Galerkin_Stabilized_Triangle_AD_btest_build_vera
[ 94%] Checking style of test/system/LocalSolve/ElementDualLocalSolve3D_Galerkin_Stabilized_Triangle_AD_btest.cpp
[ 94%] Built target ElementDualLocalSolve3D_Galerkin_Stabilized_Triangle_AD_btest_build_vera
Scanning dependencies of target ElementDualLocalSolve3D_Galerkin_Stabilized_Triangle_AD_btest_build
[ 94%] Linking CXX executable ElementDualLocalSolve3D_Galerkin_Stabilized_Triangle_AD_btest
[ 94%] Built target ElementDualLocalSolve3D_Galerkin_Stabilized_Triangle_AD_btest_build
Scanning dependencies of target EdgeLocalSolve2D_Dual_Galerkin_Stabilized_AD_btest_build_vera
[ 94%] Checking style of test/system/LocalSolve/EdgeLocalSolve2D_Dual_Galerkin_Stabilized_AD_btest.cpp
[ 94%] Built target EdgeLocalSolve2D_Dual_Galerkin_Stabilized_AD_btest_build_vera
Scanning dependencies of target EdgeLocalSolve2D_Dual_Galerkin_Stabilized_AD_btest_OBJECT
[ 94%] Building CXX object test/system/LocalSolve/CMakeFiles/EdgeLocalSolve2D_Dual_Galerkin_Stabilized_AD_btest_OBJECT.dir/EdgeLocalSolve2D_Dual_Galerkin_Stabilized_AD_btest.cpp.o
[ 94%] Built target EdgeLocalSolve2D_Dual_Galerkin_Stabilized_AD_btest_OBJECT
Scanning dependencies of target EdgeLocalSolve2D_Dual_Galerkin_Stabilized_AD_btest_build
[ 94%] Linking CXX executable EdgeLocalSolve2D_Dual_Galerkin_Stabilized_AD_btest
[ 94%] Built target EdgeLocalSolve2D_Dual_Galerkin_Stabilized_AD_btest_build
Scanning dependencies of target ElementLocalSolve1D_DGBR2_Triangle_AD_btest_build_vera
[ 94%] Checking style of test/system/LocalSolve/ElementLocalSolve1D_DGBR2_Triangle_AD_btest.cpp
[ 94%] Built target ElementLocalSolve1D_DGBR2_Triangle_AD_btest_build_vera
Scanning dependencies of target ElementLocalSolve1D_DGBR2_Triangle_AD_btest_OBJECT
[ 94%] Building CXX object test/system/LocalSolve/CMakeFiles/ElementLocalSolve1D_DGBR2_Triangle_AD_btest_OBJECT.dir/ElementLocalSolve1D_DGBR2_Triangle_AD_btest.cpp.o
[ 94%] Built target ElementLocalSolve1D_DGBR2_Triangle_AD_btest_OBJECT
Scanning dependencies of target ElementLocalSolve1D_DGBR2_Triangle_AD_btest_build
[ 94%] Linking CXX executable ElementLocalSolve1D_DGBR2_Triangle_AD_btest
[ 94%] Built target ElementLocalSolve1D_DGBR2_Triangle_AD_btest_build
Scanning dependencies of target ElementLocalSolve3D_DGAdvective_Tet_AD_btest_OBJECT
[ 94%] Building CXX object test/system/LocalSolve/CMakeFiles/ElementLocalSolve3D_DGAdvective_Tet_AD_btest_OBJECT.dir/ElementLocalSolve3D_DGAdvective_Tet_AD_btest.cpp.o
[ 94%] Built target ElementLocalSolve3D_DGAdvective_Tet_AD_btest_OBJECT
Scanning dependencies of target ElementLocalSolve3D_DGAdvective_Tet_AD_btest_build_vera
[ 94%] Checking style of test/system/LocalSolve/ElementLocalSolve3D_DGAdvective_Tet_AD_btest.cpp
[ 94%] Built target ElementLocalSolve3D_DGAdvective_Tet_AD_btest_build_vera
Scanning dependencies of target ElementLocalSolve3D_DGAdvective_Tet_AD_btest_build
[ 94%] Linking CXX executable ElementLocalSolve3D_DGAdvective_Tet_AD_btest
[ 94%] Built target ElementLocalSolve3D_DGAdvective_Tet_AD_btest_build
Scanning dependencies of target EdgeLocalSolve1D_Dual_Galerkin_Stabilized_Line_AD_btest_build_vera
[ 94%] Checking style of test/system/LocalSolve/EdgeLocalSolve1D_Dual_Galerkin_Stabilized_Line_AD_btest.cpp
[ 94%] Built target EdgeLocalSolve1D_Dual_Galerkin_Stabilized_Line_AD_btest_build_vera
Scanning dependencies of target EdgeLocalSolve1D_Dual_Galerkin_Stabilized_Line_AD_btest_OBJECT
[ 94%] Building CXX object test/system/LocalSolve/CMakeFiles/EdgeLocalSolve1D_Dual_Galerkin_Stabilized_Line_AD_btest_OBJECT.dir/EdgeLocalSolve1D_Dual_Galerkin_Stabilized_Line_AD_btest.cpp.o
[ 94%] Built target EdgeLocalSolve1D_Dual_Galerkin_Stabilized_Line_AD_btest_OBJECT
Scanning dependencies of target EdgeLocalSolve1D_Dual_Galerkin_Stabilized_Line_AD_btest_build
[ 94%] Linking CXX executable EdgeLocalSolve1D_Dual_Galerkin_Stabilized_Line_AD_btest
[ 94%] Built target EdgeLocalSolve1D_Dual_Galerkin_Stabilized_Line_AD_btest_build
Scanning dependencies of target LocalSolve1D_HDG_AD_btest_build_vera
[ 94%] Checking style of test/system/LocalSolve/LocalSolve1D_HDG_AD_btest.cpp
[ 94%] Built target LocalSolve1D_HDG_AD_btest_build_vera
Scanning dependencies of target LocalSolve1D_HDG_AD_btest_OBJECT
[ 94%] Building CXX object test/system/LocalSolve/CMakeFiles/LocalSolve1D_HDG_AD_btest_OBJECT.dir/LocalSolve1D_HDG_AD_btest.cpp.o
[ 94%] Built target LocalSolve1D_HDG_AD_btest_OBJECT
Scanning dependencies of target LocalSolve1D_HDG_AD_btest_build
[ 94%] Linking CXX executable LocalSolve1D_HDG_AD_btest
[ 94%] Built target LocalSolve1D_HDG_AD_btest_build
Scanning dependencies of target ElementDualLocalSolve2D_Galerkin_Stabilized_Triangle_AD_btest_OBJECT
[ 94%] Building CXX object test/system/LocalSolve/CMakeFiles/ElementDualLocalSolve2D_Galerkin_Stabilized_Triangle_AD_btest_OBJECT.dir/ElementDualLocalSolve2D_Galerkin_Stabilized_Triangle_AD_btest.cpp.o
[ 94%] Built target ElementDualLocalSolve2D_Galerkin_Stabilized_Triangle_AD_btest_OBJECT
Scanning dependencies of target ElementDualLocalSolve2D_Galerkin_Stabilized_Triangle_AD_btest_build_vera
[ 94%] Checking style of test/system/LocalSolve/ElementDualLocalSolve2D_Galerkin_Stabilized_Triangle_AD_btest.cpp
[ 94%] Built target ElementDualLocalSolve2D_Galerkin_Stabilized_Triangle_AD_btest_build_vera
Scanning dependencies of target ElementDualLocalSolve2D_Galerkin_Stabilized_Triangle_AD_btest_build
[ 94%] Linking CXX executable ElementDualLocalSolve2D_Galerkin_Stabilized_Triangle_AD_btest
[ 94%] Built target ElementDualLocalSolve2D_Galerkin_Stabilized_Triangle_AD_btest_build
Scanning dependencies of target Block_1D_Decoupled_AD_btest_build_vera
[ 94%] Checking style of test/system/BlockSolve/Block_1D_Decoupled_AD_btest.cpp
[ 94%] Built target Block_1D_Decoupled_AD_btest_build_vera
Scanning dependencies of target Block_1D_Decoupled_AD_btest_OBJECT
[ 94%] Building CXX object test/system/BlockSolve/CMakeFiles/Block_1D_Decoupled_AD_btest_OBJECT.dir/Block_1D_Decoupled_AD_btest.cpp.o
[ 94%] Built target Block_1D_Decoupled_AD_btest_OBJECT
Scanning dependencies of target Block_1D_Decoupled_AD_btest_build
[ 94%] Linking CXX executable Block_1D_Decoupled_AD_btest
[ 94%] Built target Block_1D_Decoupled_AD_btest_build
Scanning dependencies of target Block_1D_Decoupled_Burgers_btest_OBJECT
[ 94%] Building CXX object test/system/BlockSolve/CMakeFiles/Block_1D_Decoupled_Burgers_btest_OBJECT.dir/Block_1D_Decoupled_Burgers_btest.cpp.o
[ 94%] Built target Block_1D_Decoupled_Burgers_btest_OBJECT
Scanning dependencies of target Block_1D_Decoupled_Burgers_btest_build_vera
[ 94%] Checking style of test/system/BlockSolve/Block_1D_Decoupled_Burgers_btest.cpp
[ 94%] Built target Block_1D_Decoupled_Burgers_btest_build_vera
Scanning dependencies of target Block_1D_Decoupled_Burgers_btest_build
[ 94%] Linking CXX executable Block_1D_Decoupled_Burgers_btest
[ 94%] Built target Block_1D_Decoupled_Burgers_btest_build
Scanning dependencies of target AnalyticSolve2D_DGAdvective_Triangle_Euler_UniformStream_btest_build_vera
[ 94%] Checking style of test/system/AnalyticSolve/AnalyticSolve2D_DGAdvective_Triangle_Euler_UniformStream_btest.cpp
[ 94%] Built target AnalyticSolve2D_DGAdvective_Triangle_Euler_UniformStream_btest_build_vera
[ 94%] Generating CXX unity source src/Discretization/cotire/DGBR2NSLib_CXX_unity.cxx
[ 94%] Generating CXX prefix source src/Discretization/cotire/DGBR2NSLib_CXX_prefix.cxx
[ 94%] Generating CXX prefix header src/Discretization/cotire/DGBR2NSLib_CXX_prefix.hxx
[ 94%] Building CXX precompiled header src/Discretization/cotire/DGBR2NSLib_CXX_prefix.hxx.pch
Scanning dependencies of target DGBR2NSLib
[ 94%] Building CXX object src/Discretization/CMakeFiles/DGBR2NSLib.dir/DG/DGBR2_Instantiate/AlgebraicEquationSet_DGBR2_NavierStokes2D_ConservativeConstVisc.cpp.o
[ 94%] Building CXX object src/Discretization/CMakeFiles/DGBR2NSLib.dir/DG/DGBR2_Instantiate/AlgebraicEquationSet_DGBR2_NavierStokes2D_PrimitiveConstVisc.cpp.o
[ 94%] Building CXX object src/Discretization/CMakeFiles/DGBR2NSLib.dir/DG/DGBR2_Instantiate/AlgebraicEquationSet_DGBR2_NavierStokes3D_PrimitiveConstVisc.cpp.o
[ 94%] Building CXX object src/Discretization/CMakeFiles/DGBR2NSLib.dir/DG/DGBR2_Instantiate/AlgebraicEquationSet_DGBR2_NavierStokes3D_PrimitiveSutherland.cpp.o
[ 94%] Building CXX object src/Discretization/CMakeFiles/DGBR2NSLib.dir/DG/DGBR2_Instantiate/AlgebraicEquationSet_DGBR2_NavierStokes3D_SurrogateSutherland.cpp.o
[ 94%] Linking CXX static library libDGBR2NSLib.a
[ 94%] Built target DGBR2NSLib
Scanning dependencies of target AnalyticSolve2D_DGAdvective_Triangle_Euler_UniformStream_btest_OBJECT
[ 94%] Building CXX object test/system/AnalyticSolve/CMakeFiles/AnalyticSolve2D_DGAdvective_Triangle_Euler_UniformStream_btest_OBJECT.dir/AnalyticSolve2D_DGAdvective_Triangle_Euler_UniformStream_btest.cpp.o
[ 94%] Built target AnalyticSolve2D_DGAdvective_Triangle_Euler_UniformStream_btest_OBJECT
Scanning dependencies of target AnalyticSolve2D_DGAdvective_Triangle_Euler_UniformStream_btest_build
[ 94%] Linking CXX executable AnalyticSolve2D_DGAdvective_Triangle_Euler_UniformStream_btest
[ 94%] Built target AnalyticSolve2D_DGAdvective_Triangle_Euler_UniformStream_btest_build
Scanning dependencies of target AnalyticSolve2D_DGBR2_Triangle_NavierStokes_UniformStream_btest_build_vera
[ 94%] Checking style of test/system/AnalyticSolve/AnalyticSolve2D_DGBR2_Triangle_NavierStokes_UniformStream_btest.cpp
[ 94%] Built target AnalyticSolve2D_DGBR2_Triangle_NavierStokes_UniformStream_btest_build_vera
Scanning dependencies of target AnalyticSolve2D_DGBR2_Triangle_NavierStokes_UniformStream_btest_OBJECT
[ 94%] Building CXX object test/system/AnalyticSolve/CMakeFiles/AnalyticSolve2D_DGBR2_Triangle_NavierStokes_UniformStream_btest_OBJECT.dir/AnalyticSolve2D_DGBR2_Triangle_NavierStokes_UniformStream_btest.cpp.o
[ 94%] Built target AnalyticSolve2D_DGBR2_Triangle_NavierStokes_UniformStream_btest_OBJECT
Scanning dependencies of target AnalyticSolve2D_DGBR2_Triangle_NavierStokes_UniformStream_btest_build
[ 94%] Linking CXX executable AnalyticSolve2D_DGBR2_Triangle_NavierStokes_UniformStream_btest
[ 94%] Built target AnalyticSolve2D_DGBR2_Triangle_NavierStokes_UniformStream_btest_build
Scanning dependencies of target AnalyticSolve2D_HDG_Triangle_NavierStokes_btest_build_vera
[ 94%] Checking style of test/system/AnalyticSolve/AnalyticSolve2D_HDG_Triangle_NavierStokes_btest.cpp
[ 94%] Built target AnalyticSolve2D_HDG_Triangle_NavierStokes_btest_build_vera
Scanning dependencies of target AnalyticSolve2D_HDG_Triangle_NavierStokes_btest_OBJECT
[ 94%] Building CXX object test/system/AnalyticSolve/CMakeFiles/AnalyticSolve2D_HDG_Triangle_NavierStokes_btest_OBJECT.dir/AnalyticSolve2D_HDG_Triangle_NavierStokes_btest.cpp.o
[ 94%] Built target AnalyticSolve2D_HDG_Triangle_NavierStokes_btest_OBJECT
Scanning dependencies of target AnalyticSolve2D_HDG_Triangle_NavierStokes_btest_build
[ 94%] Linking CXX executable AnalyticSolve2D_HDG_Triangle_NavierStokes_btest
[ 94%] Built target AnalyticSolve2D_HDG_Triangle_NavierStokes_btest_build
Scanning dependencies of target AnalyticSolve2D_DGAdvective_IBL_StagnationFlow_LamiBL_btest_OBJECT
[ 94%] Building CXX object test/system/AnalyticSolve/CMakeFiles/AnalyticSolve2D_DGAdvective_IBL_StagnationFlow_LamiBL_btest_OBJECT.dir/AnalyticSolve2D_DGAdvective_IBL_StagnationFlow_LamiBL_btest.cpp.o
[ 94%] Built target AnalyticSolve2D_DGAdvective_IBL_StagnationFlow_LamiBL_btest_OBJECT
Scanning dependencies of target AnalyticSolve2D_DGAdvective_IBL_StagnationFlow_LamiBL_btest_build_vera
[ 94%] Checking style of test/system/AnalyticSolve/AnalyticSolve2D_DGAdvective_IBL_StagnationFlow_LamiBL_btest.cpp
[ 94%] Built target AnalyticSolve2D_DGAdvective_IBL_StagnationFlow_LamiBL_btest_build_vera
Scanning dependencies of target AnalyticSolve2D_DGAdvective_IBL_StagnationFlow_LamiBL_btest_build
[ 94%] Linking CXX executable AnalyticSolve2D_DGAdvective_IBL_StagnationFlow_LamiBL_btest
[ 94%] Built target AnalyticSolve2D_DGAdvective_IBL_StagnationFlow_LamiBL_btest_build
Scanning dependencies of target AnalyticSolve2D_DGAdvective_IBL_StagnationFlow_SingleElem_LamiBL_btest_OBJECT
[ 94%] Building CXX object test/system/AnalyticSolve/CMakeFiles/AnalyticSolve2D_DGAdvective_IBL_StagnationFlow_SingleElem_LamiBL_btest_OBJECT.dir/AnalyticSolve2D_DGAdvective_IBL_StagnationFlow_SingleElem_LamiBL_btest.cpp.o
[ 94%] Built target AnalyticSolve2D_DGAdvective_IBL_StagnationFlow_SingleElem_LamiBL_btest_OBJECT
Scanning dependencies of target AnalyticSolve2D_DGAdvective_IBL_StagnationFlow_SingleElem_LamiBL_btest_build_vera
[ 94%] Checking style of test/system/AnalyticSolve/AnalyticSolve2D_DGAdvective_IBL_StagnationFlow_SingleElem_LamiBL_btest.cpp
[ 94%] Built target AnalyticSolve2D_DGAdvective_IBL_StagnationFlow_SingleElem_LamiBL_btest_build_vera
Scanning dependencies of target AnalyticSolve2D_DGAdvective_IBL_StagnationFlow_SingleElem_LamiBL_btest_build
[ 94%] Linking CXX executable AnalyticSolve2D_DGAdvective_IBL_StagnationFlow_SingleElem_LamiBL_btest
[ 94%] Built target AnalyticSolve2D_DGAdvective_IBL_StagnationFlow_SingleElem_LamiBL_btest_build
Scanning dependencies of target AnalyticSolve2D_HDG_Triangle_NavierStokes_UniformStream_btest_OBJECT
[ 94%] Building CXX object test/system/AnalyticSolve/CMakeFiles/AnalyticSolve2D_HDG_Triangle_NavierStokes_UniformStream_btest_OBJECT.dir/AnalyticSolve2D_HDG_Triangle_NavierStokes_UniformStream_btest.cpp.o
[ 94%] Built target AnalyticSolve2D_HDG_Triangle_NavierStokes_UniformStream_btest_OBJECT
Scanning dependencies of target AnalyticSolve2D_HDG_Triangle_NavierStokes_UniformStream_btest_build_vera
[ 94%] Checking style of test/system/AnalyticSolve/AnalyticSolve2D_HDG_Triangle_NavierStokes_UniformStream_btest.cpp
[ 94%] Built target AnalyticSolve2D_HDG_Triangle_NavierStokes_UniformStream_btest_build_vera
Scanning dependencies of target AnalyticSolve2D_HDG_Triangle_NavierStokes_UniformStream_btest_build
[ 94%] Linking CXX executable AnalyticSolve2D_HDG_Triangle_NavierStokes_UniformStream_btest
[ 94%] Built target AnalyticSolve2D_HDG_Triangle_NavierStokes_UniformStream_btest_build
Scanning dependencies of target AnalyticSolve_HDG_AD_btest_build_vera
[ 94%] Checking style of test/system/AnalyticSolve/AnalyticSolve_HDG_AD_btest.cpp
[ 94%] Built target AnalyticSolve_HDG_AD_btest_build_vera
Scanning dependencies of target AnalyticSolve_HDG_AD_btest_OBJECT
[ 94%] Building CXX object test/system/AnalyticSolve/CMakeFiles/AnalyticSolve_HDG_AD_btest_OBJECT.dir/AnalyticSolve_HDG_AD_btest.cpp.o
[ 94%] Built target AnalyticSolve_HDG_AD_btest_OBJECT
Scanning dependencies of target AnalyticSolve_HDG_AD_btest_build
[ 94%] Linking CXX executable AnalyticSolve_HDG_AD_btest
[ 94%] Built target AnalyticSolve_HDG_AD_btest_build
Scanning dependencies of target AnalyticSolve2D_DGBR2_Triangle_NavierStokes_btest_build_vera
[ 94%] Checking style of test/system/AnalyticSolve/AnalyticSolve2D_DGBR2_Triangle_NavierStokes_btest.cpp
[ 94%] Built target AnalyticSolve2D_DGBR2_Triangle_NavierStokes_btest_build_vera
Scanning dependencies of target AnalyticSolve2D_DGBR2_Triangle_NavierStokes_btest_OBJECT
[ 94%] Building CXX object test/system/AnalyticSolve/CMakeFiles/AnalyticSolve2D_DGBR2_Triangle_NavierStokes_btest_OBJECT.dir/AnalyticSolve2D_DGBR2_Triangle_NavierStokes_btest.cpp.o
[ 94%] Built target AnalyticSolve2D_DGBR2_Triangle_NavierStokes_btest_OBJECT
Scanning dependencies of target AnalyticSolve2D_DGBR2_Triangle_NavierStokes_btest_build
[ 94%] Linking CXX executable AnalyticSolve2D_DGBR2_Triangle_NavierStokes_btest
[ 94%] Built target AnalyticSolve2D_DGBR2_Triangle_NavierStokes_btest_build
Scanning dependencies of target PDEEulermitAVDiffusion2D_Consistency_btest_build_vera
[ 94%] Checking style of test/system/CodeConsistency/PDEEulermitAVDiffusion2D_Consistency_btest.cpp
[ 94%] Built target PDEEulermitAVDiffusion2D_Consistency_btest_build_vera
Scanning dependencies of target PDEEulermitAVDiffusion2D_Consistency_btest_OBJECT
[ 94%] Building CXX object test/system/CodeConsistency/CMakeFiles/PDEEulermitAVDiffusion2D_Consistency_btest_OBJECT.dir/PDEEulermitAVDiffusion2D_Consistency_btest.cpp.o
[ 94%] Built target PDEEulermitAVDiffusion2D_Consistency_btest_OBJECT
Scanning dependencies of target PDEEulermitAVDiffusion2D_Consistency_btest_build
[ 94%] Linking CXX executable PDEEulermitAVDiffusion2D_Consistency_btest
[ 94%] Built target PDEEulermitAVDiffusion2D_Consistency_btest_build
Scanning dependencies of target PDEmitAVSensor3D_Consistency_RANSSA_btest_OBJECT
[ 94%] Building CXX object test/system/CodeConsistency/CMakeFiles/PDEmitAVSensor3D_Consistency_RANSSA_btest_OBJECT.dir/PDEmitAVSensor3D_Consistency_RANSSA_btest.cpp.o
[ 94%] Built target PDEmitAVSensor3D_Consistency_RANSSA_btest_OBJECT
Scanning dependencies of target PDEmitAVSensor3D_Consistency_RANSSA_btest_build_vera
[ 94%] Checking style of test/system/CodeConsistency/PDEmitAVSensor3D_Consistency_RANSSA_btest.cpp
[ 94%] Built target PDEmitAVSensor3D_Consistency_RANSSA_btest_build_vera
Scanning dependencies of target PDEmitAVSensor3D_Consistency_RANSSA_btest_build
[ 94%] Linking CXX executable PDEmitAVSensor3D_Consistency_RANSSA_btest
[ 94%] Built target PDEmitAVSensor3D_Consistency_RANSSA_btest_build
Scanning dependencies of target PDEmitAVSensor2D_Consistency_btest_OBJECT
[ 94%] Building CXX object test/system/CodeConsistency/CMakeFiles/PDEmitAVSensor2D_Consistency_btest_OBJECT.dir/PDEmitAVSensor2D_Consistency_btest.cpp.o
[ 94%] Built target PDEmitAVSensor2D_Consistency_btest_OBJECT
Scanning dependencies of target PDEmitAVSensor2D_Consistency_btest_build_vera
[ 94%] Checking style of test/system/CodeConsistency/PDEmitAVSensor2D_Consistency_btest.cpp
[ 94%] Built target PDEmitAVSensor2D_Consistency_btest_build_vera
Scanning dependencies of target PDEmitAVSensor2D_Consistency_btest_build
[ 94%] Linking CXX executable PDEmitAVSensor2D_Consistency_btest
[ 94%] Built target PDEmitAVSensor2D_Consistency_btest_build
Scanning dependencies of target Solve2D_Uncoupled_DGAdvectiveIBL_NACA0004_LamiBL_btest_build_vera
[ 94%] Checking style of test/system/CodeConsistency/Solve2D_Uncoupled_DGAdvectiveIBL_NACA0004_LamiBL_btest.cpp
[ 94%] Built target Solve2D_Uncoupled_DGAdvectiveIBL_NACA0004_LamiBL_btest_build_vera
Scanning dependencies of target Solve2D_Uncoupled_DGAdvectiveIBL_NACA0004_LamiBL_btest_OBJECT
[ 94%] Building CXX object test/system/CodeConsistency/CMakeFiles/Solve2D_Uncoupled_DGAdvectiveIBL_NACA0004_LamiBL_btest_OBJECT.dir/Solve2D_Uncoupled_DGAdvectiveIBL_NACA0004_LamiBL_btest.cpp.o
[ 94%] Built target Solve2D_Uncoupled_DGAdvectiveIBL_NACA0004_LamiBL_btest_OBJECT
Scanning dependencies of target Solve2D_Uncoupled_DGAdvectiveIBL_NACA0004_LamiBL_btest_build
[ 94%] Linking CXX executable Solve2D_Uncoupled_DGAdvectiveIBL_NACA0004_LamiBL_btest
[ 94%] Built target Solve2D_Uncoupled_DGAdvectiveIBL_NACA0004_LamiBL_btest_build
Scanning dependencies of target PDEEulermitAVDiffusion3D_Consistency_btest_OBJECT
[ 94%] Building CXX object test/system/CodeConsistency/CMakeFiles/PDEEulermitAVDiffusion3D_Consistency_btest_OBJECT.dir/PDEEulermitAVDiffusion3D_Consistency_btest.cpp.o
[ 94%] Built target PDEEulermitAVDiffusion3D_Consistency_btest_OBJECT
Scanning dependencies of target PDEEulermitAVDiffusion3D_Consistency_btest_build_vera
[ 94%] Checking style of test/system/CodeConsistency/PDEEulermitAVDiffusion3D_Consistency_btest.cpp
[ 94%] Built target PDEEulermitAVDiffusion3D_Consistency_btest_build_vera
Scanning dependencies of target PDEEulermitAVDiffusion3D_Consistency_btest_build
[ 94%] Linking CXX executable PDEEulermitAVDiffusion3D_Consistency_btest
[ 94%] Built target PDEEulermitAVDiffusion3D_Consistency_btest_build
Scanning dependencies of target BCEulermitAVDiffusion3D_Consistency_btest_OBJECT
[ 94%] Building CXX object test/system/CodeConsistency/CMakeFiles/BCEulermitAVDiffusion3D_Consistency_btest_OBJECT.dir/BCEulermitAVDiffusion3D_Consistency_btest.cpp.o
[ 94%] Built target BCEulermitAVDiffusion3D_Consistency_btest_OBJECT
Scanning dependencies of target BCEulermitAVDiffusion3D_Consistency_btest_build_vera
[ 94%] Checking style of test/system/CodeConsistency/BCEulermitAVDiffusion3D_Consistency_btest.cpp
[ 94%] Built target BCEulermitAVDiffusion3D_Consistency_btest_build_vera
Scanning dependencies of target BCEulermitAVDiffusion3D_Consistency_btest_build
[ 94%] Linking CXX executable BCEulermitAVDiffusion3D_Consistency_btest
[ 94%] Built target BCEulermitAVDiffusion3D_Consistency_btest_build
Scanning dependencies of target Solve2D_Coupled4x4_HDGAdv_IBL_Panel_NACA0004_LamiBL_TurbWake_btest_build_vera
[ 94%] Checking style of test/system/CodeConsistency/Solve2D_Coupled4x4_HDGAdv_IBL_Panel_NACA0004_LamiBL_TurbWake_btest.cpp
[ 94%] Built target Solve2D_Coupled4x4_HDGAdv_IBL_Panel_NACA0004_LamiBL_TurbWake_btest_build_vera
Scanning dependencies of target Solve2D_Coupled4x4_HDGAdv_IBL_Panel_NACA0004_LamiBL_TurbWake_btest_OBJECT
[ 94%] Building CXX object test/system/CodeConsistency/CMakeFiles/Solve2D_Coupled4x4_HDGAdv_IBL_Panel_NACA0004_LamiBL_TurbWake_btest_OBJECT.dir/Solve2D_Coupled4x4_HDGAdv_IBL_Panel_NACA0004_LamiBL_TurbWake_btest.cpp.o
[ 94%] Built target Solve2D_Coupled4x4_HDGAdv_IBL_Panel_NACA0004_LamiBL_TurbWake_btest_OBJECT
Scanning dependencies of target Solve2D_Coupled4x4_HDGAdv_IBL_Panel_NACA0004_LamiBL_TurbWake_btest_build
[ 94%] Linking CXX executable Solve2D_Coupled4x4_HDGAdv_IBL_Panel_NACA0004_LamiBL_TurbWake_btest
[ 94%] Built target Solve2D_Coupled4x4_HDGAdv_IBL_Panel_NACA0004_LamiBL_TurbWake_btest_build
Scanning dependencies of target Solve2D_Coupled4x4_IBLUniField_Panel_NACA0004_LamiBL_TurbWakeXfoilLagClosure_btest_build_vera
[ 94%] Checking style of test/system/CodeConsistency/Solve2D_Coupled4x4_IBLUniField_Panel_NACA0004_LamiBL_TurbWakeXfoilLagClosure_btest.cpp
[ 94%] Built target Solve2D_Coupled4x4_IBLUniField_Panel_NACA0004_LamiBL_TurbWakeXfoilLagClosure_btest_build_vera
Scanning dependencies of target Solve2D_Coupled4x4_IBLUniField_Panel_NACA0004_LamiBL_TurbWakeXfoilLagClosure_btest_OBJECT
[ 94%] Building CXX object test/system/CodeConsistency/CMakeFiles/Solve2D_Coupled4x4_IBLUniField_Panel_NACA0004_LamiBL_TurbWakeXfoilLagClosure_btest_OBJECT.dir/Solve2D_Coupled4x4_IBLUniField_Panel_NACA0004_LamiBL_TurbWakeXfoilLagClosure_btest.cpp.o
[ 94%] Built target Solve2D_Coupled4x4_IBLUniField_Panel_NACA0004_LamiBL_TurbWakeXfoilLagClosure_btest_OBJECT
Scanning dependencies of target Solve2D_Coupled4x4_IBLUniField_Panel_NACA0004_LamiBL_TurbWakeXfoilLagClosure_btest_build
[ 94%] Linking CXX executable Solve2D_Coupled4x4_IBLUniField_Panel_NACA0004_LamiBL_TurbWakeXfoilLagClosure_btest
[ 94%] Built target Solve2D_Coupled4x4_IBLUniField_Panel_NACA0004_LamiBL_TurbWakeXfoilLagClosure_btest_build
Scanning dependencies of target PDEmitAVSensor2D_Consistency_RANSSA_btest_OBJECT
[ 94%] Building CXX object test/system/CodeConsistency/CMakeFiles/PDEmitAVSensor2D_Consistency_RANSSA_btest_OBJECT.dir/PDEmitAVSensor2D_Consistency_RANSSA_btest.cpp.o
[ 94%] Built target PDEmitAVSensor2D_Consistency_RANSSA_btest_OBJECT
Scanning dependencies of target PDEmitAVSensor2D_Consistency_RANSSA_btest_build_vera
[ 94%] Checking style of test/system/CodeConsistency/PDEmitAVSensor2D_Consistency_RANSSA_btest.cpp
[ 94%] Built target PDEmitAVSensor2D_Consistency_RANSSA_btest_build_vera
Scanning dependencies of target PDEmitAVSensor2D_Consistency_RANSSA_btest_build
[ 94%] Linking CXX executable PDEmitAVSensor2D_Consistency_RANSSA_btest
[ 94%] Built target PDEmitAVSensor2D_Consistency_RANSSA_btest_build
Scanning dependencies of target Solve2D_Uncoupled_DGAdvectiveIBLUniField_NACA0004_LamiBL_btest_build_vera
[ 94%] Checking style of test/system/CodeConsistency/Solve2D_Uncoupled_DGAdvectiveIBLUniField_NACA0004_LamiBL_btest.cpp
[ 94%] Built target Solve2D_Uncoupled_DGAdvectiveIBLUniField_NACA0004_LamiBL_btest_build_vera
Scanning dependencies of target Solve2D_Uncoupled_DGAdvectiveIBLUniField_NACA0004_LamiBL_btest_OBJECT
[ 94%] Building CXX object test/system/CodeConsistency/CMakeFiles/Solve2D_Uncoupled_DGAdvectiveIBLUniField_NACA0004_LamiBL_btest_OBJECT.dir/Solve2D_Uncoupled_DGAdvectiveIBLUniField_NACA0004_LamiBL_btest.cpp.o
[ 94%] Built target Solve2D_Uncoupled_DGAdvectiveIBLUniField_NACA0004_LamiBL_btest_OBJECT
Scanning dependencies of target Solve2D_Uncoupled_DGAdvectiveIBLUniField_NACA0004_LamiBL_btest_build
[ 94%] Linking CXX executable Solve2D_Uncoupled_DGAdvectiveIBLUniField_NACA0004_LamiBL_btest
[ 94%] Built target Solve2D_Uncoupled_DGAdvectiveIBLUniField_NACA0004_LamiBL_btest_build
Scanning dependencies of target Solve2D_Coupled4x4_IBLUniField_LamiBL_TurbWake_PTC_btest_OBJECT
[ 94%] Building CXX object test/system/CodeConsistency/CMakeFiles/Solve2D_Coupled4x4_IBLUniField_LamiBL_TurbWake_PTC_btest_OBJECT.dir/Solve2D_Coupled4x4_IBLUniField_LamiBL_TurbWake_PTC_btest.cpp.o
[ 94%] Built target Solve2D_Coupled4x4_IBLUniField_LamiBL_TurbWake_PTC_btest_OBJECT
Scanning dependencies of target Solve2D_Coupled4x4_IBLUniField_LamiBL_TurbWake_PTC_btest_build_vera
[ 94%] Checking style of test/system/CodeConsistency/Solve2D_Coupled4x4_IBLUniField_LamiBL_TurbWake_PTC_btest.cpp
[ 94%] Built target Solve2D_Coupled4x4_IBLUniField_LamiBL_TurbWake_PTC_btest_build_vera
Scanning dependencies of target Solve2D_Coupled4x4_IBLUniField_LamiBL_TurbWake_PTC_btest_build
[ 94%] Linking CXX executable Solve2D_Coupled4x4_IBLUniField_LamiBL_TurbWake_PTC_btest
[ 94%] Built target Solve2D_Coupled4x4_IBLUniField_LamiBL_TurbWake_PTC_btest_build
Scanning dependencies of target PDEEulermitAVDiffusion2D_RANSSA_Consistency_btest_OBJECT
[ 94%] Building CXX object test/system/CodeConsistency/CMakeFiles/PDEEulermitAVDiffusion2D_RANSSA_Consistency_btest_OBJECT.dir/PDEEulermitAVDiffusion2D_RANSSA_Consistency_btest.cpp.o
[ 94%] Built target PDEEulermitAVDiffusion2D_RANSSA_Consistency_btest_OBJECT
Scanning dependencies of target PDEEulermitAVDiffusion2D_RANSSA_Consistency_btest_build_vera
[ 97%] Checking style of test/system/CodeConsistency/PDEEulermitAVDiffusion2D_RANSSA_Consistency_btest.cpp
[ 97%] Built target PDEEulermitAVDiffusion2D_RANSSA_Consistency_btest_build_vera
Scanning dependencies of target PDEEulermitAVDiffusion2D_RANSSA_Consistency_btest_build
[ 97%] Linking CXX executable PDEEulermitAVDiffusion2D_RANSSA_Consistency_btest
[ 97%] Built target PDEEulermitAVDiffusion2D_RANSSA_Consistency_btest_build
Scanning dependencies of target Solve2D_Uncoupled_DGAdvectiveIBL_NACA0004_LamiBL_PTC_btest_build_vera
[ 97%] Checking style of test/system/CodeConsistency/Solve2D_Uncoupled_DGAdvectiveIBL_NACA0004_LamiBL_PTC_btest.cpp
[ 97%] Built target Solve2D_Uncoupled_DGAdvectiveIBL_NACA0004_LamiBL_PTC_btest_build_vera
Scanning dependencies of target Solve2D_Uncoupled_DGAdvectiveIBL_NACA0004_LamiBL_PTC_btest_OBJECT
[ 97%] Building CXX object test/system/CodeConsistency/CMakeFiles/Solve2D_Uncoupled_DGAdvectiveIBL_NACA0004_LamiBL_PTC_btest_OBJECT.dir/Solve2D_Uncoupled_DGAdvectiveIBL_NACA0004_LamiBL_PTC_btest.cpp.o
[ 97%] Built target Solve2D_Uncoupled_DGAdvectiveIBL_NACA0004_LamiBL_PTC_btest_OBJECT
Scanning dependencies of target Solve2D_Uncoupled_DGAdvectiveIBL_NACA0004_LamiBL_PTC_btest_build
[ 97%] Linking CXX executable Solve2D_Uncoupled_DGAdvectiveIBL_NACA0004_LamiBL_PTC_btest
[ 97%] Built target Solve2D_Uncoupled_DGAdvectiveIBL_NACA0004_LamiBL_PTC_btest_build
Scanning dependencies of target Solve2D_Coupled4x4_IBL_Panel_NACA0004_LamiBL_TurbWakeXfoilLagClosure_btest_OBJECT
[ 97%] Building CXX object test/system/CodeConsistency/CMakeFiles/Solve2D_Coupled4x4_IBL_Panel_NACA0004_LamiBL_TurbWakeXfoilLagClosure_btest_OBJECT.dir/Solve2D_Coupled4x4_IBL_Panel_NACA0004_LamiBL_TurbWakeXfoilLagClosure_btest.cpp.o
[ 97%] Built target Solve2D_Coupled4x4_IBL_Panel_NACA0004_LamiBL_TurbWakeXfoilLagClosure_btest_OBJECT
Scanning dependencies of target Solve2D_Coupled4x4_IBL_Panel_NACA0004_LamiBL_TurbWakeXfoilLagClosure_btest_build_vera
[ 97%] Checking style of test/system/CodeConsistency/Solve2D_Coupled4x4_IBL_Panel_NACA0004_LamiBL_TurbWakeXfoilLagClosure_btest.cpp
[ 97%] Built target Solve2D_Coupled4x4_IBL_Panel_NACA0004_LamiBL_TurbWakeXfoilLagClosure_btest_build_vera
Scanning dependencies of target Solve2D_Coupled4x4_IBL_Panel_NACA0004_LamiBL_TurbWakeXfoilLagClosure_btest_build
[ 97%] Linking CXX executable Solve2D_Coupled4x4_IBL_Panel_NACA0004_LamiBL_TurbWakeXfoilLagClosure_btest
[ 97%] Built target Solve2D_Coupled4x4_IBL_Panel_NACA0004_LamiBL_TurbWakeXfoilLagClosure_btest_build
Scanning dependencies of target PDEmitAVSensor3D_Consistency_btest_OBJECT
[ 97%] Building CXX object test/system/CodeConsistency/CMakeFiles/PDEmitAVSensor3D_Consistency_btest_OBJECT.dir/PDEmitAVSensor3D_Consistency_btest.cpp.o
[ 97%] Built target PDEmitAVSensor3D_Consistency_btest_OBJECT
Scanning dependencies of target PDEmitAVSensor3D_Consistency_btest_build_vera
[ 97%] Checking style of test/system/CodeConsistency/PDEmitAVSensor3D_Consistency_btest.cpp
[ 97%] Built target PDEmitAVSensor3D_Consistency_btest_build_vera
Scanning dependencies of target PDEmitAVSensor3D_Consistency_btest_build
[ 97%] Linking CXX executable PDEmitAVSensor3D_Consistency_btest
[ 97%] Built target PDEmitAVSensor3D_Consistency_btest_build
Scanning dependencies of target Solve2D_XfoilLikePanelMethod_btest_OBJECT
[ 97%] Building CXX object test/system/CodeConsistency/CMakeFiles/Solve2D_XfoilLikePanelMethod_btest_OBJECT.dir/Solve2D_XfoilLikePanelMethod_btest.cpp.o
[ 97%] Built target Solve2D_XfoilLikePanelMethod_btest_OBJECT
Scanning dependencies of target Solve2D_XfoilLikePanelMethod_btest_build_vera
[ 97%] Checking style of test/system/CodeConsistency/Solve2D_XfoilLikePanelMethod_btest.cpp
[ 97%] Built target Solve2D_XfoilLikePanelMethod_btest_build_vera
Scanning dependencies of target Solve2D_XfoilLikePanelMethod_btest_build
[ 97%] Linking CXX executable Solve2D_XfoilLikePanelMethod_btest
[ 97%] Built target Solve2D_XfoilLikePanelMethod_btest_build
Scanning dependencies of target Solve2D_Coupled4x4_IBL_Panel_NACA0004_FittedTransition_Forced_btest_build_vera
[ 97%] Checking style of test/system/CodeConsistency/Solve2D_Coupled4x4_IBL_Panel_NACA0004_FittedTransition_Forced_btest.cpp
[ 97%] Built target Solve2D_Coupled4x4_IBL_Panel_NACA0004_FittedTransition_Forced_btest_build_vera
Scanning dependencies of target Solve2D_Coupled4x4_IBL_Panel_NACA0004_FittedTransition_Forced_btest_OBJECT
[ 97%] Building CXX object test/system/CodeConsistency/CMakeFiles/Solve2D_Coupled4x4_IBL_Panel_NACA0004_FittedTransition_Forced_btest_OBJECT.dir/Solve2D_Coupled4x4_IBL_Panel_NACA0004_FittedTransition_Forced_btest.cpp.o
[ 97%] Built target Solve2D_Coupled4x4_IBL_Panel_NACA0004_FittedTransition_Forced_btest_OBJECT
Scanning dependencies of target Solve2D_Coupled4x4_IBL_Panel_NACA0004_FittedTransition_Forced_btest_build
[ 97%] Linking CXX executable Solve2D_Coupled4x4_IBL_Panel_NACA0004_FittedTransition_Forced_btest
[ 97%] Built target Solve2D_Coupled4x4_IBL_Panel_NACA0004_FittedTransition_Forced_btest_build
Scanning dependencies of target PDEmitAVSensor1D_Consistency_btest_OBJECT
[ 97%] Building CXX object test/system/CodeConsistency/CMakeFiles/PDEmitAVSensor1D_Consistency_btest_OBJECT.dir/PDEmitAVSensor1D_Consistency_btest.cpp.o
[ 97%] Built target PDEmitAVSensor1D_Consistency_btest_OBJECT
Scanning dependencies of target PDEmitAVSensor1D_Consistency_btest_build_vera
[ 97%] Checking style of test/system/CodeConsistency/PDEmitAVSensor1D_Consistency_btest.cpp
[ 97%] Built target PDEmitAVSensor1D_Consistency_btest_build_vera
Scanning dependencies of target PDEmitAVSensor1D_Consistency_btest_build
[ 97%] Linking CXX executable PDEmitAVSensor1D_Consistency_btest
[ 97%] Built target PDEmitAVSensor1D_Consistency_btest_build
Scanning dependencies of target Solve2D_Uncoupled_HDGAdvectiveIBL_NACA0004_LamiBL_btest_OBJECT
[100%] Building CXX object test/system/CodeConsistency/CMakeFiles/Solve2D_Uncoupled_HDGAdvectiveIBL_NACA0004_LamiBL_btest_OBJECT.dir/Solve2D_Uncoupled_HDGAdvectiveIBL_NACA0004_LamiBL_btest.cpp.o
[100%] Built target Solve2D_Uncoupled_HDGAdvectiveIBL_NACA0004_LamiBL_btest_OBJECT
Scanning dependencies of target Solve2D_Uncoupled_HDGAdvectiveIBL_NACA0004_LamiBL_btest_build_vera
[100%] Checking style of test/system/CodeConsistency/Solve2D_Uncoupled_HDGAdvectiveIBL_NACA0004_LamiBL_btest.cpp
[100%] Built target Solve2D_Uncoupled_HDGAdvectiveIBL_NACA0004_LamiBL_btest_build_vera
Scanning dependencies of target Solve2D_Uncoupled_HDGAdvectiveIBL_NACA0004_LamiBL_btest_build
[100%] Linking CXX executable Solve2D_Uncoupled_HDGAdvectiveIBL_NACA0004_LamiBL_btest
[100%] Built target Solve2D_Uncoupled_HDGAdvectiveIBL_NACA0004_LamiBL_btest_build
Scanning dependencies of target Solve2D_Coupled4x4_IBL_Panel_NACA0004_FittedTransition_TwoLayerNewton_btest_build_vera
[100%] Checking style of test/system/CodeConsistency/Solve2D_Coupled4x4_IBL_Panel_NACA0004_FittedTransition_TwoLayerNewton_btest.cpp
[100%] Built target Solve2D_Coupled4x4_IBL_Panel_NACA0004_FittedTransition_TwoLayerNewton_btest_build_vera
Scanning dependencies of target Solve2D_Coupled4x4_IBL_Panel_NACA0004_FittedTransition_TwoLayerNewton_btest_OBJECT
[100%] Building CXX object test/system/CodeConsistency/CMakeFiles/Solve2D_Coupled4x4_IBL_Panel_NACA0004_FittedTransition_TwoLayerNewton_btest_OBJECT.dir/Solve2D_Coupled4x4_IBL_Panel_NACA0004_FittedTransition_TwoLayerNewton_btest.cpp.o
[100%] Built target Solve2D_Coupled4x4_IBL_Panel_NACA0004_FittedTransition_TwoLayerNewton_btest_OBJECT
Scanning dependencies of target Solve2D_Coupled4x4_IBL_Panel_NACA0004_FittedTransition_TwoLayerNewton_btest_build
[100%] Linking CXX executable Solve2D_Coupled4x4_IBL_Panel_NACA0004_FittedTransition_TwoLayerNewton_btest
[100%] Built target Solve2D_Coupled4x4_IBL_Panel_NACA0004_FittedTransition_TwoLayerNewton_btest_build
Scanning dependencies of target PDEEulermitAVDiffusion3D_RANSSA_Consistency_btest_build_vera
[100%] Checking style of test/system/CodeConsistency/PDEEulermitAVDiffusion3D_RANSSA_Consistency_btest.cpp
[100%] Built target PDEEulermitAVDiffusion3D_RANSSA_Consistency_btest_build_vera
Scanning dependencies of target PDEEulermitAVDiffusion3D_RANSSA_Consistency_btest_OBJECT
[100%] Building CXX object test/system/CodeConsistency/CMakeFiles/PDEEulermitAVDiffusion3D_RANSSA_Consistency_btest_OBJECT.dir/PDEEulermitAVDiffusion3D_RANSSA_Consistency_btest.cpp.o
[100%] Built target PDEEulermitAVDiffusion3D_RANSSA_Consistency_btest_OBJECT
Scanning dependencies of target PDEEulermitAVDiffusion3D_RANSSA_Consistency_btest_build
[100%] Linking CXX executable PDEEulermitAVDiffusion3D_RANSSA_Consistency_btest
[100%] Built target PDEEulermitAVDiffusion3D_RANSSA_Consistency_btest_build
Scanning dependencies of target BCEulermitAVDiffusion2D_Consistency_btest_OBJECT
[100%] Building CXX object test/system/CodeConsistency/CMakeFiles/BCEulermitAVDiffusion2D_Consistency_btest_OBJECT.dir/BCEulermitAVDiffusion2D_Consistency_btest.cpp.o
[100%] Built target BCEulermitAVDiffusion2D_Consistency_btest_OBJECT
Scanning dependencies of target BCEulermitAVDiffusion2D_Consistency_btest_build_vera
[100%] Checking style of test/system/CodeConsistency/BCEulermitAVDiffusion2D_Consistency_btest.cpp
[100%] Built target BCEulermitAVDiffusion2D_Consistency_btest_build_vera
Scanning dependencies of target BCEulermitAVDiffusion2D_Consistency_btest_build
[100%] Linking CXX executable BCEulermitAVDiffusion2D_Consistency_btest
[100%] Built target BCEulermitAVDiffusion2D_Consistency_btest_build
Scanning dependencies of target BCEulermitAVDiffusion3D_Consistency_RANSSA_btest_OBJECT
[100%] Building CXX object test/system/CodeConsistency/CMakeFiles/BCEulermitAVDiffusion3D_Consistency_RANSSA_btest_OBJECT.dir/BCEulermitAVDiffusion3D_Consistency_RANSSA_btest.cpp.o
[100%] Built target BCEulermitAVDiffusion3D_Consistency_RANSSA_btest_OBJECT
Scanning dependencies of target BCEulermitAVDiffusion3D_Consistency_RANSSA_btest_build_vera
[100%] Checking style of test/system/CodeConsistency/BCEulermitAVDiffusion3D_Consistency_RANSSA_btest.cpp
[100%] Built target BCEulermitAVDiffusion3D_Consistency_RANSSA_btest_build_vera
Scanning dependencies of target BCEulermitAVDiffusion3D_Consistency_RANSSA_btest_build
[100%] Linking CXX executable BCEulermitAVDiffusion3D_Consistency_RANSSA_btest
[100%] Built target BCEulermitAVDiffusion3D_Consistency_RANSSA_btest_build
Scanning dependencies of target Solve2D_Coupled4x4_IBL_Panel_NACA0004_FittedTransition_LineSearchNewton_btest_OBJECT
[100%] Building CXX object test/system/CodeConsistency/CMakeFiles/Solve2D_Coupled4x4_IBL_Panel_NACA0004_FittedTransition_LineSearchNewton_btest_OBJECT.dir/Solve2D_Coupled4x4_IBL_Panel_NACA0004_FittedTransition_LineSearchNewton_btest.cpp.o
[100%] Built target Solve2D_Coupled4x4_IBL_Panel_NACA0004_FittedTransition_LineSearchNewton_btest_OBJECT
Scanning dependencies of target Solve2D_Coupled4x4_IBL_Panel_NACA0004_FittedTransition_LineSearchNewton_btest_build_vera
[100%] Checking style of test/system/CodeConsistency/Solve2D_Coupled4x4_IBL_Panel_NACA0004_FittedTransition_LineSearchNewton_btest.cpp
[100%] Built target Solve2D_Coupled4x4_IBL_Panel_NACA0004_FittedTransition_LineSearchNewton_btest_build_vera
Scanning dependencies of target Solve2D_Coupled4x4_IBL_Panel_NACA0004_FittedTransition_LineSearchNewton_btest_build
[100%] Linking CXX executable Solve2D_Coupled4x4_IBL_Panel_NACA0004_FittedTransition_LineSearchNewton_btest
[100%] Built target Solve2D_Coupled4x4_IBL_Panel_NACA0004_FittedTransition_LineSearchNewton_btest_build
Scanning dependencies of target BCEulermitAVDiffusion2D_Consistency_RANSSA_btest_OBJECT
[100%] Building CXX object test/system/CodeConsistency/CMakeFiles/BCEulermitAVDiffusion2D_Consistency_RANSSA_btest_OBJECT.dir/BCEulermitAVDiffusion2D_Consistency_RANSSA_btest.cpp.o
[100%] Built target BCEulermitAVDiffusion2D_Consistency_RANSSA_btest_OBJECT
Scanning dependencies of target BCEulermitAVDiffusion2D_Consistency_RANSSA_btest_build_vera
[100%] Checking style of test/system/CodeConsistency/BCEulermitAVDiffusion2D_Consistency_RANSSA_btest.cpp
[100%] Built target BCEulermitAVDiffusion2D_Consistency_RANSSA_btest_build_vera
Scanning dependencies of target BCEulermitAVDiffusion2D_Consistency_RANSSA_btest_build
[100%] Linking CXX executable BCEulermitAVDiffusion2D_Consistency_RANSSA_btest
[100%] Built target BCEulermitAVDiffusion2D_Consistency_RANSSA_btest_build
Scanning dependencies of target Solve2D_Coupled4x4_IBLUniField_Panel_NACA0004_CapturedTransition_btest_build_vera
[100%] Checking style of test/system/CodeConsistency/Solve2D_Coupled4x4_IBLUniField_Panel_NACA0004_CapturedTransition_btest.cpp
[100%] Built target Solve2D_Coupled4x4_IBLUniField_Panel_NACA0004_CapturedTransition_btest_build_vera
Scanning dependencies of target Solve2D_Coupled4x4_IBLUniField_Panel_NACA0004_CapturedTransition_btest_OBJECT
[100%] Building CXX object test/system/CodeConsistency/CMakeFiles/Solve2D_Coupled4x4_IBLUniField_Panel_NACA0004_CapturedTransition_btest_OBJECT.dir/Solve2D_Coupled4x4_IBLUniField_Panel_NACA0004_CapturedTransition_btest.cpp.o
[100%] Built target Solve2D_Coupled4x4_IBLUniField_Panel_NACA0004_CapturedTransition_btest_OBJECT
Scanning dependencies of target Solve2D_Coupled4x4_IBLUniField_Panel_NACA0004_CapturedTransition_btest_build
[100%] Linking CXX executable Solve2D_Coupled4x4_IBLUniField_Panel_NACA0004_CapturedTransition_btest
[100%] Built target Solve2D_Coupled4x4_IBLUniField_Panel_NACA0004_CapturedTransition_btest_build
Scanning dependencies of target check_system_build
[100%] Built target check_system_build
Scanning dependencies of target memcheck_system
   Site: reynolds
   Build name: Linux-clang++-5.0
Create new tag: 20190713-0758 - Experimental
Test project /jenkins/workspace/SANS_Weekly/builddir/debug_clang/buildnode/reynolds/build/debug_clang
        Start 1630: SolverInterface_Galerkin_Stabilized_btest_memcheck
  1/106 Test #1630: SolverInterface_Galerkin_Stabilized_btest_memcheck ............................................   Passed  168.52 sec
        Start 1632: SolverInterface_DGAdvective_btest_memcheck
  2/106 Test #1632: SolverInterface_DGAdvective_btest_memcheck ....................................................   Passed  144.67 sec
        Start 1634: SolverInterface_DGBR2_btest_memcheck
  3/106 Test #1634: SolverInterface_DGBR2_btest_memcheck ..........................................................   Passed  188.52 sec
        Start 1636: ErrorOrder_2D_CG_Triangle_AD_btest_memcheck
  4/106 Test #1636: ErrorOrder_2D_CG_Triangle_AD_btest_memcheck ...................................................   Passed  132.24 sec
        Start 1638: ErrorOrder_2D_EDG_Triangle_AD_btest_memcheck
  5/106 Test #1638: ErrorOrder_2D_EDG_Triangle_AD_btest_memcheck ..................................................   Passed  219.91 sec
        Start 1640: ErrorOrder_3D_DGBR2_Sphere_Triangle_AD_btest_memcheck
  6/106 Test #1640: ErrorOrder_3D_DGBR2_Sphere_Triangle_AD_btest_memcheck .........................................   Passed  132.98 sec
        Start 1642: ErrorOrder_3D_CG_Tet_AD_btest_memcheck
  7/106 Test #1642: ErrorOrder_3D_CG_Tet_AD_btest_memcheck ........................................................   Passed  147.00 sec
        Start 1644: ErrorOrder_4D_DG_Pentatope_btest_memcheck
  8/106 Test #1644: ErrorOrder_4D_DG_Pentatope_btest_memcheck .....................................................***Timeout 3600.10 sec

        Start 1646: ErrorEstimateOrder_2D_HDG_Triangle_AD_btest_memcheck
  9/106 Test #1646: ErrorEstimateOrder_2D_HDG_Triangle_AD_btest_memcheck ..........................................   Passed  618.15 sec
        Start 1648: ErrorOrder_1D_DGBR2_BuckleyLeverett_ST_btest_memcheck
 10/106 Test #1648: ErrorOrder_1D_DGBR2_BuckleyLeverett_ST_btest_memcheck .........................................   Passed  514.42 sec
        Start 1650: ErrorOrder_1D_HDG_AD_btest_memcheck
 11/106 Test #1650: ErrorOrder_1D_HDG_AD_btest_memcheck ...........................................................   Passed   86.38 sec
        Start 1652: ErrorOrder_1D_HDG_AD_BDF_btest_memcheck
 12/106 Test #1652: ErrorOrder_1D_HDG_AD_BDF_btest_memcheck .......................................................   Passed  341.53 sec
        Start 1654: ErrorOrder_1D_DGBR2_AD_BDF_btest_memcheck
 13/106 Test #1654: ErrorOrder_1D_DGBR2_AD_BDF_btest_memcheck .....................................................   Passed  231.61 sec
        Start 1656: ErrorEstimateOrder_2D_DGAdvective_Triangle_AD_btest_memcheck
 14/106 Test #1656: ErrorEstimateOrder_2D_DGAdvective_Triangle_AD_btest_memcheck ..................................   Passed  551.01 sec
        Start 1658: ErrorEstimateOrder_1D_CG_Line_AD_btest_memcheck
 15/106 Test #1658: ErrorEstimateOrder_1D_CG_Line_AD_btest_memcheck ...............................................   Passed   83.92 sec
        Start 1660: Adjoint2D_HDG_Triangle_AD_sansLG_btest_memcheck
 16/106 Test #1660: Adjoint2D_HDG_Triangle_AD_sansLG_btest_memcheck ...............................................   Passed  275.21 sec
        Start 1662: Adjoint1D_DGBR2_BuckleyLeverett_ST_btest_memcheck
 17/106 Test #1662: Adjoint1D_DGBR2_BuckleyLeverett_ST_btest_memcheck .............................................   Passed  204.81 sec
        Start 1664: ErrorOrder_1D_CG_AD_btest_memcheck
 18/106 Test #1664: ErrorOrder_1D_CG_AD_btest_memcheck ............................................................   Passed   77.44 sec
        Start 1666: ErrorOrder_1D_DGBR2_TwoPhase_ST_btest_memcheck
 19/106 Test #1666: ErrorOrder_1D_DGBR2_TwoPhase_ST_btest_memcheck ................................................   Passed  206.10 sec
        Start 1668: Adjoint2D_DGAdvective_Triangle_AD_btest_memcheck
 20/106 Test #1668: Adjoint2D_DGAdvective_Triangle_AD_btest_memcheck ..............................................   Passed  103.97 sec
        Start 1670: Solve2D_DGAdvective_LinearRobin_mitLG_sansLG_Consistency_AD_btest_memcheck
 21/106 Test #1670: Solve2D_DGAdvective_LinearRobin_mitLG_sansLG_Consistency_AD_btest_memcheck ....................   Passed   88.54 sec
        Start 1672: ErrorOrder_2D_HDG_Triangle_AD_btest_memcheck
 22/106 Test #1672: ErrorOrder_2D_HDG_Triangle_AD_btest_memcheck ..................................................   Passed  151.04 sec
        Start 1674: ErrorOrder_1D_HDGAdvective_Advection_btest_memcheck
 23/106 Test #1674: ErrorOrder_1D_HDGAdvective_Advection_btest_memcheck ...........................................   Passed   77.75 sec
        Start 1676: ErrorOrder_1D_CG_AD_BDF_btest_memcheck
 24/106 Test #1676: ErrorOrder_1D_CG_AD_BDF_btest_memcheck ........................................................   Passed  520.98 sec
        Start 1678: ErrorOrder_3D_CG_Sphere_Triangle_AD_btest_memcheck
 25/106 Test #1678: ErrorOrder_3D_CG_Sphere_Triangle_AD_btest_memcheck ............................................   Passed   94.15 sec
        Start 1680: ErrorEstimateOrder_1D_DGBR2_Line_AD_btest_memcheck
 26/106 Test #1680: ErrorEstimateOrder_1D_DGBR2_Line_AD_btest_memcheck ............................................   Passed   73.69 sec
        Start 1682: ErrorOrder_3D_CG_Hex_AD_btest_memcheck
 27/106 Test #1682: ErrorOrder_3D_CG_Hex_AD_btest_memcheck ........................................................   Passed   89.88 sec
        Start 1684: ErrorOrder_1D_HDG_Burgers_btest_memcheck
 28/106 Test #1684: ErrorOrder_1D_HDG_Burgers_btest_memcheck ......................................................   Passed  944.24 sec
        Start 1686: ErrorEstimateOrder_2D_CG_Nodal_Triangle_AD_btest_memcheck
 29/106 Test #1686: ErrorEstimateOrder_2D_CG_Nodal_Triangle_AD_btest_memcheck .....................................   Passed  499.81 sec
        Start 1688: ErrorOrder_1D_DGBR2_Burgers_btest_memcheck
 30/106 Test #1688: ErrorOrder_1D_DGBR2_Burgers_btest_memcheck ....................................................   Passed  202.40 sec
        Start 1690: ErrorOrder_2D_DGAdvective_Flat_Line_AD_btest_memcheck
 31/106 Test #1690: ErrorOrder_2D_DGAdvective_Flat_Line_AD_btest_memcheck .........................................   Passed   69.05 sec
        Start 1692: ErrorOrder_3D_DGBR2_Tet_AD_btest_memcheck
 32/106 Test #1692: ErrorOrder_3D_DGBR2_Tet_AD_btest_memcheck .....................................................   Passed   78.37 sec
        Start 1694: ErrorOrder_1D_DGBR2_AD_btest_memcheck
 33/106 Test #1694: ErrorOrder_1D_DGBR2_AD_btest_memcheck .........................................................   Passed   72.91 sec
        Start 1696: ErrorOrder_2D_DGAdvective_Annulus_Triangle_btest_memcheck
 34/106 Test #1696: ErrorOrder_2D_DGAdvective_Annulus_Triangle_btest_memcheck .....................................   Passed   69.77 sec
        Start 1698: ErrorEstimateOrder_2D_CG_Triangle_RD_btest_memcheck
 35/106 Test #1698: ErrorEstimateOrder_2D_CG_Triangle_RD_btest_memcheck ...........................................   Passed  236.31 sec
        Start 1700: ErrorOrder_2D_DGAdvective_Circle_Line_AD_btest_memcheck
 36/106 Test #1700: ErrorOrder_2D_DGAdvective_Circle_Line_AD_btest_memcheck .......................................   Passed   76.79 sec
        Start 1702: ErrorOrder_2D_CG_Quad_AD_btest_memcheck
 37/106 Test #1702: ErrorOrder_2D_CG_Quad_AD_btest_memcheck .......................................................   Passed   78.41 sec
        Start 1704: ErrorEstimateOrder_2D_DGBR2_Triangle_AD_btest_memcheck
 38/106 Test #1704: ErrorEstimateOrder_2D_DGBR2_Triangle_AD_btest_memcheck ........................................   Passed  222.43 sec
        Start 1706: ErrorOrder_2D_DGAdvective_Circle_Line_ShallowWater_btest_memcheck
 39/106 Test #1706: ErrorOrder_2D_DGAdvective_Circle_Line_ShallowWater_btest_memcheck .............................   Passed   68.52 sec
        Start 1708: ErrorEstimateOrder_2D_CG_Triangle_AD_btest_memcheck
 40/106 Test #1708: ErrorEstimateOrder_2D_CG_Triangle_AD_btest_memcheck ...........................................   Passed  504.95 sec
        Start 1710: ErrorOrder_2D_DGBR2_Triangle_AD_btest_memcheck
 41/106 Test #1710: ErrorOrder_2D_DGBR2_Triangle_AD_btest_memcheck ................................................   Passed   83.99 sec
        Start 1712: ErrorOrder_1D_DGAdvective_ShallowWater_btest_memcheck
 42/106 Test #1712: ErrorOrder_1D_DGAdvective_ShallowWater_btest_memcheck .........................................   Passed   68.91 sec
        Start 1714: ErrorOrder_3D_DGBR2_Periodic_Hex_AD_btest_memcheck
 43/106 Test #1714: ErrorOrder_3D_DGBR2_Periodic_Hex_AD_btest_memcheck ............................................   Passed   71.84 sec
        Start 1716: ErrorOrder_1D_DGBR2_AD_HB_btest_memcheck
 44/106 Test #1716: ErrorOrder_1D_DGBR2_AD_HB_btest_memcheck ......................................................   Passed   83.81 sec
        Start 1718: ErrorOrder_2D_DGAdvective_Annulus_Quad_btest_memcheck
 45/106 Test #1718: ErrorOrder_2D_DGAdvective_Annulus_Quad_btest_memcheck .........................................   Passed   74.02 sec
        Start 1720: ErrorOrder_2D_CGStabilized_RANS_MMS_btest_memcheck
 46/106 Test #1720: ErrorOrder_2D_CGStabilized_RANS_MMS_btest_memcheck ............................................   Passed  119.22 sec
        Start 1722: Adjoint2D_HDG_Triangle_AD_mitState_btest_memcheck
 47/106 Test #1722: Adjoint2D_HDG_Triangle_AD_mitState_btest_memcheck .............................................   Passed  285.57 sec
        Start 1724: ErrorOrder_2D_DGBR2_RANS_MMS_btest_memcheck
 48/106 Test #1724: ErrorOrder_2D_DGBR2_RANS_MMS_btest_memcheck ...................................................   Passed  113.34 sec
        Start 1726: Adjoint2D_DGBR2_Triangle_AD_btest_memcheck
 49/106 Test #1726: Adjoint2D_DGBR2_Triangle_AD_btest_memcheck ....................................................   Passed   74.93 sec
        Start 1728: Adjoint2D_CG_Triangle_AD_btest_memcheck
 50/106 Test #1728: Adjoint2D_CG_Triangle_AD_btest_memcheck .......................................................   Passed   68.52 sec
        Start 1730: ElementLocalSolve3D_DGBR2_Tet_AD_btest_memcheck
 51/106 Test #1730: ElementLocalSolve3D_DGBR2_Tet_AD_btest_memcheck ...............................................   Passed  281.29 sec
        Start 1732: LocalSolve3D_HDG_Tet_AD_btest_memcheck
 52/106 Test #1732: LocalSolve3D_HDG_Tet_AD_btest_memcheck ........................................................   Passed  677.85 sec
        Start 1734: LocalSolve3D_Split_HDG_Tet_AD_btest_memcheck
 53/106 Test #1734: LocalSolve3D_Split_HDG_Tet_AD_btest_memcheck ..................................................   Passed  562.59 sec
        Start 1736: EdgeLocalSolve3D_Dual_Galerkin_Stabilized_AD_btest_memcheck
 54/106 Test #1736: EdgeLocalSolve3D_Dual_Galerkin_Stabilized_AD_btest_memcheck ...................................   Passed  312.88 sec
        Start 1738: EdgeLocalSolve2D_Dual_Galerkin_Stabilized_AR_btest_memcheck
 55/106 Test #1738: EdgeLocalSolve2D_Dual_Galerkin_Stabilized_AR_btest_memcheck ...................................   Passed  336.94 sec
        Start 1740: EdgeLocalSolve2D_Dual_Galerkin_Stabilized_Euler_btest_memcheck
 56/106 Test #1740: EdgeLocalSolve2D_Dual_Galerkin_Stabilized_Euler_btest_memcheck ................................   Passed   74.40 sec
        Start 1742: LocalSolve2D_Split_HDG_Triangle_AD_btest_memcheck
 57/106 Test #1742: LocalSolve2D_Split_HDG_Triangle_AD_btest_memcheck .............................................   Passed  113.49 sec
        Start 1744: LocalSolve1D_Split_DGBR2_AD_btest_memcheck
 58/106 Test #1744: LocalSolve1D_Split_DGBR2_AD_btest_memcheck ....................................................   Passed   72.18 sec
        Start 1746: LocalSolve1D_HDG_AD_btest_memcheck
 59/106 Test #1746: LocalSolve1D_HDG_AD_btest_memcheck ............................................................   Passed   75.79 sec
        Start 1748: LocalSolve2D_HDG_Triangle_AD_btest_memcheck
 60/106 Test #1748: LocalSolve2D_HDG_Triangle_AD_btest_memcheck ...................................................   Passed  115.50 sec
        Start 1750: ElementLocalSolve1D_DGBR2_Triangle_AD_btest_memcheck
 61/106 Test #1750: ElementLocalSolve1D_DGBR2_Triangle_AD_btest_memcheck ..........................................   Passed   78.42 sec
        Start 1752: LocalSolve1D_Split_HDG_AD_btest_memcheck
 62/106 Test #1752: LocalSolve1D_Split_HDG_AD_btest_memcheck ......................................................   Passed   81.30 sec
        Start 1754: LocalSolve2D_Split_DGBR2_Triangle_AD_AV_btest_memcheck
 63/106 Test #1754: LocalSolve2D_Split_DGBR2_Triangle_AD_AV_btest_memcheck ........................................   Passed  359.67 sec
        Start 1756: ElementLocalSolve3D_DGAdvective_Tet_AD_btest_memcheck
 64/106 Test #1756: ElementLocalSolve3D_DGAdvective_Tet_AD_btest_memcheck .........................................   Passed  157.10 sec
        Start 1758: EdgeLocalSolve1D_Dual_Galerkin_Stabilized_Line_AD_btest_memcheck
 65/106 Test #1758: EdgeLocalSolve1D_Dual_Galerkin_Stabilized_Line_AD_btest_memcheck ..............................   Passed   81.52 sec
        Start 1760: ElementDualLocalSolve3D_Galerkin_Stabilized_Triangle_AD_btest_memcheck
 66/106 Test #1760: ElementDualLocalSolve3D_Galerkin_Stabilized_Triangle_AD_btest_memcheck ........................   Passed  1966.91 sec
        Start 1762: EdgeLocalSolve2D_Dual_Galerkin_Stabilized_AD_btest_memcheck
 67/106 Test #1762: EdgeLocalSolve2D_Dual_Galerkin_Stabilized_AD_btest_memcheck ...................................   Passed  503.79 sec
        Start 1764: ElementLocalSolve2D_DGBR2_Triangle_AD_btest_memcheck
 68/106 Test #1764: ElementLocalSolve2D_DGBR2_Triangle_AD_btest_memcheck ..........................................   Passed  252.23 sec
        Start 1766: ElementDualLocalSolve2D_Galerkin_Stabilized_Triangle_AD_btest_memcheck
 69/106 Test #1766: ElementDualLocalSolve2D_Galerkin_Stabilized_Triangle_AD_btest_memcheck ........................   Passed  276.64 sec
        Start 1768: Block_1D_Decoupled_Burgers_btest_memcheck
 70/106 Test #1768: Block_1D_Decoupled_Burgers_btest_memcheck .....................................................   Passed  640.05 sec
        Start 1770: Block_1D_Decoupled_AD_btest_memcheck
 71/106 Test #1770: Block_1D_Decoupled_AD_btest_memcheck ..........................................................   Passed   62.64 sec
        Start 1772: AnalyticSolve2D_HDG_Triangle_NavierStokes_UniformStream_btest_memcheck
 72/106 Test #1772: AnalyticSolve2D_HDG_Triangle_NavierStokes_UniformStream_btest_memcheck ........................   Passed   73.41 sec
        Start 1774: AnalyticSolve2D_DGAdvective_IBL_StagnationFlow_SingleElem_LamiBL_btest_memcheck
 73/106 Test #1774: AnalyticSolve2D_DGAdvective_IBL_StagnationFlow_SingleElem_LamiBL_btest_memcheck ...............   Passed   75.02 sec
        Start 1776: AnalyticSolve2D_HDG_Triangle_NavierStokes_btest_memcheck
 74/106 Test #1776: AnalyticSolve2D_HDG_Triangle_NavierStokes_btest_memcheck ......................................   Passed  511.04 sec
        Start 1778: AnalyticSolve2D_DGBR2_Triangle_NavierStokes_UniformStream_btest_memcheck
 75/106 Test #1778: AnalyticSolve2D_DGBR2_Triangle_NavierStokes_UniformStream_btest_memcheck ......................   Passed   66.06 sec
        Start 1780: AnalyticSolve2D_DGAdvective_Triangle_Euler_UniformStream_btest_memcheck
 76/106 Test #1780: AnalyticSolve2D_DGAdvective_Triangle_Euler_UniformStream_btest_memcheck .......................   Passed  108.09 sec
        Start 1782: AnalyticSolve2D_DGAdvective_IBL_StagnationFlow_LamiBL_btest_memcheck
 77/106 Test #1782: AnalyticSolve2D_DGAdvective_IBL_StagnationFlow_LamiBL_btest_memcheck ..........................   Passed   72.38 sec
        Start 1784: AnalyticSolve_HDG_AD_btest_memcheck
 78/106 Test #1784: AnalyticSolve_HDG_AD_btest_memcheck ...........................................................   Passed   66.30 sec
        Start 1786: AnalyticSolve2D_DGBR2_Triangle_NavierStokes_btest_memcheck
 79/106 Test #1786: AnalyticSolve2D_DGBR2_Triangle_NavierStokes_btest_memcheck ....................................   Passed   98.32 sec
        Start 1788: BCEulermitAVDiffusion3D_Consistency_btest_memcheck
 80/106 Test #1788: BCEulermitAVDiffusion3D_Consistency_btest_memcheck ............................................   Passed    7.12 sec
        Start 1790: Solve2D_Uncoupled_DGAdvectiveIBLUniField_NACA0004_LamiBL_btest_memcheck
 81/106 Test #1790: Solve2D_Uncoupled_DGAdvectiveIBLUniField_NACA0004_LamiBL_btest_memcheck .......................   Passed  140.02 sec
        Start 1792: Solve2D_Coupled4x4_HDGAdv_IBL_Panel_NACA0004_LamiBL_TurbWake_btest_memcheck
 82/106 Test #1792: Solve2D_Coupled4x4_HDGAdv_IBL_Panel_NACA0004_LamiBL_TurbWake_btest_memcheck ...................   Passed  666.20 sec
        Start 1794: Solve2D_Coupled4x4_IBLUniField_Panel_NACA0004_LamiBL_TurbWakeXfoilLagClosure_btest_memcheck
 83/106 Test #1794: Solve2D_Coupled4x4_IBLUniField_Panel_NACA0004_LamiBL_TurbWakeXfoilLagClosure_btest_memcheck ...   Passed  628.00 sec
        Start 1796: Solve2D_Coupled4x4_IBLUniField_LamiBL_TurbWake_PTC_btest_memcheck
 84/106 Test #1796: Solve2D_Coupled4x4_IBLUniField_LamiBL_TurbWake_PTC_btest_memcheck .............................   Passed  1269.36 sec
        Start 1798: Solve2D_Uncoupled_DGAdvectiveIBL_NACA0004_LamiBL_btest_memcheck
 85/106 Test #1798: Solve2D_Uncoupled_DGAdvectiveIBL_NACA0004_LamiBL_btest_memcheck ...............................   Passed  203.12 sec
        Start 1800: PDEmitAVSensor2D_Consistency_RANSSA_btest_memcheck
 86/106 Test #1800: PDEmitAVSensor2D_Consistency_RANSSA_btest_memcheck ............................................   Passed   11.16 sec
        Start 1802: Solve2D_Uncoupled_DGAdvectiveIBL_NACA0004_LamiBL_PTC_btest_memcheck
 87/106 Test #1802: Solve2D_Uncoupled_DGAdvectiveIBL_NACA0004_LamiBL_PTC_btest_memcheck ...........................   Passed  625.40 sec
        Start 1804: BCEulermitAVDiffusion2D_Consistency_btest_memcheck
 88/106 Test #1804: BCEulermitAVDiffusion2D_Consistency_btest_memcheck ............................................   Passed    9.76 sec
        Start 1806: Solve2D_Coupled4x4_IBL_Panel_NACA0004_LamiBL_TurbWakeXfoilLagClosure_btest_memcheck
 89/106 Test #1806: Solve2D_Coupled4x4_IBL_Panel_NACA0004_LamiBL_TurbWakeXfoilLagClosure_btest_memcheck ...........   Passed  1358.70 sec
        Start 1808: PDEmitAVSensor1D_Consistency_btest_memcheck
 90/106 Test #1808: PDEmitAVSensor1D_Consistency_btest_memcheck ...................................................   Passed    6.71 sec
        Start 1810: PDEEulermitAVDiffusion3D_RANSSA_Consistency_btest_memcheck
 91/106 Test #1810: PDEEulermitAVDiffusion3D_RANSSA_Consistency_btest_memcheck ....................................   Passed    6.49 sec
        Start 1812: Solve2D_Uncoupled_HDGAdvectiveIBL_NACA0004_LamiBL_btest_memcheck
 92/106 Test #1812: Solve2D_Uncoupled_HDGAdvectiveIBL_NACA0004_LamiBL_btest_memcheck ..............................   Passed  159.12 sec
        Start 1814: PDEEulermitAVDiffusion3D_Consistency_btest_memcheck
 93/106 Test #1814: PDEEulermitAVDiffusion3D_Consistency_btest_memcheck ...........................................   Passed    6.99 sec
        Start 1816: Solve2D_Coupled4x4_IBL_Panel_NACA0004_FittedTransition_Forced_btest_memcheck
 94/106 Test #1816: Solve2D_Coupled4x4_IBL_Panel_NACA0004_FittedTransition_Forced_btest_memcheck ..................   Passed  2186.81 sec
        Start 1818: Solve2D_Coupled4x4_IBL_Panel_NACA0004_FittedTransition_TwoLayerNewton_btest_memcheck
 95/106 Test #1818: Solve2D_Coupled4x4_IBL_Panel_NACA0004_FittedTransition_TwoLayerNewton_btest_memcheck ..........   Passed  1402.60 sec
        Start 1820: BCEulermitAVDiffusion2D_Consistency_RANSSA_btest_memcheck
 96/106 Test #1820: BCEulermitAVDiffusion2D_Consistency_RANSSA_btest_memcheck .....................................   Passed   12.14 sec
        Start 1822: Solve2D_Coupled4x4_IBLUniField_Panel_NACA0004_CapturedTransition_btest_memcheck
 97/106 Test #1822: Solve2D_Coupled4x4_IBLUniField_Panel_NACA0004_CapturedTransition_btest_memcheck ...............   Passed  1299.49 sec
        Start 1824: BCEulermitAVDiffusion3D_Consistency_RANSSA_btest_memcheck
 98/106 Test #1824: BCEulermitAVDiffusion3D_Consistency_RANSSA_btest_memcheck .....................................   Passed    7.26 sec
        Start 1826: PDEEulermitAVDiffusion1D_Consistency_btest_memcheck
 99/106 Test #1826: PDEEulermitAVDiffusion1D_Consistency_btest_memcheck ...........................................   Passed    6.58 sec
        Start 1828: PDEEulermitAVDiffusion2D_RANSSA_Consistency_btest_memcheck
100/106 Test #1828: PDEEulermitAVDiffusion2D_RANSSA_Consistency_btest_memcheck ....................................   Passed    6.39 sec
        Start 1830: Solve2D_Coupled4x4_IBL_Panel_NACA0004_FittedTransition_LineSearchNewton_btest_memcheck
101/106 Test #1830: Solve2D_Coupled4x4_IBL_Panel_NACA0004_FittedTransition_LineSearchNewton_btest_memcheck ........   Passed  799.90 sec
        Start 1832: PDEmitAVSensor2D_Consistency_btest_memcheck
102/106 Test #1832: PDEmitAVSensor2D_Consistency_btest_memcheck ...................................................   Passed   10.54 sec
        Start 1834: PDEmitAVSensor3D_Consistency_RANSSA_btest_memcheck
103/106 Test #1834: PDEmitAVSensor3D_Consistency_RANSSA_btest_memcheck ............................................   Passed    8.34 sec
        Start 1836: Solve2D_XfoilLikePanelMethod_btest_memcheck
104/106 Test #1836: Solve2D_XfoilLikePanelMethod_btest_memcheck ...................................................   Passed  643.40 sec
        Start 1838: PDEmitAVSensor3D_Consistency_btest_memcheck
105/106 Test #1838: PDEmitAVSensor3D_Consistency_btest_memcheck ...................................................   Passed   10.61 sec
        Start 1840: PDEEulermitAVDiffusion2D_Consistency_btest_memcheck
106/106 Test #1840: PDEEulermitAVDiffusion2D_Consistency_btest_memcheck ...........................................   Passed    7.75 sec

99% tests passed, 1 tests failed out of 106

Label Time Summary:
SANSMemCheck_system    = 32946.43 sec (106 tests)

Total Test time (real) = 32949.83 sec

The following tests FAILED:
	1644 - ErrorOrder_4D_DG_Pentatope_btest_memcheck (Timeout)
Errors while running CTest
test/system/CMakeFiles/memcheck_system.dir/build.make:57: recipe for target 'test/system/CMakeFiles/memcheck_system' failed
make[3]: *** [test/system/CMakeFiles/memcheck_system] Error 8
CMakeFiles/Makefile2:169822: recipe for target 'test/system/CMakeFiles/memcheck_system.dir/all' failed
make[2]: *** [test/system/CMakeFiles/memcheck_system.dir/all] Error 2
CMakeFiles/Makefile2:169829: recipe for target 'test/system/CMakeFiles/memcheck_system.dir/rule' failed
make[1]: *** [test/system/CMakeFiles/memcheck_system.dir/rule] Error 2
Makefile:59531: recipe for target 'memcheck_system' failed
make: *** [memcheck_system] Error 2

real	631m3.264s
user	600m14.132s
sys	7m44.320s
+ status=1
++ find /jenkins/workspace/SANS_Weekly/builddir/debug_clang/buildnode/reynolds/build/debug_clang -name Test.xml
+ mv /jenkins/workspace/SANS_Weekly/builddir/debug_clang/buildnode/reynolds/build/debug_clang/Testing/20190713-0758/Test.xml /jenkins/workspace/SANS_Weekly/builddir/debug_clang/buildnode/reynolds/build/Test_system_memcheck.xml
+ '[' 1 -eq 1 ']'
+ exit 1
Build step 'Execute shell' marked build as failure
[WARNINGS] Skipping publisher since build result is FAILURE
[Valgrind] Files to copy:
[Valgrind] build/debug_clang/test/valgrind.10239.memcheck.xml
[Valgrind] build/debug_clang/test/valgrind.10355.memcheck.xml
[Valgrind] build/debug_clang/test/valgrind.1078.memcheck.xml
[Valgrind] build/debug_clang/test/valgrind.11871.memcheck.xml
[Valgrind] build/debug_clang/test/valgrind.12129.memcheck.xml
[Valgrind] build/debug_clang/test/valgrind.1219.memcheck.xml
[Valgrind] build/debug_clang/test/valgrind.1221.memcheck.xml
[Valgrind] build/debug_clang/test/valgrind.1230.memcheck.xml
[Valgrind] build/debug_clang/test/valgrind.1232.memcheck.xml
[Valgrind] build/debug_clang/test/valgrind.12349.memcheck.xml
[Valgrind] build/debug_clang/test/valgrind.1342.memcheck.xml
[Valgrind] build/debug_clang/test/valgrind.14433.memcheck.xml
[Valgrind] build/debug_clang/test/valgrind.15066.memcheck.xml
[Valgrind] build/debug_clang/test/valgrind.15899.memcheck.xml
[Valgrind] build/debug_clang/test/valgrind.16768.memcheck.xml
[Valgrind] build/debug_clang/test/valgrind.16835.memcheck.xml
[Valgrind] build/debug_clang/test/valgrind.17886.memcheck.xml
[Valgrind] build/debug_clang/test/valgrind.1831.memcheck.xml
[Valgrind] build/debug_clang/test/valgrind.18328.memcheck.xml
[Valgrind] build/debug_clang/test/valgrind.18814.memcheck.xml
[Valgrind] build/debug_clang/test/valgrind.18832.memcheck.xml
[Valgrind] build/debug_clang/test/valgrind.19164.memcheck.xml
[Valgrind] build/debug_clang/test/valgrind.19783.memcheck.xml
[Valgrind] build/debug_clang/test/valgrind.22008.memcheck.xml
[Valgrind] build/debug_clang/test/valgrind.2226.memcheck.xml
[Valgrind] build/debug_clang/test/valgrind.23368.memcheck.xml
[Valgrind] build/debug_clang/test/valgrind.23621.memcheck.xml
[Valgrind] build/debug_clang/test/valgrind.23979.memcheck.xml
[Valgrind] build/debug_clang/test/valgrind.24788.memcheck.xml
[Valgrind] build/debug_clang/test/valgrind.24964.memcheck.xml
[Valgrind] build/debug_clang/test/valgrind.25168.memcheck.xml
[Valgrind] build/debug_clang/test/valgrind.25305.memcheck.xml
[Valgrind] build/debug_clang/test/valgrind.25555.memcheck.xml
[Valgrind] build/debug_clang/test/valgrind.25662.memcheck.xml
[Valgrind] build/debug_clang/test/valgrind.25674.memcheck.xml
[Valgrind] build/debug_clang/test/valgrind.26034.memcheck.xml
[Valgrind] build/debug_clang/test/valgrind.26094.memcheck.xml
[Valgrind] build/debug_clang/test/valgrind.26128.memcheck.xml
[Valgrind] build/debug_clang/test/valgrind.26183.memcheck.xml
[Valgrind] build/debug_clang/test/valgrind.26390.memcheck.xml
[Valgrind] build/debug_clang/test/valgrind.27039.memcheck.xml
[Valgrind] build/debug_clang/test/valgrind.27353.memcheck.xml
[Valgrind] build/debug_clang/test/valgrind.27411.memcheck.xml
[Valgrind] build/debug_clang/test/valgrind.27438.memcheck.xml
[Valgrind] build/debug_clang/test/valgrind.27474.memcheck.xml
[Valgrind] build/debug_clang/test/valgrind.27495.memcheck.xml
[Valgrind] build/debug_clang/test/valgrind.27513.memcheck.xml
[Valgrind] build/debug_clang/test/valgrind.27544.memcheck.xml
[Valgrind] build/debug_clang/test/valgrind.27545.memcheck.xml
[Valgrind] build/debug_clang/test/valgrind.27604.memcheck.xml
[Valgrind] build/debug_clang/test/valgrind.27813.memcheck.xml
[Valgrind] build/debug_clang/test/valgrind.28008.memcheck.xml
[Valgrind] build/debug_clang/test/valgrind.28799.memcheck.xml
[Valgrind] build/debug_clang/test/valgrind.28926.memcheck.xml
[Valgrind] build/debug_clang/test/valgrind.29078.memcheck.xml
[Valgrind] build/debug_clang/test/valgrind.29547.memcheck.xml
[Valgrind] build/debug_clang/test/valgrind.29855.memcheck.xml
[Valgrind] build/debug_clang/test/valgrind.29869.memcheck.xml
[Valgrind] build/debug_clang/test/valgrind.30834.memcheck.xml
[Valgrind] build/debug_clang/test/valgrind.30856.memcheck.xml
[Valgrind] build/debug_clang/test/valgrind.31297.memcheck.xml
[Valgrind] build/debug_clang/test/valgrind.31542.memcheck.xml
[Valgrind] build/debug_clang/test/valgrind.31875.memcheck.xml
[Valgrind] build/debug_clang/test/valgrind.32377.memcheck.xml
[Valgrind] build/debug_clang/test/valgrind.32379.memcheck.xml
[Valgrind] build/debug_clang/test/valgrind.32380.memcheck.xml
[Valgrind] build/debug_clang/test/valgrind.32436.memcheck.xml
[Valgrind] build/debug_clang/test/valgrind.32440.memcheck.xml
[Valgrind] build/debug_clang/test/valgrind.32631.memcheck.xml
[Valgrind] build/debug_clang/test/valgrind.32661.memcheck.xml
[Valgrind] build/debug_clang/test/valgrind.33155.memcheck.xml
[Valgrind] build/debug_clang/test/valgrind.35218.memcheck.xml
[Valgrind] build/debug_clang/test/valgrind.35252.memcheck.xml
[Valgrind] build/debug_clang/test/valgrind.35283.memcheck.xml
[Valgrind] build/debug_clang/test/valgrind.35487.memcheck.xml
[Valgrind] build/debug_clang/test/valgrind.36324.memcheck.xml
[Valgrind] build/debug_clang/test/valgrind.36529.memcheck.xml
[Valgrind] build/debug_clang/test/valgrind.36947.memcheck.xml
[Valgrind] build/debug_clang/test/valgrind.37456.memcheck.xml
[Valgrind] build/debug_clang/test/valgrind.37842.memcheck.xml
[Valgrind] build/debug_clang/test/valgrind.37848.memcheck.xml
[Valgrind] build/debug_clang/test/valgrind.37903.memcheck.xml
[Valgrind] build/debug_clang/test/valgrind.38918.memcheck.xml
[Valgrind] build/debug_clang/test/valgrind.38929.memcheck.xml
[Valgrind] build/debug_clang/test/valgrind.39380.memcheck.xml
[Valgrind] build/debug_clang/test/valgrind.39723.memcheck.xml
[Valgrind] build/debug_clang/test/valgrind.40070.memcheck.xml
[Valgrind] build/debug_clang/test/valgrind.40375.memcheck.xml
[Valgrind] build/debug_clang/test/valgrind.40572.memcheck.xml
[Valgrind] build/debug_clang/test/valgrind.40914.memcheck.xml
[Valgrind] build/debug_clang/test/valgrind.4409.memcheck.xml
[Valgrind] build/debug_clang/test/valgrind.506.memcheck.xml
[Valgrind] build/debug_clang/test/valgrind.5165.memcheck.xml
[Valgrind] build/debug_clang/test/valgrind.5187.memcheck.xml
[Valgrind] build/debug_clang/test/valgrind.6003.memcheck.xml
[Valgrind] build/debug_clang/test/valgrind.6116.memcheck.xml
[Valgrind] build/debug_clang/test/valgrind.6243.memcheck.xml
[Valgrind] build/debug_clang/test/valgrind.6528.memcheck.xml
[Valgrind] build/debug_clang/test/valgrind.6869.memcheck.xml
[Valgrind] build/debug_clang/test/valgrind.6874.memcheck.xml
[Valgrind] build/debug_clang/test/valgrind.7095.memcheck.xml
[Valgrind] build/debug_clang/test/valgrind.7113.memcheck.xml
[Valgrind] build/debug_clang/test/valgrind.7252.memcheck.xml
[Valgrind] build/debug_clang/test/valgrind.8898.memcheck.xml
[Valgrind] build/debug_clang/test/valgrind.8904.memcheck.xml
[Valgrind] build/debug_clang/test/valgrind.8958.memcheck.xml
[Valgrind] Copying build/debug_clang/test/valgrind.10239.memcheck.xml to /var/lib/jenkins/jobs/SANS_Weekly/configurations/axis-builddir/debug_clang/axis-buildnode/reynolds/builds/245/valgrind-plugin/valgrind-results/build/debug_clang/test/valgrind.10239.memcheck.xml
[Valgrind] Copying build/debug_clang/test/valgrind.10355.memcheck.xml to /var/lib/jenkins/jobs/SANS_Weekly/configurations/axis-builddir/debug_clang/axis-buildnode/reynolds/builds/245/valgrind-plugin/valgrind-results/build/debug_clang/test/valgrind.10355.memcheck.xml
[Valgrind] Copying build/debug_clang/test/valgrind.1078.memcheck.xml to /var/lib/jenkins/jobs/SANS_Weekly/configurations/axis-builddir/debug_clang/axis-buildnode/reynolds/builds/245/valgrind-plugin/valgrind-results/build/debug_clang/test/valgrind.1078.memcheck.xml
[Valgrind] Copying build/debug_clang/test/valgrind.11871.memcheck.xml to /var/lib/jenkins/jobs/SANS_Weekly/configurations/axis-builddir/debug_clang/axis-buildnode/reynolds/builds/245/valgrind-plugin/valgrind-results/build/debug_clang/test/valgrind.11871.memcheck.xml
[Valgrind] Copying build/debug_clang/test/valgrind.12129.memcheck.xml to /var/lib/jenkins/jobs/SANS_Weekly/configurations/axis-builddir/debug_clang/axis-buildnode/reynolds/builds/245/valgrind-plugin/valgrind-results/build/debug_clang/test/valgrind.12129.memcheck.xml
[Valgrind] Copying build/debug_clang/test/valgrind.1219.memcheck.xml to /var/lib/jenkins/jobs/SANS_Weekly/configurations/axis-builddir/debug_clang/axis-buildnode/reynolds/builds/245/valgrind-plugin/valgrind-results/build/debug_clang/test/valgrind.1219.memcheck.xml
[Valgrind] Copying build/debug_clang/test/valgrind.1221.memcheck.xml to /var/lib/jenkins/jobs/SANS_Weekly/configurations/axis-builddir/debug_clang/axis-buildnode/reynolds/builds/245/valgrind-plugin/valgrind-results/build/debug_clang/test/valgrind.1221.memcheck.xml
[Valgrind] Copying build/debug_clang/test/valgrind.1230.memcheck.xml to /var/lib/jenkins/jobs/SANS_Weekly/configurations/axis-builddir/debug_clang/axis-buildnode/reynolds/builds/245/valgrind-plugin/valgrind-results/build/debug_clang/test/valgrind.1230.memcheck.xml
[Valgrind] Copying build/debug_clang/test/valgrind.1232.memcheck.xml to /var/lib/jenkins/jobs/SANS_Weekly/configurations/axis-builddir/debug_clang/axis-buildnode/reynolds/builds/245/valgrind-plugin/valgrind-results/build/debug_clang/test/valgrind.1232.memcheck.xml
[Valgrind] Copying build/debug_clang/test/valgrind.12349.memcheck.xml to /var/lib/jenkins/jobs/SANS_Weekly/configurations/axis-builddir/debug_clang/axis-buildnode/reynolds/builds/245/valgrind-plugin/valgrind-results/build/debug_clang/test/valgrind.12349.memcheck.xml
[Valgrind] Copying build/debug_clang/test/valgrind.1342.memcheck.xml to /var/lib/jenkins/jobs/SANS_Weekly/configurations/axis-builddir/debug_clang/axis-buildnode/reynolds/builds/245/valgrind-plugin/valgrind-results/build/debug_clang/test/valgrind.1342.memcheck.xml
[Valgrind] Copying build/debug_clang/test/valgrind.14433.memcheck.xml to /var/lib/jenkins/jobs/SANS_Weekly/configurations/axis-builddir/debug_clang/axis-buildnode/reynolds/builds/245/valgrind-plugin/valgrind-results/build/debug_clang/test/valgrind.14433.memcheck.xml
[Valgrind] Copying build/debug_clang/test/valgrind.15066.memcheck.xml to /var/lib/jenkins/jobs/SANS_Weekly/configurations/axis-builddir/debug_clang/axis-buildnode/reynolds/builds/245/valgrind-plugin/valgrind-results/build/debug_clang/test/valgrind.15066.memcheck.xml
[Valgrind] Copying build/debug_clang/test/valgrind.15899.memcheck.xml to /var/lib/jenkins/jobs/SANS_Weekly/configurations/axis-builddir/debug_clang/axis-buildnode/reynolds/builds/245/valgrind-plugin/valgrind-results/build/debug_clang/test/valgrind.15899.memcheck.xml
[Valgrind] Copying build/debug_clang/test/valgrind.16768.memcheck.xml to /var/lib/jenkins/jobs/SANS_Weekly/configurations/axis-builddir/debug_clang/axis-buildnode/reynolds/builds/245/valgrind-plugin/valgrind-results/build/debug_clang/test/valgrind.16768.memcheck.xml
[Valgrind] Copying build/debug_clang/test/valgrind.16835.memcheck.xml to /var/lib/jenkins/jobs/SANS_Weekly/configurations/axis-builddir/debug_clang/axis-buildnode/reynolds/builds/245/valgrind-plugin/valgrind-results/build/debug_clang/test/valgrind.16835.memcheck.xml
[Valgrind] Copying build/debug_clang/test/valgrind.17886.memcheck.xml to /var/lib/jenkins/jobs/SANS_Weekly/configurations/axis-builddir/debug_clang/axis-buildnode/reynolds/builds/245/valgrind-plugin/valgrind-results/build/debug_clang/test/valgrind.17886.memcheck.xml
[Valgrind] Copying build/debug_clang/test/valgrind.1831.memcheck.xml to /var/lib/jenkins/jobs/SANS_Weekly/configurations/axis-builddir/debug_clang/axis-buildnode/reynolds/builds/245/valgrind-plugin/valgrind-results/build/debug_clang/test/valgrind.1831.memcheck.xml
[Valgrind] Copying build/debug_clang/test/valgrind.18328.memcheck.xml to /var/lib/jenkins/jobs/SANS_Weekly/configurations/axis-builddir/debug_clang/axis-buildnode/reynolds/builds/245/valgrind-plugin/valgrind-results/build/debug_clang/test/valgrind.18328.memcheck.xml
[Valgrind] Copying build/debug_clang/test/valgrind.18814.memcheck.xml to /var/lib/jenkins/jobs/SANS_Weekly/configurations/axis-builddir/debug_clang/axis-buildnode/reynolds/builds/245/valgrind-plugin/valgrind-results/build/debug_clang/test/valgrind.18814.memcheck.xml
[Valgrind] Copying build/debug_clang/test/valgrind.18832.memcheck.xml to /var/lib/jenkins/jobs/SANS_Weekly/configurations/axis-builddir/debug_clang/axis-buildnode/reynolds/builds/245/valgrind-plugin/valgrind-results/build/debug_clang/test/valgrind.18832.memcheck.xml
[Valgrind] Copying build/debug_clang/test/valgrind.19164.memcheck.xml to /var/lib/jenkins/jobs/SANS_Weekly/configurations/axis-builddir/debug_clang/axis-buildnode/reynolds/builds/245/valgrind-plugin/valgrind-results/build/debug_clang/test/valgrind.19164.memcheck.xml
[Valgrind] Copying build/debug_clang/test/valgrind.19783.memcheck.xml to /var/lib/jenkins/jobs/SANS_Weekly/configurations/axis-builddir/debug_clang/axis-buildnode/reynolds/builds/245/valgrind-plugin/valgrind-results/build/debug_clang/test/valgrind.19783.memcheck.xml
[Valgrind] Copying build/debug_clang/test/valgrind.22008.memcheck.xml to /var/lib/jenkins/jobs/SANS_Weekly/configurations/axis-builddir/debug_clang/axis-buildnode/reynolds/builds/245/valgrind-plugin/valgrind-results/build/debug_clang/test/valgrind.22008.memcheck.xml
[Valgrind] Copying build/debug_clang/test/valgrind.2226.memcheck.xml to /var/lib/jenkins/jobs/SANS_Weekly/configurations/axis-builddir/debug_clang/axis-buildnode/reynolds/builds/245/valgrind-plugin/valgrind-results/build/debug_clang/test/valgrind.2226.memcheck.xml
[Valgrind] Copying build/debug_clang/test/valgrind.23368.memcheck.xml to /var/lib/jenkins/jobs/SANS_Weekly/configurations/axis-builddir/debug_clang/axis-buildnode/reynolds/builds/245/valgrind-plugin/valgrind-results/build/debug_clang/test/valgrind.23368.memcheck.xml
[Valgrind] Copying build/debug_clang/test/valgrind.23621.memcheck.xml to /var/lib/jenkins/jobs/SANS_Weekly/configurations/axis-builddir/debug_clang/axis-buildnode/reynolds/builds/245/valgrind-plugin/valgrind-results/build/debug_clang/test/valgrind.23621.memcheck.xml
[Valgrind] Copying build/debug_clang/test/valgrind.23979.memcheck.xml to /var/lib/jenkins/jobs/SANS_Weekly/configurations/axis-builddir/debug_clang/axis-buildnode/reynolds/builds/245/valgrind-plugin/valgrind-results/build/debug_clang/test/valgrind.23979.memcheck.xml
[Valgrind] Copying build/debug_clang/test/valgrind.24788.memcheck.xml to /var/lib/jenkins/jobs/SANS_Weekly/configurations/axis-builddir/debug_clang/axis-buildnode/reynolds/builds/245/valgrind-plugin/valgrind-results/build/debug_clang/test/valgrind.24788.memcheck.xml
[Valgrind] Copying build/debug_clang/test/valgrind.24964.memcheck.xml to /var/lib/jenkins/jobs/SANS_Weekly/configurations/axis-builddir/debug_clang/axis-buildnode/reynolds/builds/245/valgrind-plugin/valgrind-results/build/debug_clang/test/valgrind.24964.memcheck.xml
[Valgrind] Copying build/debug_clang/test/valgrind.25168.memcheck.xml to /var/lib/jenkins/jobs/SANS_Weekly/configurations/axis-builddir/debug_clang/axis-buildnode/reynolds/builds/245/valgrind-plugin/valgrind-results/build/debug_clang/test/valgrind.25168.memcheck.xml
[Valgrind] Copying build/debug_clang/test/valgrind.25305.memcheck.xml to /var/lib/jenkins/jobs/SANS_Weekly/configurations/axis-builddir/debug_clang/axis-buildnode/reynolds/builds/245/valgrind-plugin/valgrind-results/build/debug_clang/test/valgrind.25305.memcheck.xml
[Valgrind] Copying build/debug_clang/test/valgrind.25555.memcheck.xml to /var/lib/jenkins/jobs/SANS_Weekly/configurations/axis-builddir/debug_clang/axis-buildnode/reynolds/builds/245/valgrind-plugin/valgrind-results/build/debug_clang/test/valgrind.25555.memcheck.xml
[Valgrind] Copying build/debug_clang/test/valgrind.25662.memcheck.xml to /var/lib/jenkins/jobs/SANS_Weekly/configurations/axis-builddir/debug_clang/axis-buildnode/reynolds/builds/245/valgrind-plugin/valgrind-results/build/debug_clang/test/valgrind.25662.memcheck.xml
[Valgrind] Copying build/debug_clang/test/valgrind.25674.memcheck.xml to /var/lib/jenkins/jobs/SANS_Weekly/configurations/axis-builddir/debug_clang/axis-buildnode/reynolds/builds/245/valgrind-plugin/valgrind-results/build/debug_clang/test/valgrind.25674.memcheck.xml
[Valgrind] Copying build/debug_clang/test/valgrind.26034.memcheck.xml to /var/lib/jenkins/jobs/SANS_Weekly/configurations/axis-builddir/debug_clang/axis-buildnode/reynolds/builds/245/valgrind-plugin/valgrind-results/build/debug_clang/test/valgrind.26034.memcheck.xml
[Valgrind] Copying build/debug_clang/test/valgrind.26094.memcheck.xml to /var/lib/jenkins/jobs/SANS_Weekly/configurations/axis-builddir/debug_clang/axis-buildnode/reynolds/builds/245/valgrind-plugin/valgrind-results/build/debug_clang/test/valgrind.26094.memcheck.xml
[Valgrind] Copying build/debug_clang/test/valgrind.26128.memcheck.xml to /var/lib/jenkins/jobs/SANS_Weekly/configurations/axis-builddir/debug_clang/axis-buildnode/reynolds/builds/245/valgrind-plugin/valgrind-results/build/debug_clang/test/valgrind.26128.memcheck.xml
[Valgrind] Copying build/debug_clang/test/valgrind.26183.memcheck.xml to /var/lib/jenkins/jobs/SANS_Weekly/configurations/axis-builddir/debug_clang/axis-buildnode/reynolds/builds/245/valgrind-plugin/valgrind-results/build/debug_clang/test/valgrind.26183.memcheck.xml
[Valgrind] Copying build/debug_clang/test/valgrind.26390.memcheck.xml to /var/lib/jenkins/jobs/SANS_Weekly/configurations/axis-builddir/debug_clang/axis-buildnode/reynolds/builds/245/valgrind-plugin/valgrind-results/build/debug_clang/test/valgrind.26390.memcheck.xml
[Valgrind] Copying build/debug_clang/test/valgrind.27039.memcheck.xml to /var/lib/jenkins/jobs/SANS_Weekly/configurations/axis-builddir/debug_clang/axis-buildnode/reynolds/builds/245/valgrind-plugin/valgrind-results/build/debug_clang/test/valgrind.27039.memcheck.xml
[Valgrind] Copying build/debug_clang/test/valgrind.27353.memcheck.xml to /var/lib/jenkins/jobs/SANS_Weekly/configurations/axis-builddir/debug_clang/axis-buildnode/reynolds/builds/245/valgrind-plugin/valgrind-results/build/debug_clang/test/valgrind.27353.memcheck.xml
[Valgrind] Copying build/debug_clang/test/valgrind.27411.memcheck.xml to /var/lib/jenkins/jobs/SANS_Weekly/configurations/axis-builddir/debug_clang/axis-buildnode/reynolds/builds/245/valgrind-plugin/valgrind-results/build/debug_clang/test/valgrind.27411.memcheck.xml
[Valgrind] Copying build/debug_clang/test/valgrind.27438.memcheck.xml to /var/lib/jenkins/jobs/SANS_Weekly/configurations/axis-builddir/debug_clang/axis-buildnode/reynolds/builds/245/valgrind-plugin/valgrind-results/build/debug_clang/test/valgrind.27438.memcheck.xml
[Valgrind] Copying build/debug_clang/test/valgrind.27474.memcheck.xml to /var/lib/jenkins/jobs/SANS_Weekly/configurations/axis-builddir/debug_clang/axis-buildnode/reynolds/builds/245/valgrind-plugin/valgrind-results/build/debug_clang/test/valgrind.27474.memcheck.xml
[Valgrind] Copying build/debug_clang/test/valgrind.27495.memcheck.xml to /var/lib/jenkins/jobs/SANS_Weekly/configurations/axis-builddir/debug_clang/axis-buildnode/reynolds/builds/245/valgrind-plugin/valgrind-results/build/debug_clang/test/valgrind.27495.memcheck.xml
[Valgrind] Copying build/debug_clang/test/valgrind.27513.memcheck.xml to /var/lib/jenkins/jobs/SANS_Weekly/configurations/axis-builddir/debug_clang/axis-buildnode/reynolds/builds/245/valgrind-plugin/valgrind-results/build/debug_clang/test/valgrind.27513.memcheck.xml
[Valgrind] Copying build/debug_clang/test/valgrind.27544.memcheck.xml to /var/lib/jenkins/jobs/SANS_Weekly/configurations/axis-builddir/debug_clang/axis-buildnode/reynolds/builds/245/valgrind-plugin/valgrind-results/build/debug_clang/test/valgrind.27544.memcheck.xml
[Valgrind] Copying build/debug_clang/test/valgrind.27545.memcheck.xml to /var/lib/jenkins/jobs/SANS_Weekly/configurations/axis-builddir/debug_clang/axis-buildnode/reynolds/builds/245/valgrind-plugin/valgrind-results/build/debug_clang/test/valgrind.27545.memcheck.xml
[Valgrind] Copying build/debug_clang/test/valgrind.27604.memcheck.xml to /var/lib/jenkins/jobs/SANS_Weekly/configurations/axis-builddir/debug_clang/axis-buildnode/reynolds/builds/245/valgrind-plugin/valgrind-results/build/debug_clang/test/valgrind.27604.memcheck.xml
[Valgrind] Copying build/debug_clang/test/valgrind.27813.memcheck.xml to /var/lib/jenkins/jobs/SANS_Weekly/configurations/axis-builddir/debug_clang/axis-buildnode/reynolds/builds/245/valgrind-plugin/valgrind-results/build/debug_clang/test/valgrind.27813.memcheck.xml
[Valgrind] Copying build/debug_clang/test/valgrind.28008.memcheck.xml to /var/lib/jenkins/jobs/SANS_Weekly/configurations/axis-builddir/debug_clang/axis-buildnode/reynolds/builds/245/valgrind-plugin/valgrind-results/build/debug_clang/test/valgrind.28008.memcheck.xml
[Valgrind] Copying build/debug_clang/test/valgrind.28799.memcheck.xml to /var/lib/jenkins/jobs/SANS_Weekly/configurations/axis-builddir/debug_clang/axis-buildnode/reynolds/builds/245/valgrind-plugin/valgrind-results/build/debug_clang/test/valgrind.28799.memcheck.xml
[Valgrind] Copying build/debug_clang/test/valgrind.28926.memcheck.xml to /var/lib/jenkins/jobs/SANS_Weekly/configurations/axis-builddir/debug_clang/axis-buildnode/reynolds/builds/245/valgrind-plugin/valgrind-results/build/debug_clang/test/valgrind.28926.memcheck.xml
[Valgrind] Copying build/debug_clang/test/valgrind.29078.memcheck.xml to /var/lib/jenkins/jobs/SANS_Weekly/configurations/axis-builddir/debug_clang/axis-buildnode/reynolds/builds/245/valgrind-plugin/valgrind-results/build/debug_clang/test/valgrind.29078.memcheck.xml
[Valgrind] Copying build/debug_clang/test/valgrind.29547.memcheck.xml to /var/lib/jenkins/jobs/SANS_Weekly/configurations/axis-builddir/debug_clang/axis-buildnode/reynolds/builds/245/valgrind-plugin/valgrind-results/build/debug_clang/test/valgrind.29547.memcheck.xml
[Valgrind] Copying build/debug_clang/test/valgrind.29855.memcheck.xml to /var/lib/jenkins/jobs/SANS_Weekly/configurations/axis-builddir/debug_clang/axis-buildnode/reynolds/builds/245/valgrind-plugin/valgrind-results/build/debug_clang/test/valgrind.29855.memcheck.xml
[Valgrind] Copying build/debug_clang/test/valgrind.29869.memcheck.xml to /var/lib/jenkins/jobs/SANS_Weekly/configurations/axis-builddir/debug_clang/axis-buildnode/reynolds/builds/245/valgrind-plugin/valgrind-results/build/debug_clang/test/valgrind.29869.memcheck.xml
[Valgrind] Copying build/debug_clang/test/valgrind.30834.memcheck.xml to /var/lib/jenkins/jobs/SANS_Weekly/configurations/axis-builddir/debug_clang/axis-buildnode/reynolds/builds/245/valgrind-plugin/valgrind-results/build/debug_clang/test/valgrind.30834.memcheck.xml
[Valgrind] Copying build/debug_clang/test/valgrind.30856.memcheck.xml to /var/lib/jenkins/jobs/SANS_Weekly/configurations/axis-builddir/debug_clang/axis-buildnode/reynolds/builds/245/valgrind-plugin/valgrind-results/build/debug_clang/test/valgrind.30856.memcheck.xml
[Valgrind] Copying build/debug_clang/test/valgrind.31297.memcheck.xml to /var/lib/jenkins/jobs/SANS_Weekly/configurations/axis-builddir/debug_clang/axis-buildnode/reynolds/builds/245/valgrind-plugin/valgrind-results/build/debug_clang/test/valgrind.31297.memcheck.xml
[Valgrind] Copying build/debug_clang/test/valgrind.31542.memcheck.xml to /var/lib/jenkins/jobs/SANS_Weekly/configurations/axis-builddir/debug_clang/axis-buildnode/reynolds/builds/245/valgrind-plugin/valgrind-results/build/debug_clang/test/valgrind.31542.memcheck.xml
[Valgrind] Copying build/debug_clang/test/valgrind.31875.memcheck.xml to /var/lib/jenkins/jobs/SANS_Weekly/configurations/axis-builddir/debug_clang/axis-buildnode/reynolds/builds/245/valgrind-plugin/valgrind-results/build/debug_clang/test/valgrind.31875.memcheck.xml
[Valgrind] Copying build/debug_clang/test/valgrind.32377.memcheck.xml to /var/lib/jenkins/jobs/SANS_Weekly/configurations/axis-builddir/debug_clang/axis-buildnode/reynolds/builds/245/valgrind-plugin/valgrind-results/build/debug_clang/test/valgrind.32377.memcheck.xml
[Valgrind] Copying build/debug_clang/test/valgrind.32379.memcheck.xml to /var/lib/jenkins/jobs/SANS_Weekly/configurations/axis-builddir/debug_clang/axis-buildnode/reynolds/builds/245/valgrind-plugin/valgrind-results/build/debug_clang/test/valgrind.32379.memcheck.xml
[Valgrind] Copying build/debug_clang/test/valgrind.32380.memcheck.xml to /var/lib/jenkins/jobs/SANS_Weekly/configurations/axis-builddir/debug_clang/axis-buildnode/reynolds/builds/245/valgrind-plugin/valgrind-results/build/debug_clang/test/valgrind.32380.memcheck.xml
[Valgrind] Copying build/debug_clang/test/valgrind.32436.memcheck.xml to /var/lib/jenkins/jobs/SANS_Weekly/configurations/axis-builddir/debug_clang/axis-buildnode/reynolds/builds/245/valgrind-plugin/valgrind-results/build/debug_clang/test/valgrind.32436.memcheck.xml
[Valgrind] Copying build/debug_clang/test/valgrind.32440.memcheck.xml to /var/lib/jenkins/jobs/SANS_Weekly/configurations/axis-builddir/debug_clang/axis-buildnode/reynolds/builds/245/valgrind-plugin/valgrind-results/build/debug_clang/test/valgrind.32440.memcheck.xml
[Valgrind] Copying build/debug_clang/test/valgrind.32631.memcheck.xml to /var/lib/jenkins/jobs/SANS_Weekly/configurations/axis-builddir/debug_clang/axis-buildnode/reynolds/builds/245/valgrind-plugin/valgrind-results/build/debug_clang/test/valgrind.32631.memcheck.xml
[Valgrind] Copying build/debug_clang/test/valgrind.32661.memcheck.xml to /var/lib/jenkins/jobs/SANS_Weekly/configurations/axis-builddir/debug_clang/axis-buildnode/reynolds/builds/245/valgrind-plugin/valgrind-results/build/debug_clang/test/valgrind.32661.memcheck.xml
[Valgrind] Copying build/debug_clang/test/valgrind.33155.memcheck.xml to /var/lib/jenkins/jobs/SANS_Weekly/configurations/axis-builddir/debug_clang/axis-buildnode/reynolds/builds/245/valgrind-plugin/valgrind-results/build/debug_clang/test/valgrind.33155.memcheck.xml
[Valgrind] Copying build/debug_clang/test/valgrind.35218.memcheck.xml to /var/lib/jenkins/jobs/SANS_Weekly/configurations/axis-builddir/debug_clang/axis-buildnode/reynolds/builds/245/valgrind-plugin/valgrind-results/build/debug_clang/test/valgrind.35218.memcheck.xml
[Valgrind] Copying build/debug_clang/test/valgrind.35252.memcheck.xml to /var/lib/jenkins/jobs/SANS_Weekly/configurations/axis-builddir/debug_clang/axis-buildnode/reynolds/builds/245/valgrind-plugin/valgrind-results/build/debug_clang/test/valgrind.35252.memcheck.xml
[Valgrind] Copying build/debug_clang/test/valgrind.35283.memcheck.xml to /var/lib/jenkins/jobs/SANS_Weekly/configurations/axis-builddir/debug_clang/axis-buildnode/reynolds/builds/245/valgrind-plugin/valgrind-results/build/debug_clang/test/valgrind.35283.memcheck.xml
[Valgrind] Copying build/debug_clang/test/valgrind.35487.memcheck.xml to /var/lib/jenkins/jobs/SANS_Weekly/configurations/axis-builddir/debug_clang/axis-buildnode/reynolds/builds/245/valgrind-plugin/valgrind-results/build/debug_clang/test/valgrind.35487.memcheck.xml
[Valgrind] Copying build/debug_clang/test/valgrind.36324.memcheck.xml to /var/lib/jenkins/jobs/SANS_Weekly/configurations/axis-builddir/debug_clang/axis-buildnode/reynolds/builds/245/valgrind-plugin/valgrind-results/build/debug_clang/test/valgrind.36324.memcheck.xml
[Valgrind] Copying build/debug_clang/test/valgrind.36529.memcheck.xml to /var/lib/jenkins/jobs/SANS_Weekly/configurations/axis-builddir/debug_clang/axis-buildnode/reynolds/builds/245/valgrind-plugin/valgrind-results/build/debug_clang/test/valgrind.36529.memcheck.xml
[Valgrind] Copying build/debug_clang/test/valgrind.36947.memcheck.xml to /var/lib/jenkins/jobs/SANS_Weekly/configurations/axis-builddir/debug_clang/axis-buildnode/reynolds/builds/245/valgrind-plugin/valgrind-results/build/debug_clang/test/valgrind.36947.memcheck.xml
[Valgrind] Copying build/debug_clang/test/valgrind.37456.memcheck.xml to /var/lib/jenkins/jobs/SANS_Weekly/configurations/axis-builddir/debug_clang/axis-buildnode/reynolds/builds/245/valgrind-plugin/valgrind-results/build/debug_clang/test/valgrind.37456.memcheck.xml
[Valgrind] Copying build/debug_clang/test/valgrind.37842.memcheck.xml to /var/lib/jenkins/jobs/SANS_Weekly/configurations/axis-builddir/debug_clang/axis-buildnode/reynolds/builds/245/valgrind-plugin/valgrind-results/build/debug_clang/test/valgrind.37842.memcheck.xml
[Valgrind] Copying build/debug_clang/test/valgrind.37848.memcheck.xml to /var/lib/jenkins/jobs/SANS_Weekly/configurations/axis-builddir/debug_clang/axis-buildnode/reynolds/builds/245/valgrind-plugin/valgrind-results/build/debug_clang/test/valgrind.37848.memcheck.xml
[Valgrind] Copying build/debug_clang/test/valgrind.37903.memcheck.xml to /var/lib/jenkins/jobs/SANS_Weekly/configurations/axis-builddir/debug_clang/axis-buildnode/reynolds/builds/245/valgrind-plugin/valgrind-results/build/debug_clang/test/valgrind.37903.memcheck.xml
[Valgrind] Copying build/debug_clang/test/valgrind.38918.memcheck.xml to /var/lib/jenkins/jobs/SANS_Weekly/configurations/axis-builddir/debug_clang/axis-buildnode/reynolds/builds/245/valgrind-plugin/valgrind-results/build/debug_clang/test/valgrind.38918.memcheck.xml
[Valgrind] Copying build/debug_clang/test/valgrind.38929.memcheck.xml to /var/lib/jenkins/jobs/SANS_Weekly/configurations/axis-builddir/debug_clang/axis-buildnode/reynolds/builds/245/valgrind-plugin/valgrind-results/build/debug_clang/test/valgrind.38929.memcheck.xml
[Valgrind] Copying build/debug_clang/test/valgrind.39380.memcheck.xml to /var/lib/jenkins/jobs/SANS_Weekly/configurations/axis-builddir/debug_clang/axis-buildnode/reynolds/builds/245/valgrind-plugin/valgrind-results/build/debug_clang/test/valgrind.39380.memcheck.xml
[Valgrind] Copying build/debug_clang/test/valgrind.39723.memcheck.xml to /var/lib/jenkins/jobs/SANS_Weekly/configurations/axis-builddir/debug_clang/axis-buildnode/reynolds/builds/245/valgrind-plugin/valgrind-results/build/debug_clang/test/valgrind.39723.memcheck.xml
[Valgrind] Copying build/debug_clang/test/valgrind.40070.memcheck.xml to /var/lib/jenkins/jobs/SANS_Weekly/configurations/axis-builddir/debug_clang/axis-buildnode/reynolds/builds/245/valgrind-plugin/valgrind-results/build/debug_clang/test/valgrind.40070.memcheck.xml
[Valgrind] Copying build/debug_clang/test/valgrind.40375.memcheck.xml to /var/lib/jenkins/jobs/SANS_Weekly/configurations/axis-builddir/debug_clang/axis-buildnode/reynolds/builds/245/valgrind-plugin/valgrind-results/build/debug_clang/test/valgrind.40375.memcheck.xml
[Valgrind] Copying build/debug_clang/test/valgrind.40572.memcheck.xml to /var/lib/jenkins/jobs/SANS_Weekly/configurations/axis-builddir/debug_clang/axis-buildnode/reynolds/builds/245/valgrind-plugin/valgrind-results/build/debug_clang/test/valgrind.40572.memcheck.xml
[Valgrind] Copying build/debug_clang/test/valgrind.40914.memcheck.xml to /var/lib/jenkins/jobs/SANS_Weekly/configurations/axis-builddir/debug_clang/axis-buildnode/reynolds/builds/245/valgrind-plugin/valgrind-results/build/debug_clang/test/valgrind.40914.memcheck.xml
[Valgrind] Copying build/debug_clang/test/valgrind.4409.memcheck.xml to /var/lib/jenkins/jobs/SANS_Weekly/configurations/axis-builddir/debug_clang/axis-buildnode/reynolds/builds/245/valgrind-plugin/valgrind-results/build/debug_clang/test/valgrind.4409.memcheck.xml
[Valgrind] Copying build/debug_clang/test/valgrind.506.memcheck.xml to /var/lib/jenkins/jobs/SANS_Weekly/configurations/axis-builddir/debug_clang/axis-buildnode/reynolds/builds/245/valgrind-plugin/valgrind-results/build/debug_clang/test/valgrind.506.memcheck.xml
[Valgrind] Copying build/debug_clang/test/valgrind.5165.memcheck.xml to /var/lib/jenkins/jobs/SANS_Weekly/configurations/axis-builddir/debug_clang/axis-buildnode/reynolds/builds/245/valgrind-plugin/valgrind-results/build/debug_clang/test/valgrind.5165.memcheck.xml
[Valgrind] Copying build/debug_clang/test/valgrind.5187.memcheck.xml to /var/lib/jenkins/jobs/SANS_Weekly/configurations/axis-builddir/debug_clang/axis-buildnode/reynolds/builds/245/valgrind-plugin/valgrind-results/build/debug_clang/test/valgrind.5187.memcheck.xml
[Valgrind] Copying build/debug_clang/test/valgrind.6003.memcheck.xml to /var/lib/jenkins/jobs/SANS_Weekly/configurations/axis-builddir/debug_clang/axis-buildnode/reynolds/builds/245/valgrind-plugin/valgrind-results/build/debug_clang/test/valgrind.6003.memcheck.xml
[Valgrind] Copying build/debug_clang/test/valgrind.6116.memcheck.xml to /var/lib/jenkins/jobs/SANS_Weekly/configurations/axis-builddir/debug_clang/axis-buildnode/reynolds/builds/245/valgrind-plugin/valgrind-results/build/debug_clang/test/valgrind.6116.memcheck.xml
[Valgrind] Copying build/debug_clang/test/valgrind.6243.memcheck.xml to /var/lib/jenkins/jobs/SANS_Weekly/configurations/axis-builddir/debug_clang/axis-buildnode/reynolds/builds/245/valgrind-plugin/valgrind-results/build/debug_clang/test/valgrind.6243.memcheck.xml
[Valgrind] Copying build/debug_clang/test/valgrind.6528.memcheck.xml to /var/lib/jenkins/jobs/SANS_Weekly/configurations/axis-builddir/debug_clang/axis-buildnode/reynolds/builds/245/valgrind-plugin/valgrind-results/build/debug_clang/test/valgrind.6528.memcheck.xml
[Valgrind] Copying build/debug_clang/test/valgrind.6869.memcheck.xml to /var/lib/jenkins/jobs/SANS_Weekly/configurations/axis-builddir/debug_clang/axis-buildnode/reynolds/builds/245/valgrind-plugin/valgrind-results/build/debug_clang/test/valgrind.6869.memcheck.xml
[Valgrind] Copying build/debug_clang/test/valgrind.6874.memcheck.xml to /var/lib/jenkins/jobs/SANS_Weekly/configurations/axis-builddir/debug_clang/axis-buildnode/reynolds/builds/245/valgrind-plugin/valgrind-results/build/debug_clang/test/valgrind.6874.memcheck.xml
[Valgrind] Copying build/debug_clang/test/valgrind.7095.memcheck.xml to /var/lib/jenkins/jobs/SANS_Weekly/configurations/axis-builddir/debug_clang/axis-buildnode/reynolds/builds/245/valgrind-plugin/valgrind-results/build/debug_clang/test/valgrind.7095.memcheck.xml
[Valgrind] Copying build/debug_clang/test/valgrind.7113.memcheck.xml to /var/lib/jenkins/jobs/SANS_Weekly/configurations/axis-builddir/debug_clang/axis-buildnode/reynolds/builds/245/valgrind-plugin/valgrind-results/build/debug_clang/test/valgrind.7113.memcheck.xml
[Valgrind] Copying build/debug_clang/test/valgrind.7252.memcheck.xml to /var/lib/jenkins/jobs/SANS_Weekly/configurations/axis-builddir/debug_clang/axis-buildnode/reynolds/builds/245/valgrind-plugin/valgrind-results/build/debug_clang/test/valgrind.7252.memcheck.xml
[Valgrind] Copying build/debug_clang/test/valgrind.8898.memcheck.xml to /var/lib/jenkins/jobs/SANS_Weekly/configurations/axis-builddir/debug_clang/axis-buildnode/reynolds/builds/245/valgrind-plugin/valgrind-results/build/debug_clang/test/valgrind.8898.memcheck.xml
[Valgrind] Copying build/debug_clang/test/valgrind.8904.memcheck.xml to /var/lib/jenkins/jobs/SANS_Weekly/configurations/axis-builddir/debug_clang/axis-buildnode/reynolds/builds/245/valgrind-plugin/valgrind-results/build/debug_clang/test/valgrind.8904.memcheck.xml
[Valgrind] Copying build/debug_clang/test/valgrind.8958.memcheck.xml to /var/lib/jenkins/jobs/SANS_Weekly/configurations/axis-builddir/debug_clang/axis-buildnode/reynolds/builds/245/valgrind-plugin/valgrind-results/build/debug_clang/test/valgrind.8958.memcheck.xml
[Valgrind] Analysing valgrind results
[Valgrind] workspacePath: /jenkins/workspace/SANS_Weekly/builddir/debug_clang/buildnode/reynolds/
[Valgrind] Ending the valgrind analysis.
INFO: Starting to record.
INFO: Processing CTest-Version 3.x (default)
INFO: [CTest-Version 3.x (default)] - 1 test report file(s) were found with the pattern 'build/Test*.xml' relative to '/jenkins/workspace/SANS_Weekly/builddir/debug_clang/buildnode/reynolds' for the testing framework 'CTest-Version 3.x (default)'.
INFO: Check 'Failed Tests' threshold.
INFO: The total number of tests for the threshold 'Failed Tests' exceeds the specified "failure threshold" value.
INFO: Setting the build status to FAILURE
INFO: Stopping recording.
[PostBuildScript] - Executing post build scripts.
[PostBuildScript] - Build does not have any of the results []. Did not execute build step #0.
[WS-CLEANUP] Deleting project workspace...
[WS-CLEANUP] Deferred wipeout is used...
[WS-CLEANUP] done
Finished: FAILURE