Console Output

Skipping 323 KB.. Full Log
[ 94%] Linking CXX static library libPorousMediaLib.a
[ 94%] Built target PorousMediaLib
Scanning dependencies of target ShallowWaterLib_vera
[ 94%] Checking style of src/pde/ShallowWater/BCShallowWater1D.h
[ 94%] Checking style of src/pde/ShallowWater/ShallowWaterSolution1D.h
[ 94%] Checking style of src/pde/ShallowWater/VarInterp2D_manifold.h
[ 94%] Checking style of src/pde/ShallowWater/ShallowWater_Traits.h
[ 94%] Checking style of src/pde/ShallowWater/ShallowWater_Traits_manifold.h
[ 94%] Checking style of src/pde/ShallowWater/ShallowWaterSolution2D.h
[ 94%] Checking style of src/pde/ShallowWater/BCShallowWater2D.h
[ 94%] Checking style of src/pde/ShallowWater/PDEShallowWater2D.h
[ 94%] Checking style of src/pde/ShallowWater/ShallowWaterVariable2D.h
[ 94%] Checking style of src/pde/ShallowWater/ShallowWaterVariable1D.h
[ 94%] Checking style of src/pde/ShallowWater/ShallowWaterSolution2D_manifold.h
[ 94%] Checking style of src/pde/ShallowWater/OutputShallowWater2D_manifold.h
[ 94%] Checking style of src/pde/ShallowWater/PDEShallowWater2D_manifold.h
[ 94%] Checking style of src/pde/ShallowWater/OutputShallowWater2D.h
[ 94%] Checking style of src/pde/ShallowWater/VarInterp1D.h
[ 94%] Checking style of src/pde/ShallowWater/BCShallowWater2D_manifold.h
[ 94%] Checking style of src/pde/ShallowWater/ShallowWaterVariable2D_manifold.h
[ 94%] Checking style of src/pde/ShallowWater/OutputShallowWater1D.h
[ 94%] Checking style of src/pde/ShallowWater/VarInterp2D.h
[ 94%] Checking style of src/pde/ShallowWater/PDEShallowWater1D.h
[ 94%] Checking style of src/pde/ShallowWater/ShallowWaterSolution2D_manifold.cpp
[ 94%] Checking style of src/pde/ShallowWater/PDEShallowWater2D_manifold.cpp
[ 94%] Checking style of src/pde/ShallowWater/BCShallowWater2D_manifold.cpp
[ 94%] Checking style of src/pde/ShallowWater/ShallowWaterSolution1D.cpp
[ 94%] Checking style of src/pde/ShallowWater/BCShallowWater2D.cpp
[ 94%] Checking style of src/pde/ShallowWater/PDEShallowWater1D.cpp
[ 94%] Checking style of src/pde/ShallowWater/BCShallowWater1D.cpp
[ 94%] Checking style of src/pde/ShallowWater/ShallowWaterSolution2D.cpp
[ 94%] Checking style of src/pde/ShallowWater/PDEShallowWater2D.cpp
[ 94%] Built target ShallowWaterLib_vera
[ 94%] Generating CXX unity source src/pde/ShallowWater/cotire/ShallowWaterLib_CXX_unity.cxx
[ 94%] Generating CXX prefix source src/pde/ShallowWater/cotire/ShallowWaterLib_CXX_prefix.cxx
[ 94%] Generating CXX prefix header src/pde/ShallowWater/cotire/ShallowWaterLib_CXX_prefix.hxx
[ 94%] Building CXX precompiled header src/pde/ShallowWater/cotire/ShallowWaterLib_CXX_prefix.hxx.gch
Scanning dependencies of target ShallowWaterLib
[ 94%] Building CXX object src/pde/ShallowWater/CMakeFiles/ShallowWaterLib.dir/PDEShallowWater1D.cpp.o
[ 94%] Building CXX object src/pde/ShallowWater/CMakeFiles/ShallowWaterLib.dir/ShallowWaterSolution1D.cpp.o
[ 94%] Building CXX object src/pde/ShallowWater/CMakeFiles/ShallowWaterLib.dir/BCShallowWater1D.cpp.o
[ 94%] Building CXX object src/pde/ShallowWater/CMakeFiles/ShallowWaterLib.dir/PDEShallowWater2D.cpp.o
[ 94%] Building CXX object src/pde/ShallowWater/CMakeFiles/ShallowWaterLib.dir/ShallowWaterSolution2D.cpp.o
[ 94%] Building CXX object src/pde/ShallowWater/CMakeFiles/ShallowWaterLib.dir/BCShallowWater2D.cpp.o
[ 94%] Building CXX object src/pde/ShallowWater/CMakeFiles/ShallowWaterLib.dir/PDEShallowWater2D_manifold.cpp.o
[ 94%] Building CXX object src/pde/ShallowWater/CMakeFiles/ShallowWaterLib.dir/ShallowWaterSolution2D_manifold.cpp.o
[ 94%] Building CXX object src/pde/ShallowWater/CMakeFiles/ShallowWaterLib.dir/BCShallowWater2D_manifold.cpp.o
[ 94%] Linking CXX static library libShallowWaterLib.a
[ 94%] Built target ShallowWaterLib
Scanning dependencies of target Adjoint2D_HDG_Triangle_AD_mitState_btest_OBJECT
[ 94%] Building CXX object test/system/Asymptotic/CMakeFiles/Adjoint2D_HDG_Triangle_AD_mitState_btest_OBJECT.dir/Adjoint2D_HDG_Triangle_AD_mitState_btest.cpp.o
[ 94%] Built target Adjoint2D_HDG_Triangle_AD_mitState_btest_OBJECT
Scanning dependencies of target Adjoint2D_HDG_Triangle_AD_mitState_btest_build
[ 94%] Linking CXX executable Adjoint2D_HDG_Triangle_AD_mitState_btest
[ 94%] Built target Adjoint2D_HDG_Triangle_AD_mitState_btest_build
Scanning dependencies of target ErrorOrder_2D_CGStabilized_RANS_MMS_btest_OBJECT
[ 94%] Building CXX object test/system/Asymptotic/CMakeFiles/ErrorOrder_2D_CGStabilized_RANS_MMS_btest_OBJECT.dir/ErrorOrder_2D_CGStabilized_RANS_MMS_btest.cpp.o
[ 94%] Built target ErrorOrder_2D_CGStabilized_RANS_MMS_btest_OBJECT
Scanning dependencies of target ErrorOrder_2D_CGStabilized_RANS_MMS_btest_build_vera
[ 94%] Checking style of test/system/Asymptotic/ErrorOrder_2D_CGStabilized_RANS_MMS_btest.cpp
[ 94%] Built target ErrorOrder_2D_CGStabilized_RANS_MMS_btest_build_vera
Scanning dependencies of target ErrorOrder_2D_CGStabilized_RANS_MMS_btest_build
[ 94%] Linking CXX executable ErrorOrder_2D_CGStabilized_RANS_MMS_btest
[ 94%] Built target ErrorOrder_2D_CGStabilized_RANS_MMS_btest_build
Scanning dependencies of target ErrorOrder_2D_DGAdvective_Annulus_Quad_btest_OBJECT
[ 94%] Building CXX object test/system/Asymptotic/CMakeFiles/ErrorOrder_2D_DGAdvective_Annulus_Quad_btest_OBJECT.dir/ErrorOrder_2D_DGAdvective_Annulus_Quad_btest.cpp.o
[ 94%] Built target ErrorOrder_2D_DGAdvective_Annulus_Quad_btest_OBJECT
Scanning dependencies of target ErrorOrder_2D_DGAdvective_Annulus_Quad_btest_build_vera
[ 94%] Checking style of test/system/Asymptotic/ErrorOrder_2D_DGAdvective_Annulus_Quad_btest.cpp
[ 94%] Built target ErrorOrder_2D_DGAdvective_Annulus_Quad_btest_build_vera
Scanning dependencies of target ErrorOrder_2D_DGAdvective_Annulus_Quad_btest_build
[ 94%] Linking CXX executable ErrorOrder_2D_DGAdvective_Annulus_Quad_btest
[ 94%] Built target ErrorOrder_2D_DGAdvective_Annulus_Quad_btest_build
Scanning dependencies of target ErrorOrder_1D_DGBR2_AD_HB_btest_build_vera
[ 94%] Checking style of test/system/Asymptotic/ErrorOrder_1D_DGBR2_AD_HB_btest.cpp
[ 94%] Built target ErrorOrder_1D_DGBR2_AD_HB_btest_build_vera
Scanning dependencies of target ErrorOrder_1D_DGBR2_AD_HB_btest_OBJECT
[ 94%] Building CXX object test/system/Asymptotic/CMakeFiles/ErrorOrder_1D_DGBR2_AD_HB_btest_OBJECT.dir/ErrorOrder_1D_DGBR2_AD_HB_btest.cpp.o
[ 94%] Built target ErrorOrder_1D_DGBR2_AD_HB_btest_OBJECT
Scanning dependencies of target ErrorOrder_1D_DGBR2_AD_HB_btest_build
[ 94%] Linking CXX executable ErrorOrder_1D_DGBR2_AD_HB_btest
[ 94%] Built target ErrorOrder_1D_DGBR2_AD_HB_btest_build
Scanning dependencies of target ErrorOrder_3D_DGBR2_Periodic_Hex_AD_btest_build_vera
[ 94%] Checking style of test/system/Asymptotic/ErrorOrder_3D_DGBR2_Periodic_Hex_AD_btest.cpp
[ 94%] Built target ErrorOrder_3D_DGBR2_Periodic_Hex_AD_btest_build_vera
Scanning dependencies of target ErrorOrder_3D_DGBR2_Periodic_Hex_AD_btest_OBJECT
[ 94%] Building CXX object test/system/Asymptotic/CMakeFiles/ErrorOrder_3D_DGBR2_Periodic_Hex_AD_btest_OBJECT.dir/ErrorOrder_3D_DGBR2_Periodic_Hex_AD_btest.cpp.o
[ 94%] Built target ErrorOrder_3D_DGBR2_Periodic_Hex_AD_btest_OBJECT
Scanning dependencies of target ErrorOrder_3D_DGBR2_Periodic_Hex_AD_btest_build
[ 94%] Linking CXX executable ErrorOrder_3D_DGBR2_Periodic_Hex_AD_btest
[ 94%] Built target ErrorOrder_3D_DGBR2_Periodic_Hex_AD_btest_build
Scanning dependencies of target Adjoint2D_DGBR2_Triangle_AD_btest_build_vera
[ 94%] Checking style of test/system/Asymptotic/Adjoint2D_DGBR2_Triangle_AD_btest.cpp
[ 94%] Built target Adjoint2D_DGBR2_Triangle_AD_btest_build_vera
Scanning dependencies of target Adjoint2D_DGBR2_Triangle_AD_btest_OBJECT
[ 94%] Building CXX object test/system/Asymptotic/CMakeFiles/Adjoint2D_DGBR2_Triangle_AD_btest_OBJECT.dir/Adjoint2D_DGBR2_Triangle_AD_btest.cpp.o
[ 94%] Built target Adjoint2D_DGBR2_Triangle_AD_btest_OBJECT
Scanning dependencies of target Adjoint2D_DGBR2_Triangle_AD_btest_build
[ 94%] Linking CXX executable Adjoint2D_DGBR2_Triangle_AD_btest
[ 94%] Built target Adjoint2D_DGBR2_Triangle_AD_btest_build
Scanning dependencies of target ErrorEstimateOrder_3D_CG_Tet_AD_btest_build_vera
[ 94%] Checking style of test/system/Asymptotic/ErrorEstimateOrder_3D_CG_Tet_AD_btest.cpp
[ 94%] Built target ErrorEstimateOrder_3D_CG_Tet_AD_btest_build_vera
Scanning dependencies of target ErrorEstimateOrder_3D_CG_Tet_AD_btest_OBJECT
[ 94%] Building CXX object test/system/Asymptotic/CMakeFiles/ErrorEstimateOrder_3D_CG_Tet_AD_btest_OBJECT.dir/ErrorEstimateOrder_3D_CG_Tet_AD_btest.cpp.o
[ 94%] Built target ErrorEstimateOrder_3D_CG_Tet_AD_btest_OBJECT
Scanning dependencies of target ErrorEstimateOrder_3D_CG_Tet_AD_btest_build
[ 94%] Linking CXX executable ErrorEstimateOrder_3D_CG_Tet_AD_btest
[ 94%] Built target ErrorEstimateOrder_3D_CG_Tet_AD_btest_build
Scanning dependencies of target ErrorOrder_1D_CG_AD_btest_build_vera
[ 94%] Checking style of test/system/Asymptotic/ErrorOrder_1D_CG_AD_btest.cpp
[ 94%] Built target ErrorOrder_1D_CG_AD_btest_build_vera
Scanning dependencies of target ErrorOrder_1D_CG_AD_btest_OBJECT
[ 94%] Building CXX object test/system/Asymptotic/CMakeFiles/ErrorOrder_1D_CG_AD_btest_OBJECT.dir/ErrorOrder_1D_CG_AD_btest.cpp.o
[ 94%] Built target ErrorOrder_1D_CG_AD_btest_OBJECT
Scanning dependencies of target ErrorOrder_1D_CG_AD_btest_build
[ 94%] Linking CXX executable ErrorOrder_1D_CG_AD_btest
[ 94%] Built target ErrorOrder_1D_CG_AD_btest_build
Scanning dependencies of target Adjoint2D_CG_Triangle_AD_btest_build_vera
[ 94%] Checking style of test/system/Asymptotic/Adjoint2D_CG_Triangle_AD_btest.cpp
[ 94%] Built target Adjoint2D_CG_Triangle_AD_btest_build_vera
Scanning dependencies of target Adjoint2D_CG_Triangle_AD_btest_OBJECT
[ 94%] Building CXX object test/system/Asymptotic/CMakeFiles/Adjoint2D_CG_Triangle_AD_btest_OBJECT.dir/Adjoint2D_CG_Triangle_AD_btest.cpp.o
[ 94%] Built target Adjoint2D_CG_Triangle_AD_btest_OBJECT
Scanning dependencies of target Adjoint2D_CG_Triangle_AD_btest_build
[ 94%] Linking CXX executable Adjoint2D_CG_Triangle_AD_btest
[ 94%] Built target Adjoint2D_CG_Triangle_AD_btest_build
Scanning dependencies of target ErrorOrder_2D_DGBR2_Triangle_AD_btest_OBJECT
[ 94%] Building CXX object test/system/Asymptotic/CMakeFiles/ErrorOrder_2D_DGBR2_Triangle_AD_btest_OBJECT.dir/ErrorOrder_2D_DGBR2_Triangle_AD_btest.cpp.o
[ 94%] Built target ErrorOrder_2D_DGBR2_Triangle_AD_btest_OBJECT
Scanning dependencies of target ErrorOrder_2D_DGBR2_Triangle_AD_btest_build_vera
[ 94%] Checking style of test/system/Asymptotic/ErrorOrder_2D_DGBR2_Triangle_AD_btest.cpp
[ 94%] Built target ErrorOrder_2D_DGBR2_Triangle_AD_btest_build_vera
Scanning dependencies of target ErrorOrder_2D_DGBR2_Triangle_AD_btest_build
[ 94%] Linking CXX executable ErrorOrder_2D_DGBR2_Triangle_AD_btest
[ 94%] Built target ErrorOrder_2D_DGBR2_Triangle_AD_btest_build
Scanning dependencies of target ErrorOrder_2D_DGBR2_RANS_MMS_btest_OBJECT
[ 94%] Building CXX object test/system/Asymptotic/CMakeFiles/ErrorOrder_2D_DGBR2_RANS_MMS_btest_OBJECT.dir/ErrorOrder_2D_DGBR2_RANS_MMS_btest.cpp.o
[ 94%] Built target ErrorOrder_2D_DGBR2_RANS_MMS_btest_OBJECT
Scanning dependencies of target ErrorOrder_2D_DGBR2_RANS_MMS_btest_build_vera
[ 94%] Checking style of test/system/Asymptotic/ErrorOrder_2D_DGBR2_RANS_MMS_btest.cpp
[ 94%] Built target ErrorOrder_2D_DGBR2_RANS_MMS_btest_build_vera
Scanning dependencies of target ErrorOrder_2D_DGBR2_RANS_MMS_btest_build
[ 94%] Linking CXX executable ErrorOrder_2D_DGBR2_RANS_MMS_btest
[ 94%] Built target ErrorOrder_2D_DGBR2_RANS_MMS_btest_build
Scanning dependencies of target Adjoint2D_HDG_Triangle_AD_sansLG_btest_build_vera
[ 94%] Checking style of test/system/Asymptotic/Adjoint2D_HDG_Triangle_AD_sansLG_btest.cpp
[ 94%] Built target Adjoint2D_HDG_Triangle_AD_sansLG_btest_build_vera
Scanning dependencies of target Adjoint2D_HDG_Triangle_AD_sansLG_btest_OBJECT
[ 94%] Building CXX object test/system/Asymptotic/CMakeFiles/Adjoint2D_HDG_Triangle_AD_sansLG_btest_OBJECT.dir/Adjoint2D_HDG_Triangle_AD_sansLG_btest.cpp.o
[ 94%] Built target Adjoint2D_HDG_Triangle_AD_sansLG_btest_OBJECT
Scanning dependencies of target Adjoint2D_HDG_Triangle_AD_sansLG_btest_build
[ 94%] Linking CXX executable Adjoint2D_HDG_Triangle_AD_sansLG_btest
[ 94%] Built target Adjoint2D_HDG_Triangle_AD_sansLG_btest_build
Scanning dependencies of target ErrorEstimateOrder_2D_DGAdvective_Triangle_AD_btest_OBJECT
[ 94%] Building CXX object test/system/Asymptotic/CMakeFiles/ErrorEstimateOrder_2D_DGAdvective_Triangle_AD_btest_OBJECT.dir/ErrorEstimateOrder_2D_DGAdvective_Triangle_AD_btest.cpp.o
[ 94%] Built target ErrorEstimateOrder_2D_DGAdvective_Triangle_AD_btest_OBJECT
Scanning dependencies of target ErrorEstimateOrder_2D_DGAdvective_Triangle_AD_btest_build_vera
[ 94%] Checking style of test/system/Asymptotic/ErrorEstimateOrder_2D_DGAdvective_Triangle_AD_btest.cpp
[ 94%] Built target ErrorEstimateOrder_2D_DGAdvective_Triangle_AD_btest_build_vera
Scanning dependencies of target ErrorEstimateOrder_2D_DGAdvective_Triangle_AD_btest_build
[ 94%] Linking CXX executable ErrorEstimateOrder_2D_DGAdvective_Triangle_AD_btest
[ 94%] Built target ErrorEstimateOrder_2D_DGAdvective_Triangle_AD_btest_build
Scanning dependencies of target ErrorOrder_3D_DGBR2_Tet_AD_btest_OBJECT
[ 94%] Building CXX object test/system/Asymptotic/CMakeFiles/ErrorOrder_3D_DGBR2_Tet_AD_btest_OBJECT.dir/ErrorOrder_3D_DGBR2_Tet_AD_btest.cpp.o
[ 94%] Built target ErrorOrder_3D_DGBR2_Tet_AD_btest_OBJECT
Scanning dependencies of target ErrorOrder_3D_DGBR2_Tet_AD_btest_build_vera
[ 94%] Checking style of test/system/Asymptotic/ErrorOrder_3D_DGBR2_Tet_AD_btest.cpp
[ 94%] Built target ErrorOrder_3D_DGBR2_Tet_AD_btest_build_vera
Scanning dependencies of target ErrorOrder_3D_DGBR2_Tet_AD_btest_build
[ 94%] Linking CXX executable ErrorOrder_3D_DGBR2_Tet_AD_btest
[ 94%] Built target ErrorOrder_3D_DGBR2_Tet_AD_btest_build
Scanning dependencies of target ErrorOrder_3D_CG_Tet_AD_btest_build_vera
[ 94%] Checking style of test/system/Asymptotic/ErrorOrder_3D_CG_Tet_AD_btest.cpp
[ 94%] Built target ErrorOrder_3D_CG_Tet_AD_btest_build_vera
Scanning dependencies of target ErrorOrder_3D_CG_Tet_AD_btest_OBJECT
[ 94%] Building CXX object test/system/Asymptotic/CMakeFiles/ErrorOrder_3D_CG_Tet_AD_btest_OBJECT.dir/ErrorOrder_3D_CG_Tet_AD_btest.cpp.o
[ 94%] Built target ErrorOrder_3D_CG_Tet_AD_btest_OBJECT
Scanning dependencies of target ErrorOrder_3D_CG_Tet_AD_btest_build
[ 94%] Linking CXX executable ErrorOrder_3D_CG_Tet_AD_btest
[ 94%] Built target ErrorOrder_3D_CG_Tet_AD_btest_build
Scanning dependencies of target ErrorOrder_3D_DGBR2_Sphere_Triangle_AD_btest_build_vera
[ 94%] Checking style of test/system/Asymptotic/ErrorOrder_3D_DGBR2_Sphere_Triangle_AD_btest.cpp
[ 94%] Built target ErrorOrder_3D_DGBR2_Sphere_Triangle_AD_btest_build_vera
Scanning dependencies of target ErrorOrder_3D_DGBR2_Sphere_Triangle_AD_btest_OBJECT
[ 94%] Building CXX object test/system/Asymptotic/CMakeFiles/ErrorOrder_3D_DGBR2_Sphere_Triangle_AD_btest_OBJECT.dir/ErrorOrder_3D_DGBR2_Sphere_Triangle_AD_btest.cpp.o
[ 94%] Built target ErrorOrder_3D_DGBR2_Sphere_Triangle_AD_btest_OBJECT
Scanning dependencies of target ErrorOrder_3D_DGBR2_Sphere_Triangle_AD_btest_build
[ 94%] Linking CXX executable ErrorOrder_3D_DGBR2_Sphere_Triangle_AD_btest
[ 94%] Built target ErrorOrder_3D_DGBR2_Sphere_Triangle_AD_btest_build
Scanning dependencies of target ErrorOrder_1D_DGBR2_Burgers_btest_build_vera
[ 94%] Checking style of test/system/Asymptotic/ErrorOrder_1D_DGBR2_Burgers_btest.cpp
[ 94%] Built target ErrorOrder_1D_DGBR2_Burgers_btest_build_vera
Scanning dependencies of target ErrorOrder_1D_DGBR2_Burgers_btest_OBJECT
[ 94%] Building CXX object test/system/Asymptotic/CMakeFiles/ErrorOrder_1D_DGBR2_Burgers_btest_OBJECT.dir/ErrorOrder_1D_DGBR2_Burgers_btest.cpp.o
[ 94%] Built target ErrorOrder_1D_DGBR2_Burgers_btest_OBJECT
Scanning dependencies of target ErrorOrder_1D_DGBR2_Burgers_btest_build
[ 94%] Linking CXX executable ErrorOrder_1D_DGBR2_Burgers_btest
[ 94%] Built target ErrorOrder_1D_DGBR2_Burgers_btest_build
Scanning dependencies of target Solve2D_DGAdvective_LinearRobin_mitLG_sansLG_Consistency_AD_btest_build_vera
[ 94%] Checking style of test/system/Asymptotic/Solve2D_DGAdvective_LinearRobin_mitLG_sansLG_Consistency_AD_btest.cpp
[ 94%] Built target Solve2D_DGAdvective_LinearRobin_mitLG_sansLG_Consistency_AD_btest_build_vera
Scanning dependencies of target Solve2D_DGAdvective_LinearRobin_mitLG_sansLG_Consistency_AD_btest_OBJECT
[ 94%] Building CXX object test/system/Asymptotic/CMakeFiles/Solve2D_DGAdvective_LinearRobin_mitLG_sansLG_Consistency_AD_btest_OBJECT.dir/Solve2D_DGAdvective_LinearRobin_mitLG_sansLG_Consistency_AD_btest.cpp.o
[ 94%] Built target Solve2D_DGAdvective_LinearRobin_mitLG_sansLG_Consistency_AD_btest_OBJECT
Scanning dependencies of target Solve2D_DGAdvective_LinearRobin_mitLG_sansLG_Consistency_AD_btest_build
[ 94%] Linking CXX executable Solve2D_DGAdvective_LinearRobin_mitLG_sansLG_Consistency_AD_btest
[ 94%] Built target Solve2D_DGAdvective_LinearRobin_mitLG_sansLG_Consistency_AD_btest_build
Scanning dependencies of target Adjoint2D_DGAdvective_Triangle_AD_btest_build_vera
[ 94%] Checking style of test/system/Asymptotic/Adjoint2D_DGAdvective_Triangle_AD_btest.cpp
[ 94%] Built target Adjoint2D_DGAdvective_Triangle_AD_btest_build_vera
Scanning dependencies of target Adjoint2D_DGAdvective_Triangle_AD_btest_OBJECT
[ 94%] Building CXX object test/system/Asymptotic/CMakeFiles/Adjoint2D_DGAdvective_Triangle_AD_btest_OBJECT.dir/Adjoint2D_DGAdvective_Triangle_AD_btest.cpp.o
[ 94%] Built target Adjoint2D_DGAdvective_Triangle_AD_btest_OBJECT
Scanning dependencies of target Adjoint2D_DGAdvective_Triangle_AD_btest_build
[ 94%] Linking CXX executable Adjoint2D_DGAdvective_Triangle_AD_btest
[ 94%] Built target Adjoint2D_DGAdvective_Triangle_AD_btest_build
Scanning dependencies of target ErrorOrder_4D_DG_Pentatope_btest_OBJECT
[ 94%] Building CXX object test/system/Asymptotic/CMakeFiles/ErrorOrder_4D_DG_Pentatope_btest_OBJECT.dir/ErrorOrder_4D_DG_Pentatope_btest.cpp.o
[ 94%] Built target ErrorOrder_4D_DG_Pentatope_btest_OBJECT
Scanning dependencies of target ErrorOrder_4D_DG_Pentatope_btest_build_vera
[ 94%] Checking style of test/system/Asymptotic/ErrorOrder_4D_DG_Pentatope_btest.cpp
[ 94%] Built target ErrorOrder_4D_DG_Pentatope_btest_build_vera
Scanning dependencies of target ErrorOrder_4D_DG_Pentatope_btest_build
[ 94%] Linking CXX executable ErrorOrder_4D_DG_Pentatope_btest
[ 94%] Built target ErrorOrder_4D_DG_Pentatope_btest_build
Scanning dependencies of target ErrorOrder_2D_EDG_Triangle_AD_btest_OBJECT
[ 94%] Building CXX object test/system/Asymptotic/CMakeFiles/ErrorOrder_2D_EDG_Triangle_AD_btest_OBJECT.dir/ErrorOrder_2D_EDG_Triangle_AD_btest.cpp.o
[ 94%] Built target ErrorOrder_2D_EDG_Triangle_AD_btest_OBJECT
Scanning dependencies of target ErrorOrder_2D_EDG_Triangle_AD_btest_build_vera
[ 94%] Checking style of test/system/Asymptotic/ErrorOrder_2D_EDG_Triangle_AD_btest.cpp
[ 94%] Built target ErrorOrder_2D_EDG_Triangle_AD_btest_build_vera
Scanning dependencies of target ErrorOrder_2D_EDG_Triangle_AD_btest_build
[ 94%] Linking CXX executable ErrorOrder_2D_EDG_Triangle_AD_btest
[ 94%] Built target ErrorOrder_2D_EDG_Triangle_AD_btest_build
Scanning dependencies of target ErrorEstimateOrder_1D_CG_Line_AD_btest_OBJECT
[ 94%] Building CXX object test/system/Asymptotic/CMakeFiles/ErrorEstimateOrder_1D_CG_Line_AD_btest_OBJECT.dir/ErrorEstimateOrder_1D_CG_Line_AD_btest.cpp.o
[ 94%] Built target ErrorEstimateOrder_1D_CG_Line_AD_btest_OBJECT
Scanning dependencies of target ErrorEstimateOrder_1D_CG_Line_AD_btest_build_vera
[ 94%] Checking style of test/system/Asymptotic/ErrorEstimateOrder_1D_CG_Line_AD_btest.cpp
[ 94%] Built target ErrorEstimateOrder_1D_CG_Line_AD_btest_build_vera
Scanning dependencies of target ErrorEstimateOrder_1D_CG_Line_AD_btest_build
[ 94%] Linking CXX executable ErrorEstimateOrder_1D_CG_Line_AD_btest
[ 94%] Built target ErrorEstimateOrder_1D_CG_Line_AD_btest_build
Scanning dependencies of target ErrorEstimateOrder_2D_HDG_Triangle_AD_btest_build_vera
[ 94%] Checking style of test/system/Asymptotic/ErrorEstimateOrder_2D_HDG_Triangle_AD_btest.cpp
[ 94%] Built target ErrorEstimateOrder_2D_HDG_Triangle_AD_btest_build_vera
Scanning dependencies of target ErrorEstimateOrder_2D_HDG_Triangle_AD_btest_OBJECT
[ 94%] Building CXX object test/system/Asymptotic/CMakeFiles/ErrorEstimateOrder_2D_HDG_Triangle_AD_btest_OBJECT.dir/ErrorEstimateOrder_2D_HDG_Triangle_AD_btest.cpp.o
[ 94%] Built target ErrorEstimateOrder_2D_HDG_Triangle_AD_btest_OBJECT
Scanning dependencies of target ErrorEstimateOrder_2D_HDG_Triangle_AD_btest_build
[ 94%] Linking CXX executable ErrorEstimateOrder_2D_HDG_Triangle_AD_btest
[ 94%] Built target ErrorEstimateOrder_2D_HDG_Triangle_AD_btest_build
Scanning dependencies of target ErrorOrder_1D_HDG_Burgers_btest_OBJECT
[ 94%] Building CXX object test/system/Asymptotic/CMakeFiles/ErrorOrder_1D_HDG_Burgers_btest_OBJECT.dir/ErrorOrder_1D_HDG_Burgers_btest.cpp.o
[ 94%] Built target ErrorOrder_1D_HDG_Burgers_btest_OBJECT
Scanning dependencies of target ErrorOrder_1D_HDG_Burgers_btest_build_vera
[ 94%] Checking style of test/system/Asymptotic/ErrorOrder_1D_HDG_Burgers_btest.cpp
[ 94%] Built target ErrorOrder_1D_HDG_Burgers_btest_build_vera
Scanning dependencies of target ErrorOrder_1D_HDG_Burgers_btest_build
[ 94%] Linking CXX executable ErrorOrder_1D_HDG_Burgers_btest
[ 94%] Built target ErrorOrder_1D_HDG_Burgers_btest_build
Scanning dependencies of target ErrorOrder_1D_DGBR2_TwoPhase_ST_btest_build_vera
[ 94%] Checking style of test/system/Asymptotic/ErrorOrder_1D_DGBR2_TwoPhase_ST_btest.cpp
[ 94%] Built target ErrorOrder_1D_DGBR2_TwoPhase_ST_btest_build_vera
Scanning dependencies of target ErrorOrder_1D_DGBR2_TwoPhase_ST_btest_OBJECT
[ 94%] Building CXX object test/system/Asymptotic/CMakeFiles/ErrorOrder_1D_DGBR2_TwoPhase_ST_btest_OBJECT.dir/ErrorOrder_1D_DGBR2_TwoPhase_ST_btest.cpp.o
[ 94%] Built target ErrorOrder_1D_DGBR2_TwoPhase_ST_btest_OBJECT
Scanning dependencies of target ErrorOrder_1D_DGBR2_TwoPhase_ST_btest_build
[ 94%] Linking CXX executable ErrorOrder_1D_DGBR2_TwoPhase_ST_btest
[ 94%] Built target ErrorOrder_1D_DGBR2_TwoPhase_ST_btest_build
Scanning dependencies of target Adjoint1D_DGBR2_BuckleyLeverett_ST_btest_build_vera
[ 94%] Checking style of test/system/Asymptotic/Adjoint1D_DGBR2_BuckleyLeverett_ST_btest.cpp
[ 94%] Built target Adjoint1D_DGBR2_BuckleyLeverett_ST_btest_build_vera
Scanning dependencies of target Adjoint1D_DGBR2_BuckleyLeverett_ST_btest_OBJECT
[ 94%] Building CXX object test/system/Asymptotic/CMakeFiles/Adjoint1D_DGBR2_BuckleyLeverett_ST_btest_OBJECT.dir/Adjoint1D_DGBR2_BuckleyLeverett_ST_btest.cpp.o
[ 94%] Built target Adjoint1D_DGBR2_BuckleyLeverett_ST_btest_OBJECT
Scanning dependencies of target Adjoint1D_DGBR2_BuckleyLeverett_ST_btest_build
[ 94%] Linking CXX executable Adjoint1D_DGBR2_BuckleyLeverett_ST_btest
[ 94%] Built target Adjoint1D_DGBR2_BuckleyLeverett_ST_btest_build
Scanning dependencies of target ErrorOrder_3D_CG_Sphere_Triangle_AD_btest_build_vera
[ 94%] Checking style of test/system/Asymptotic/ErrorOrder_3D_CG_Sphere_Triangle_AD_btest.cpp
[ 94%] Built target ErrorOrder_3D_CG_Sphere_Triangle_AD_btest_build_vera
Scanning dependencies of target ErrorOrder_3D_CG_Sphere_Triangle_AD_btest_OBJECT
[ 94%] Building CXX object test/system/Asymptotic/CMakeFiles/ErrorOrder_3D_CG_Sphere_Triangle_AD_btest_OBJECT.dir/ErrorOrder_3D_CG_Sphere_Triangle_AD_btest.cpp.o
[ 94%] Built target ErrorOrder_3D_CG_Sphere_Triangle_AD_btest_OBJECT
Scanning dependencies of target ErrorOrder_3D_CG_Sphere_Triangle_AD_btest_build
[ 94%] Linking CXX executable ErrorOrder_3D_CG_Sphere_Triangle_AD_btest
[ 94%] Built target ErrorOrder_3D_CG_Sphere_Triangle_AD_btest_build
Scanning dependencies of target ErrorOrder_1D_HDG_AD_btest_build_vera
[ 94%] Checking style of test/system/Asymptotic/ErrorOrder_1D_HDG_AD_btest.cpp
[ 94%] Built target ErrorOrder_1D_HDG_AD_btest_build_vera
Scanning dependencies of target ErrorOrder_1D_HDG_AD_btest_OBJECT
[ 94%] Building CXX object test/system/Asymptotic/CMakeFiles/ErrorOrder_1D_HDG_AD_btest_OBJECT.dir/ErrorOrder_1D_HDG_AD_btest.cpp.o
[ 94%] Built target ErrorOrder_1D_HDG_AD_btest_OBJECT
Scanning dependencies of target ErrorOrder_1D_HDG_AD_btest_build
[ 94%] Linking CXX executable ErrorOrder_1D_HDG_AD_btest
[ 94%] Built target ErrorOrder_1D_HDG_AD_btest_build
Scanning dependencies of target ErrorOrder_1D_HDG_AD_BDF_btest_build_vera
[ 94%] Checking style of test/system/Asymptotic/ErrorOrder_1D_HDG_AD_BDF_btest.cpp
[ 94%] Built target ErrorOrder_1D_HDG_AD_BDF_btest_build_vera
Scanning dependencies of target ErrorOrder_1D_HDG_AD_BDF_btest_OBJECT
[ 94%] Building CXX object test/system/Asymptotic/CMakeFiles/ErrorOrder_1D_HDG_AD_BDF_btest_OBJECT.dir/ErrorOrder_1D_HDG_AD_BDF_btest.cpp.o
[ 94%] Built target ErrorOrder_1D_HDG_AD_BDF_btest_OBJECT
Scanning dependencies of target ErrorOrder_1D_HDG_AD_BDF_btest_build
[ 94%] Linking CXX executable ErrorOrder_1D_HDG_AD_BDF_btest
[ 94%] Built target ErrorOrder_1D_HDG_AD_BDF_btest_build
Scanning dependencies of target ErrorOrder_1D_DGBR2_AD_BDF_btest_build_vera
[ 94%] Checking style of test/system/Asymptotic/ErrorOrder_1D_DGBR2_AD_BDF_btest.cpp
[ 94%] Built target ErrorOrder_1D_DGBR2_AD_BDF_btest_build_vera
Scanning dependencies of target ErrorOrder_1D_DGBR2_AD_BDF_btest_OBJECT
[ 94%] Building CXX object test/system/Asymptotic/CMakeFiles/ErrorOrder_1D_DGBR2_AD_BDF_btest_OBJECT.dir/ErrorOrder_1D_DGBR2_AD_BDF_btest.cpp.o
[ 94%] Built target ErrorOrder_1D_DGBR2_AD_BDF_btest_OBJECT
Scanning dependencies of target ErrorOrder_1D_DGBR2_AD_BDF_btest_build
[ 94%] Linking CXX executable ErrorOrder_1D_DGBR2_AD_BDF_btest
[ 94%] Built target ErrorOrder_1D_DGBR2_AD_BDF_btest_build
Scanning dependencies of target ErrorOrder_1D_HDGAdvective_Advection_btest_build_vera
[ 94%] Checking style of test/system/Asymptotic/ErrorOrder_1D_HDGAdvective_Advection_btest.cpp
[ 94%] Built target ErrorOrder_1D_HDGAdvective_Advection_btest_build_vera
Scanning dependencies of target ErrorOrder_1D_HDGAdvective_Advection_btest_OBJECT
[ 94%] Building CXX object test/system/Asymptotic/CMakeFiles/ErrorOrder_1D_HDGAdvective_Advection_btest_OBJECT.dir/ErrorOrder_1D_HDGAdvective_Advection_btest.cpp.o
[ 94%] Built target ErrorOrder_1D_HDGAdvective_Advection_btest_OBJECT
Scanning dependencies of target ErrorOrder_1D_HDGAdvective_Advection_btest_build
[ 94%] Linking CXX executable ErrorOrder_1D_HDGAdvective_Advection_btest
[ 94%] Built target ErrorOrder_1D_HDGAdvective_Advection_btest_build
Scanning dependencies of target ErrorEstimateOrder_2D_CG_Triangle_AD_btest_OBJECT
[ 94%] Building CXX object test/system/Asymptotic/CMakeFiles/ErrorEstimateOrder_2D_CG_Triangle_AD_btest_OBJECT.dir/ErrorEstimateOrder_2D_CG_Triangle_AD_btest.cpp.o
[ 94%] Built target ErrorEstimateOrder_2D_CG_Triangle_AD_btest_OBJECT
Scanning dependencies of target ErrorEstimateOrder_2D_CG_Triangle_AD_btest_build_vera
[ 94%] Checking style of test/system/Asymptotic/ErrorEstimateOrder_2D_CG_Triangle_AD_btest.cpp
[ 94%] Built target ErrorEstimateOrder_2D_CG_Triangle_AD_btest_build_vera
Scanning dependencies of target ErrorEstimateOrder_2D_CG_Triangle_AD_btest_build
[ 94%] Linking CXX executable ErrorEstimateOrder_2D_CG_Triangle_AD_btest
[ 94%] Built target ErrorEstimateOrder_2D_CG_Triangle_AD_btest_build
Scanning dependencies of target ErrorOrder_1D_CG_AD_BDF_btest_OBJECT
[ 94%] Building CXX object test/system/Asymptotic/CMakeFiles/ErrorOrder_1D_CG_AD_BDF_btest_OBJECT.dir/ErrorOrder_1D_CG_AD_BDF_btest.cpp.o
[ 94%] Built target ErrorOrder_1D_CG_AD_BDF_btest_OBJECT
Scanning dependencies of target ErrorOrder_1D_CG_AD_BDF_btest_build_vera
[ 94%] Checking style of test/system/Asymptotic/ErrorOrder_1D_CG_AD_BDF_btest.cpp
[ 94%] Built target ErrorOrder_1D_CG_AD_BDF_btest_build_vera
Scanning dependencies of target ErrorOrder_1D_CG_AD_BDF_btest_build
[ 94%] Linking CXX executable ErrorOrder_1D_CG_AD_BDF_btest
[ 94%] Built target ErrorOrder_1D_CG_AD_BDF_btest_build
Scanning dependencies of target ErrorEstimateOrder_1D_DGBR2_Line_AD_btest_build_vera
[ 94%] Checking style of test/system/Asymptotic/ErrorEstimateOrder_1D_DGBR2_Line_AD_btest.cpp
[ 94%] Built target ErrorEstimateOrder_1D_DGBR2_Line_AD_btest_build_vera
Scanning dependencies of target ErrorEstimateOrder_1D_DGBR2_Line_AD_btest_OBJECT
[ 94%] Building CXX object test/system/Asymptotic/CMakeFiles/ErrorEstimateOrder_1D_DGBR2_Line_AD_btest_OBJECT.dir/ErrorEstimateOrder_1D_DGBR2_Line_AD_btest.cpp.o
[ 94%] Built target ErrorEstimateOrder_1D_DGBR2_Line_AD_btest_OBJECT
Scanning dependencies of target ErrorEstimateOrder_1D_DGBR2_Line_AD_btest_build
[ 94%] Linking CXX executable ErrorEstimateOrder_1D_DGBR2_Line_AD_btest
[ 94%] Built target ErrorEstimateOrder_1D_DGBR2_Line_AD_btest_build
Scanning dependencies of target ErrorOrder_3D_CG_Hex_AD_btest_OBJECT
[ 94%] Building CXX object test/system/Asymptotic/CMakeFiles/ErrorOrder_3D_CG_Hex_AD_btest_OBJECT.dir/ErrorOrder_3D_CG_Hex_AD_btest.cpp.o
[ 94%] Built target ErrorOrder_3D_CG_Hex_AD_btest_OBJECT
Scanning dependencies of target ErrorOrder_3D_CG_Hex_AD_btest_build_vera
[ 94%] Checking style of test/system/Asymptotic/ErrorOrder_3D_CG_Hex_AD_btest.cpp
[ 94%] Built target ErrorOrder_3D_CG_Hex_AD_btest_build_vera
Scanning dependencies of target ErrorOrder_3D_CG_Hex_AD_btest_build
[ 94%] Linking CXX executable ErrorOrder_3D_CG_Hex_AD_btest
[ 94%] Built target ErrorOrder_3D_CG_Hex_AD_btest_build
Scanning dependencies of target ErrorEstimateOrder_2D_CG_Nodal_Triangle_AD_btest_OBJECT
[ 94%] Building CXX object test/system/Asymptotic/CMakeFiles/ErrorEstimateOrder_2D_CG_Nodal_Triangle_AD_btest_OBJECT.dir/ErrorEstimateOrder_2D_CG_Nodal_Triangle_AD_btest.cpp.o
[ 94%] Built target ErrorEstimateOrder_2D_CG_Nodal_Triangle_AD_btest_OBJECT
Scanning dependencies of target ErrorEstimateOrder_2D_CG_Nodal_Triangle_AD_btest_build_vera
[ 94%] Checking style of test/system/Asymptotic/ErrorEstimateOrder_2D_CG_Nodal_Triangle_AD_btest.cpp
[ 94%] Built target ErrorEstimateOrder_2D_CG_Nodal_Triangle_AD_btest_build_vera
Scanning dependencies of target ErrorEstimateOrder_2D_CG_Nodal_Triangle_AD_btest_build
[ 94%] Linking CXX executable ErrorEstimateOrder_2D_CG_Nodal_Triangle_AD_btest
[ 94%] Built target ErrorEstimateOrder_2D_CG_Nodal_Triangle_AD_btest_build
Scanning dependencies of target ErrorOrder_2D_DGAdvective_Flat_Line_AD_btest_OBJECT
[ 94%] Building CXX object test/system/Asymptotic/CMakeFiles/ErrorOrder_2D_DGAdvective_Flat_Line_AD_btest_OBJECT.dir/ErrorOrder_2D_DGAdvective_Flat_Line_AD_btest.cpp.o
[ 94%] Built target ErrorOrder_2D_DGAdvective_Flat_Line_AD_btest_OBJECT
Scanning dependencies of target ErrorOrder_2D_DGAdvective_Flat_Line_AD_btest_build_vera
[ 94%] Checking style of test/system/Asymptotic/ErrorOrder_2D_DGAdvective_Flat_Line_AD_btest.cpp
[ 94%] Built target ErrorOrder_2D_DGAdvective_Flat_Line_AD_btest_build_vera
Scanning dependencies of target ErrorOrder_2D_DGAdvective_Flat_Line_AD_btest_build
[ 94%] Linking CXX executable ErrorOrder_2D_DGAdvective_Flat_Line_AD_btest
[ 94%] Built target ErrorOrder_2D_DGAdvective_Flat_Line_AD_btest_build
Scanning dependencies of target ErrorOrder_1D_DGBR2_AD_btest_OBJECT
[ 94%] Building CXX object test/system/Asymptotic/CMakeFiles/ErrorOrder_1D_DGBR2_AD_btest_OBJECT.dir/ErrorOrder_1D_DGBR2_AD_btest.cpp.o
[ 94%] Built target ErrorOrder_1D_DGBR2_AD_btest_OBJECT
Scanning dependencies of target ErrorOrder_1D_DGBR2_AD_btest_build_vera
[ 94%] Checking style of test/system/Asymptotic/ErrorOrder_1D_DGBR2_AD_btest.cpp
[ 94%] Built target ErrorOrder_1D_DGBR2_AD_btest_build_vera
Scanning dependencies of target ErrorOrder_1D_DGBR2_AD_btest_build
[ 94%] Linking CXX executable ErrorOrder_1D_DGBR2_AD_btest
[ 94%] Built target ErrorOrder_1D_DGBR2_AD_btest_build
Scanning dependencies of target ErrorOrder_2D_HDG_Triangle_AD_btest_build_vera
[ 94%] Checking style of test/system/Asymptotic/ErrorOrder_2D_HDG_Triangle_AD_btest.cpp
[ 94%] Built target ErrorOrder_2D_HDG_Triangle_AD_btest_build_vera
Scanning dependencies of target ErrorOrder_2D_HDG_Triangle_AD_btest_OBJECT
[ 94%] Building CXX object test/system/Asymptotic/CMakeFiles/ErrorOrder_2D_HDG_Triangle_AD_btest_OBJECT.dir/ErrorOrder_2D_HDG_Triangle_AD_btest.cpp.o
[ 94%] Built target ErrorOrder_2D_HDG_Triangle_AD_btest_OBJECT
Scanning dependencies of target ErrorOrder_2D_HDG_Triangle_AD_btest_build
[ 94%] Linking CXX executable ErrorOrder_2D_HDG_Triangle_AD_btest
[ 94%] Built target ErrorOrder_2D_HDG_Triangle_AD_btest_build
Scanning dependencies of target ErrorOrder_2D_DGAdvective_Annulus_Triangle_btest_OBJECT
[ 94%] Building CXX object test/system/Asymptotic/CMakeFiles/ErrorOrder_2D_DGAdvective_Annulus_Triangle_btest_OBJECT.dir/ErrorOrder_2D_DGAdvective_Annulus_Triangle_btest.cpp.o
[ 94%] Built target ErrorOrder_2D_DGAdvective_Annulus_Triangle_btest_OBJECT
Scanning dependencies of target ErrorOrder_2D_DGAdvective_Annulus_Triangle_btest_build_vera
[ 94%] Checking style of test/system/Asymptotic/ErrorOrder_2D_DGAdvective_Annulus_Triangle_btest.cpp
[ 94%] Built target ErrorOrder_2D_DGAdvective_Annulus_Triangle_btest_build_vera
Scanning dependencies of target ErrorOrder_2D_DGAdvective_Annulus_Triangle_btest_build
[ 94%] Linking CXX executable ErrorOrder_2D_DGAdvective_Annulus_Triangle_btest
[ 94%] Built target ErrorOrder_2D_DGAdvective_Annulus_Triangle_btest_build
Scanning dependencies of target ErrorOrder_2D_DGAdvective_Circle_Line_AD_btest_OBJECT
[ 94%] Building CXX object test/system/Asymptotic/CMakeFiles/ErrorOrder_2D_DGAdvective_Circle_Line_AD_btest_OBJECT.dir/ErrorOrder_2D_DGAdvective_Circle_Line_AD_btest.cpp.o
[ 94%] Built target ErrorOrder_2D_DGAdvective_Circle_Line_AD_btest_OBJECT
Scanning dependencies of target ErrorOrder_2D_DGAdvective_Circle_Line_AD_btest_build_vera
[ 94%] Checking style of test/system/Asymptotic/ErrorOrder_2D_DGAdvective_Circle_Line_AD_btest.cpp
[ 94%] Built target ErrorOrder_2D_DGAdvective_Circle_Line_AD_btest_build_vera
Scanning dependencies of target ErrorOrder_2D_DGAdvective_Circle_Line_AD_btest_build
[ 94%] Linking CXX executable ErrorOrder_2D_DGAdvective_Circle_Line_AD_btest
[ 94%] Built target ErrorOrder_2D_DGAdvective_Circle_Line_AD_btest_build
Scanning dependencies of target ErrorEstimateOrder_2D_CG_Triangle_RD_btest_OBJECT
[ 94%] Building CXX object test/system/Asymptotic/CMakeFiles/ErrorEstimateOrder_2D_CG_Triangle_RD_btest_OBJECT.dir/ErrorEstimateOrder_2D_CG_Triangle_RD_btest.cpp.o
[ 94%] Built target ErrorEstimateOrder_2D_CG_Triangle_RD_btest_OBJECT
Scanning dependencies of target ErrorEstimateOrder_2D_CG_Triangle_RD_btest_build_vera
[ 94%] Checking style of test/system/Asymptotic/ErrorEstimateOrder_2D_CG_Triangle_RD_btest.cpp
[ 94%] Built target ErrorEstimateOrder_2D_CG_Triangle_RD_btest_build_vera
Scanning dependencies of target ErrorEstimateOrder_2D_CG_Triangle_RD_btest_build
[ 94%] Linking CXX executable ErrorEstimateOrder_2D_CG_Triangle_RD_btest
[ 94%] Built target ErrorEstimateOrder_2D_CG_Triangle_RD_btest_build
Scanning dependencies of target ErrorOrder_2D_CG_Triangle_AD_btest_OBJECT
[ 94%] Building CXX object test/system/Asymptotic/CMakeFiles/ErrorOrder_2D_CG_Triangle_AD_btest_OBJECT.dir/ErrorOrder_2D_CG_Triangle_AD_btest.cpp.o
[ 94%] Built target ErrorOrder_2D_CG_Triangle_AD_btest_OBJECT
Scanning dependencies of target ErrorOrder_2D_CG_Triangle_AD_btest_build_vera
[ 94%] Checking style of test/system/Asymptotic/ErrorOrder_2D_CG_Triangle_AD_btest.cpp
[ 94%] Built target ErrorOrder_2D_CG_Triangle_AD_btest_build_vera
Scanning dependencies of target ErrorOrder_2D_CG_Triangle_AD_btest_build
[ 94%] Linking CXX executable ErrorOrder_2D_CG_Triangle_AD_btest
[ 94%] Built target ErrorOrder_2D_CG_Triangle_AD_btest_build
Scanning dependencies of target ErrorOrder_1D_DGBR2_BuckleyLeverett_ST_btest_build_vera
[ 94%] Checking style of test/system/Asymptotic/ErrorOrder_1D_DGBR2_BuckleyLeverett_ST_btest.cpp
[ 94%] Built target ErrorOrder_1D_DGBR2_BuckleyLeverett_ST_btest_build_vera
Scanning dependencies of target ErrorOrder_1D_DGBR2_BuckleyLeverett_ST_btest_OBJECT
[ 94%] Building CXX object test/system/Asymptotic/CMakeFiles/ErrorOrder_1D_DGBR2_BuckleyLeverett_ST_btest_OBJECT.dir/ErrorOrder_1D_DGBR2_BuckleyLeverett_ST_btest.cpp.o
[ 94%] Built target ErrorOrder_1D_DGBR2_BuckleyLeverett_ST_btest_OBJECT
Scanning dependencies of target ErrorOrder_1D_DGBR2_BuckleyLeverett_ST_btest_build
[ 94%] Linking CXX executable ErrorOrder_1D_DGBR2_BuckleyLeverett_ST_btest
[ 94%] Built target ErrorOrder_1D_DGBR2_BuckleyLeverett_ST_btest_build
Scanning dependencies of target ErrorOrder_2D_CG_Quad_AD_btest_build_vera
[ 94%] Checking style of test/system/Asymptotic/ErrorOrder_2D_CG_Quad_AD_btest.cpp
[ 94%] Built target ErrorOrder_2D_CG_Quad_AD_btest_build_vera
Scanning dependencies of target ErrorOrder_2D_CG_Quad_AD_btest_OBJECT
[ 94%] Building CXX object test/system/Asymptotic/CMakeFiles/ErrorOrder_2D_CG_Quad_AD_btest_OBJECT.dir/ErrorOrder_2D_CG_Quad_AD_btest.cpp.o
[ 94%] Built target ErrorOrder_2D_CG_Quad_AD_btest_OBJECT
Scanning dependencies of target ErrorOrder_2D_CG_Quad_AD_btest_build
[ 94%] Linking CXX executable ErrorOrder_2D_CG_Quad_AD_btest
[ 94%] Built target ErrorOrder_2D_CG_Quad_AD_btest_build
Scanning dependencies of target ErrorEstimateOrder_2D_DGBR2_Triangle_AD_btest_OBJECT
[ 94%] Building CXX object test/system/Asymptotic/CMakeFiles/ErrorEstimateOrder_2D_DGBR2_Triangle_AD_btest_OBJECT.dir/ErrorEstimateOrder_2D_DGBR2_Triangle_AD_btest.cpp.o
[ 94%] Built target ErrorEstimateOrder_2D_DGBR2_Triangle_AD_btest_OBJECT
Scanning dependencies of target ErrorEstimateOrder_2D_DGBR2_Triangle_AD_btest_build_vera
[ 94%] Checking style of test/system/Asymptotic/ErrorEstimateOrder_2D_DGBR2_Triangle_AD_btest.cpp
[ 94%] Built target ErrorEstimateOrder_2D_DGBR2_Triangle_AD_btest_build_vera
Scanning dependencies of target ErrorEstimateOrder_2D_DGBR2_Triangle_AD_btest_build
[ 94%] Linking CXX executable ErrorEstimateOrder_2D_DGBR2_Triangle_AD_btest
[ 94%] Built target ErrorEstimateOrder_2D_DGBR2_Triangle_AD_btest_build
Scanning dependencies of target ErrorOrder_2D_DGAdvective_Circle_Line_ShallowWater_btest_build_vera
[ 94%] Checking style of test/system/Asymptotic/ErrorOrder_2D_DGAdvective_Circle_Line_ShallowWater_btest.cpp
[ 94%] Built target ErrorOrder_2D_DGAdvective_Circle_Line_ShallowWater_btest_build_vera
Scanning dependencies of target ErrorOrder_2D_DGAdvective_Circle_Line_ShallowWater_btest_OBJECT
[ 94%] Building CXX object test/system/Asymptotic/CMakeFiles/ErrorOrder_2D_DGAdvective_Circle_Line_ShallowWater_btest_OBJECT.dir/ErrorOrder_2D_DGAdvective_Circle_Line_ShallowWater_btest.cpp.o
[ 94%] Built target ErrorOrder_2D_DGAdvective_Circle_Line_ShallowWater_btest_OBJECT
Scanning dependencies of target ErrorOrder_2D_DGAdvective_Circle_Line_ShallowWater_btest_build
[ 94%] Linking CXX executable ErrorOrder_2D_DGAdvective_Circle_Line_ShallowWater_btest
[ 94%] Built target ErrorOrder_2D_DGAdvective_Circle_Line_ShallowWater_btest_build
Scanning dependencies of target ErrorOrder_1D_DGAdvective_ShallowWater_btest_OBJECT
[ 94%] Building CXX object test/system/Asymptotic/CMakeFiles/ErrorOrder_1D_DGAdvective_ShallowWater_btest_OBJECT.dir/ErrorOrder_1D_DGAdvective_ShallowWater_btest.cpp.o
[ 94%] Built target ErrorOrder_1D_DGAdvective_ShallowWater_btest_OBJECT
Scanning dependencies of target ErrorOrder_1D_DGAdvective_ShallowWater_btest_build_vera
[ 94%] Checking style of test/system/Asymptotic/ErrorOrder_1D_DGAdvective_ShallowWater_btest.cpp
[ 94%] Built target ErrorOrder_1D_DGAdvective_ShallowWater_btest_build_vera
Scanning dependencies of target ErrorOrder_1D_DGAdvective_ShallowWater_btest_build
[ 94%] Linking CXX executable ErrorOrder_1D_DGAdvective_ShallowWater_btest
[ 94%] Built target ErrorOrder_1D_DGAdvective_ShallowWater_btest_build
Scanning dependencies of target LocalSolve1D_HDG_AD_btest_build_vera
[ 94%] Checking style of test/system/LocalSolve/LocalSolve1D_HDG_AD_btest.cpp
[ 94%] Built target LocalSolve1D_HDG_AD_btest_build_vera
[ 94%] Generating CXX unity source src/Discretization/cotire/BlockLib_CXX_unity.cxx
[ 94%] Generating CXX prefix source src/Discretization/cotire/BlockLib_CXX_prefix.cxx
[ 94%] Generating CXX prefix header src/Discretization/cotire/BlockLib_CXX_prefix.hxx
[ 94%] Building CXX precompiled header src/Discretization/cotire/BlockLib_CXX_prefix.hxx.gch
Scanning dependencies of target BlockLib
[ 94%] Building CXX object src/Discretization/CMakeFiles/BlockLib.dir/Block/AlgebraicEquationSet_Block2x2_Real_Real.cpp.o
[ 94%] Building CXX object src/Discretization/CMakeFiles/BlockLib.dir/Block/AlgebraicEquationSet_Block2x2_VecS3_Real.cpp.o
[ 94%] Building CXX object src/Discretization/CMakeFiles/BlockLib.dir/Block/AlgebraicEquationSet_Block2x2_VecS4_Real.cpp.o
[ 94%] Linking CXX static library libBlockLib.a
[ 94%] Built target BlockLib
Scanning dependencies of target BlockLinAlgLib_vera
[ 94%] Checking style of src/LinearAlgebra/BlockLinAlg/MatrixBlock_3x3.h
[ 94%] Checking style of src/LinearAlgebra/BlockLinAlg/MatrixBlock_2x2.h
[ 94%] Checking style of src/LinearAlgebra/BlockLinAlg/MatrixBlock_2x2_InverseLU.h
[ 94%] Checking style of src/LinearAlgebra/BlockLinAlg/MatrixBlock_2x2_Inverse.h
[ 94%] Checking style of src/LinearAlgebra/BlockLinAlg/BlockLinAlg_Type.h
[ 94%] Checking style of src/LinearAlgebra/BlockLinAlg/MatrixBlock_2x2_Decompose_LU.h
[ 94%] Checking style of src/LinearAlgebra/BlockLinAlg/VectorBlock_4.h
[ 94%] Checking style of src/LinearAlgebra/BlockLinAlg/MatrixBlock_2x2_Transpose.h
[ 94%] Checking style of src/LinearAlgebra/BlockLinAlg/MatrixBlock_2x2_InverseLUP.h
[ 94%] Checking style of src/LinearAlgebra/BlockLinAlg/MatrixBlock_4x4.h
[ 94%] Checking style of src/LinearAlgebra/BlockLinAlg/BlockLinAlg_Add.h
[ 94%] Checking style of src/LinearAlgebra/BlockLinAlg/BlockLinAlg_Mul.h
[ 94%] Checking style of src/LinearAlgebra/BlockLinAlg/MatrixBlock_2x2_Decompose_LUP.h
[ 94%] Checking style of src/LinearAlgebra/BlockLinAlg/VectorBlock_3.h
[ 94%] Checking style of src/LinearAlgebra/BlockLinAlg/VectorBlock_2.h
[ 94%] Checking style of src/LinearAlgebra/BlockLinAlg/MatrixBlock_2x2_InverseLUP.cpp
[ 94%] Checking style of src/LinearAlgebra/BlockLinAlg/MatrixBlock_2x2_Decompose_LUP.cpp
[ 94%] Checking style of src/LinearAlgebra/BlockLinAlg/MatrixBlock_2x2_Decompose_LU.cpp
[ 94%] Checking style of src/LinearAlgebra/BlockLinAlg/MatrixBlock_2x2_InverseLU.cpp
[ 94%] Built target BlockLinAlgLib_vera
[ 94%] Generating CXX unity source src/LinearAlgebra/BlockLinAlg/cotire/BlockLinAlgLib_CXX_unity.cxx
[ 94%] Generating CXX prefix source src/LinearAlgebra/BlockLinAlg/cotire/BlockLinAlgLib_CXX_prefix.cxx
[ 94%] Generating CXX prefix header src/LinearAlgebra/BlockLinAlg/cotire/BlockLinAlgLib_CXX_prefix.hxx
[ 94%] Building CXX precompiled header src/LinearAlgebra/BlockLinAlg/cotire/BlockLinAlgLib_CXX_prefix.hxx.gch
Scanning dependencies of target BlockLinAlgLib
[ 94%] Building CXX object src/LinearAlgebra/BlockLinAlg/CMakeFiles/BlockLinAlgLib.dir/MatrixBlock_2x2_Decompose_LU.cpp.o
[ 94%] Building CXX object src/LinearAlgebra/BlockLinAlg/CMakeFiles/BlockLinAlgLib.dir/MatrixBlock_2x2_Decompose_LUP.cpp.o
[ 94%] Building CXX object src/LinearAlgebra/BlockLinAlg/CMakeFiles/BlockLinAlgLib.dir/MatrixBlock_2x2_InverseLU.cpp.o
[ 94%] Building CXX object src/LinearAlgebra/BlockLinAlg/CMakeFiles/BlockLinAlgLib.dir/MatrixBlock_2x2_InverseLUP.cpp.o
[ 94%] Linking CXX static library libBlockLinAlgLib.a
[ 94%] Built target BlockLinAlgLib
Scanning dependencies of target pdeSensorLib_vera
[ 94%] Checking style of src/pde/Sensor/Sensor_ViscousFlux1D.h
[ 94%] Checking style of src/pde/Sensor/Source1D_JumpSensor.h
[ 94%] Checking style of src/pde/Sensor/BCSensorParameter2D.h
[ 94%] Checking style of src/pde/Sensor/Sensor_Source1D.h
[ 94%] Checking style of src/pde/Sensor/Source2D_JumpSensor.h
[ 94%] Checking style of src/pde/Sensor/Sensor_Source2D.h
[ 94%] Checking style of src/pde/Sensor/PDESensorParameter2D.h
[ 94%] Checking style of src/pde/Sensor/Sensor_AdvectiveFlux2D.h
[ 97%] Checking style of src/pde/Sensor/Sensor_ViscousFlux2D.h
[ 97%] Checking style of src/pde/Sensor/BCSensorParameter1D.h
[ 97%] Checking style of src/pde/Sensor/SensorParameter_Traits.h
[ 97%] Checking style of src/pde/Sensor/PDESensorParameter1D.h
[ 97%] Checking style of src/pde/Sensor/Sensor_AdvectiveFlux1D.h
[ 97%] Checking style of src/pde/Sensor/Sensor_ViscousFlux1D.cpp
[ 97%] Checking style of src/pde/Sensor/Sensor_ViscousFlux2D.cpp
[ 97%] Checking style of src/pde/Sensor/Sensor_AdvectiveFlux1D.cpp
[ 97%] Checking style of src/pde/Sensor/PDESensorParameter1D.cpp
[ 97%] Checking style of src/pde/Sensor/Sensor_AdvectiveFlux2D.cpp
[ 97%] Checking style of src/pde/Sensor/BCSensorParameter2D.cpp
[ 97%] Checking style of src/pde/Sensor/BCSensorParameter1D.cpp
[ 97%] Checking style of src/pde/Sensor/PDESensorParameter2D.cpp
[ 97%] Built target pdeSensorLib_vera
[ 97%] Generating CXX unity source src/pde/Sensor/cotire/pdeSensorLib_CXX_unity.cxx
[ 97%] Generating CXX prefix source src/pde/Sensor/cotire/pdeSensorLib_CXX_prefix.cxx
[ 97%] Generating CXX prefix header src/pde/Sensor/cotire/pdeSensorLib_CXX_prefix.hxx
[ 97%] Building CXX precompiled header src/pde/Sensor/cotire/pdeSensorLib_CXX_prefix.hxx.gch
Scanning dependencies of target pdeSensorLib
[ 97%] Building CXX object src/pde/Sensor/CMakeFiles/pdeSensorLib.dir/BCSensorParameter1D.cpp.o
[ 97%] Building CXX object src/pde/Sensor/CMakeFiles/pdeSensorLib.dir/BCSensorParameter2D.cpp.o
[ 97%] Building CXX object src/pde/Sensor/CMakeFiles/pdeSensorLib.dir/PDESensorParameter1D.cpp.o
[ 97%] Building CXX object src/pde/Sensor/CMakeFiles/pdeSensorLib.dir/PDESensorParameter2D.cpp.o
[ 97%] Building CXX object src/pde/Sensor/CMakeFiles/pdeSensorLib.dir/Sensor_AdvectiveFlux1D.cpp.o
[ 97%] Building CXX object src/pde/Sensor/CMakeFiles/pdeSensorLib.dir/Sensor_AdvectiveFlux2D.cpp.o
[ 97%] Building CXX object src/pde/Sensor/CMakeFiles/pdeSensorLib.dir/Sensor_ViscousFlux1D.cpp.o
[ 97%] Building CXX object src/pde/Sensor/CMakeFiles/pdeSensorLib.dir/Sensor_ViscousFlux2D.cpp.o
[ 97%] Linking CXX static library libpdeSensorLib.a
[ 97%] Built target pdeSensorLib
Scanning dependencies of target LocalSolve1D_HDG_AD_btest_OBJECT
[ 97%] Building CXX object test/system/LocalSolve/CMakeFiles/LocalSolve1D_HDG_AD_btest_OBJECT.dir/LocalSolve1D_HDG_AD_btest.cpp.o
[ 97%] Built target LocalSolve1D_HDG_AD_btest_OBJECT
Scanning dependencies of target LocalSolve1D_HDG_AD_btest_build
[ 97%] Linking CXX executable LocalSolve1D_HDG_AD_btest
[ 97%] Built target LocalSolve1D_HDG_AD_btest_build
Scanning dependencies of target LocalSolve1D_Split_HDG_AD_btest_build_vera
[ 97%] Checking style of test/system/LocalSolve/LocalSolve1D_Split_HDG_AD_btest.cpp
[ 97%] Built target LocalSolve1D_Split_HDG_AD_btest_build_vera
Scanning dependencies of target LocalSolve1D_Split_HDG_AD_btest_OBJECT
[ 97%] Building CXX object test/system/LocalSolve/CMakeFiles/LocalSolve1D_Split_HDG_AD_btest_OBJECT.dir/LocalSolve1D_Split_HDG_AD_btest.cpp.o
[ 97%] Built target LocalSolve1D_Split_HDG_AD_btest_OBJECT
Scanning dependencies of target LocalSolve1D_Split_HDG_AD_btest_build
[ 97%] Linking CXX executable LocalSolve1D_Split_HDG_AD_btest
[ 97%] Built target LocalSolve1D_Split_HDG_AD_btest_build
Scanning dependencies of target LocalSolve2D_Split_DGBR2_Triangle_AD_AV_btest_build_vera
[ 97%] Checking style of test/system/LocalSolve/LocalSolve2D_Split_DGBR2_Triangle_AD_AV_btest.cpp
[ 97%] Built target LocalSolve2D_Split_DGBR2_Triangle_AD_AV_btest_build_vera
Scanning dependencies of target LocalSolve2D_Split_DGBR2_Triangle_AD_AV_btest_OBJECT
[ 97%] Building CXX object test/system/LocalSolve/CMakeFiles/LocalSolve2D_Split_DGBR2_Triangle_AD_AV_btest_OBJECT.dir/LocalSolve2D_Split_DGBR2_Triangle_AD_AV_btest.cpp.o
[ 97%] Built target LocalSolve2D_Split_DGBR2_Triangle_AD_AV_btest_OBJECT
Scanning dependencies of target LocalSolve2D_Split_DGBR2_Triangle_AD_AV_btest_build
[ 97%] Linking CXX executable LocalSolve2D_Split_DGBR2_Triangle_AD_AV_btest
[ 97%] Built target LocalSolve2D_Split_DGBR2_Triangle_AD_AV_btest_build
Scanning dependencies of target LocalSolve1D_Split_DGBR2_AD_btest_build_vera
[ 97%] Checking style of test/system/LocalSolve/LocalSolve1D_Split_DGBR2_AD_btest.cpp
[ 97%] Built target LocalSolve1D_Split_DGBR2_AD_btest_build_vera
Scanning dependencies of target LocalSolve1D_Split_DGBR2_AD_btest_OBJECT
[ 97%] Building CXX object test/system/LocalSolve/CMakeFiles/LocalSolve1D_Split_DGBR2_AD_btest_OBJECT.dir/LocalSolve1D_Split_DGBR2_AD_btest.cpp.o
[ 97%] Built target LocalSolve1D_Split_DGBR2_AD_btest_OBJECT
Scanning dependencies of target LocalSolve1D_Split_DGBR2_AD_btest_build
[ 97%] Linking CXX executable LocalSolve1D_Split_DGBR2_AD_btest
[ 97%] Built target LocalSolve1D_Split_DGBR2_AD_btest_build
Scanning dependencies of target EdgeLocalSolve2D_Dual_Galerkin_Stabilized_Euler_btest_build_vera
[ 97%] Checking style of test/system/LocalSolve/EdgeLocalSolve2D_Dual_Galerkin_Stabilized_Euler_btest.cpp
[ 97%] Built target EdgeLocalSolve2D_Dual_Galerkin_Stabilized_Euler_btest_build_vera
Scanning dependencies of target EdgeLocalSolve2D_Dual_Galerkin_Stabilized_Euler_btest_OBJECT
[ 97%] Building CXX object test/system/LocalSolve/CMakeFiles/EdgeLocalSolve2D_Dual_Galerkin_Stabilized_Euler_btest_OBJECT.dir/EdgeLocalSolve2D_Dual_Galerkin_Stabilized_Euler_btest.cpp.o
[ 97%] Built target EdgeLocalSolve2D_Dual_Galerkin_Stabilized_Euler_btest_OBJECT
Scanning dependencies of target EdgeLocalSolve2D_Dual_Galerkin_Stabilized_Euler_btest_build
[ 97%] Linking CXX executable EdgeLocalSolve2D_Dual_Galerkin_Stabilized_Euler_btest
[ 97%] Built target EdgeLocalSolve2D_Dual_Galerkin_Stabilized_Euler_btest_build
Scanning dependencies of target ElementDualLocalSolve2D_Galerkin_Stabilized_Triangle_AD_btest_build_vera
[ 97%] Checking style of test/system/LocalSolve/ElementDualLocalSolve2D_Galerkin_Stabilized_Triangle_AD_btest.cpp
[ 97%] Built target ElementDualLocalSolve2D_Galerkin_Stabilized_Triangle_AD_btest_build_vera
Scanning dependencies of target ElementDualLocalSolve2D_Galerkin_Stabilized_Triangle_AD_btest_OBJECT
[ 97%] Building CXX object test/system/LocalSolve/CMakeFiles/ElementDualLocalSolve2D_Galerkin_Stabilized_Triangle_AD_btest_OBJECT.dir/ElementDualLocalSolve2D_Galerkin_Stabilized_Triangle_AD_btest.cpp.o
[ 97%] Built target ElementDualLocalSolve2D_Galerkin_Stabilized_Triangle_AD_btest_OBJECT
Scanning dependencies of target ElementDualLocalSolve2D_Galerkin_Stabilized_Triangle_AD_btest_build
[ 97%] Linking CXX executable ElementDualLocalSolve2D_Galerkin_Stabilized_Triangle_AD_btest
[ 97%] Built target ElementDualLocalSolve2D_Galerkin_Stabilized_Triangle_AD_btest_build
Scanning dependencies of target EdgeLocalSolve2D_Dual_Galerkin_Stabilized_AR_btest_OBJECT
[ 97%] Building CXX object test/system/LocalSolve/CMakeFiles/EdgeLocalSolve2D_Dual_Galerkin_Stabilized_AR_btest_OBJECT.dir/EdgeLocalSolve2D_Dual_Galerkin_Stabilized_AR_btest.cpp.o
[ 97%] Built target EdgeLocalSolve2D_Dual_Galerkin_Stabilized_AR_btest_OBJECT
Scanning dependencies of target EdgeLocalSolve2D_Dual_Galerkin_Stabilized_AR_btest_build_vera
[ 97%] Checking style of test/system/LocalSolve/EdgeLocalSolve2D_Dual_Galerkin_Stabilized_AR_btest.cpp
[ 97%] Built target EdgeLocalSolve2D_Dual_Galerkin_Stabilized_AR_btest_build_vera
Scanning dependencies of target EdgeLocalSolve2D_Dual_Galerkin_Stabilized_AR_btest_build
[ 97%] Linking CXX executable EdgeLocalSolve2D_Dual_Galerkin_Stabilized_AR_btest
[ 97%] Built target EdgeLocalSolve2D_Dual_Galerkin_Stabilized_AR_btest_build
Scanning dependencies of target AlgebraicEquationSet_Local_VMSD_Triangle_AD_btest_OBJECT
[ 97%] Building CXX object test/system/LocalSolve/CMakeFiles/AlgebraicEquationSet_Local_VMSD_Triangle_AD_btest_OBJECT.dir/AlgebraicEquationSet_Local_VMSD_Triangle_AD_btest.cpp.o
[ 97%] Built target AlgebraicEquationSet_Local_VMSD_Triangle_AD_btest_OBJECT
Scanning dependencies of target AlgebraicEquationSet_Local_VMSD_Triangle_AD_btest_build_vera
[ 97%] Checking style of test/system/LocalSolve/AlgebraicEquationSet_Local_VMSD_Triangle_AD_btest.cpp
[ 97%] Built target AlgebraicEquationSet_Local_VMSD_Triangle_AD_btest_build_vera
Scanning dependencies of target AlgebraicEquationSet_Local_VMSD_Triangle_AD_btest_build
[ 97%] Linking CXX executable AlgebraicEquationSet_Local_VMSD_Triangle_AD_btest
[ 97%] Built target AlgebraicEquationSet_Local_VMSD_Triangle_AD_btest_build
Scanning dependencies of target LocalSolve3D_HDG_Tet_AD_btest_build_vera
[ 97%] Checking style of test/system/LocalSolve/LocalSolve3D_HDG_Tet_AD_btest.cpp
[ 97%] Built target LocalSolve3D_HDG_Tet_AD_btest_build_vera
Scanning dependencies of target LocalSolve3D_HDG_Tet_AD_btest_OBJECT
[ 97%] Building CXX object test/system/LocalSolve/CMakeFiles/LocalSolve3D_HDG_Tet_AD_btest_OBJECT.dir/LocalSolve3D_HDG_Tet_AD_btest.cpp.o
[ 97%] Built target LocalSolve3D_HDG_Tet_AD_btest_OBJECT
Scanning dependencies of target LocalSolve3D_HDG_Tet_AD_btest_build
[ 97%] Linking CXX executable LocalSolve3D_HDG_Tet_AD_btest
[ 97%] Built target LocalSolve3D_HDG_Tet_AD_btest_build
Scanning dependencies of target ElementLocalSolve3D_DGBR2_Tet_AD_btest_build_vera
[ 97%] Checking style of test/system/LocalSolve/ElementLocalSolve3D_DGBR2_Tet_AD_btest.cpp
[ 97%] Built target ElementLocalSolve3D_DGBR2_Tet_AD_btest_build_vera
Scanning dependencies of target ElementLocalSolve3D_DGBR2_Tet_AD_btest_OBJECT
[ 97%] Building CXX object test/system/LocalSolve/CMakeFiles/ElementLocalSolve3D_DGBR2_Tet_AD_btest_OBJECT.dir/ElementLocalSolve3D_DGBR2_Tet_AD_btest.cpp.o
[ 97%] Built target ElementLocalSolve3D_DGBR2_Tet_AD_btest_OBJECT
Scanning dependencies of target ElementLocalSolve3D_DGBR2_Tet_AD_btest_build
[ 97%] Linking CXX executable ElementLocalSolve3D_DGBR2_Tet_AD_btest
[ 97%] Built target ElementLocalSolve3D_DGBR2_Tet_AD_btest_build
Scanning dependencies of target LocalSolve2D_HDG_Triangle_AD_btest_build_vera
[ 97%] Checking style of test/system/LocalSolve/LocalSolve2D_HDG_Triangle_AD_btest.cpp
[ 97%] Built target LocalSolve2D_HDG_Triangle_AD_btest_build_vera
Scanning dependencies of target LocalSolve2D_HDG_Triangle_AD_btest_OBJECT
[ 97%] Building CXX object test/system/LocalSolve/CMakeFiles/LocalSolve2D_HDG_Triangle_AD_btest_OBJECT.dir/LocalSolve2D_HDG_Triangle_AD_btest.cpp.o
[ 97%] Built target LocalSolve2D_HDG_Triangle_AD_btest_OBJECT
Scanning dependencies of target LocalSolve2D_HDG_Triangle_AD_btest_build
[ 97%] Linking CXX executable LocalSolve2D_HDG_Triangle_AD_btest
[ 97%] Built target LocalSolve2D_HDG_Triangle_AD_btest_build
Scanning dependencies of target EdgeLocalSolve3D_Dual_Galerkin_Stabilized_AD_btest_OBJECT
[ 97%] Building CXX object test/system/LocalSolve/CMakeFiles/EdgeLocalSolve3D_Dual_Galerkin_Stabilized_AD_btest_OBJECT.dir/EdgeLocalSolve3D_Dual_Galerkin_Stabilized_AD_btest.cpp.o
[ 97%] Built target EdgeLocalSolve3D_Dual_Galerkin_Stabilized_AD_btest_OBJECT
Scanning dependencies of target EdgeLocalSolve3D_Dual_Galerkin_Stabilized_AD_btest_build_vera
[ 97%] Checking style of test/system/LocalSolve/EdgeLocalSolve3D_Dual_Galerkin_Stabilized_AD_btest.cpp
[ 97%] Built target EdgeLocalSolve3D_Dual_Galerkin_Stabilized_AD_btest_build_vera
Scanning dependencies of target EdgeLocalSolve3D_Dual_Galerkin_Stabilized_AD_btest_build
[ 97%] Linking CXX executable EdgeLocalSolve3D_Dual_Galerkin_Stabilized_AD_btest
[ 97%] Built target EdgeLocalSolve3D_Dual_Galerkin_Stabilized_AD_btest_build
Scanning dependencies of target LocalSolve3D_Split_HDG_Tet_AD_btest_build_vera
[ 97%] Checking style of test/system/LocalSolve/LocalSolve3D_Split_HDG_Tet_AD_btest.cpp
[ 97%] Built target LocalSolve3D_Split_HDG_Tet_AD_btest_build_vera
Scanning dependencies of target LocalSolve3D_Split_HDG_Tet_AD_btest_OBJECT
[ 97%] Building CXX object test/system/LocalSolve/CMakeFiles/LocalSolve3D_Split_HDG_Tet_AD_btest_OBJECT.dir/LocalSolve3D_Split_HDG_Tet_AD_btest.cpp.o
[ 97%] Built target LocalSolve3D_Split_HDG_Tet_AD_btest_OBJECT
Scanning dependencies of target LocalSolve3D_Split_HDG_Tet_AD_btest_build
[ 97%] Linking CXX executable LocalSolve3D_Split_HDG_Tet_AD_btest
[ 97%] Built target LocalSolve3D_Split_HDG_Tet_AD_btest_build
Scanning dependencies of target LocalSolve2D_Split_HDG_Triangle_AD_btest_OBJECT
[ 97%] Building CXX object test/system/LocalSolve/CMakeFiles/LocalSolve2D_Split_HDG_Triangle_AD_btest_OBJECT.dir/LocalSolve2D_Split_HDG_Triangle_AD_btest.cpp.o
[ 97%] Built target LocalSolve2D_Split_HDG_Triangle_AD_btest_OBJECT
Scanning dependencies of target LocalSolve2D_Split_HDG_Triangle_AD_btest_build_vera
[ 97%] Checking style of test/system/LocalSolve/LocalSolve2D_Split_HDG_Triangle_AD_btest.cpp
[ 97%] Built target LocalSolve2D_Split_HDG_Triangle_AD_btest_build_vera
Scanning dependencies of target LocalSolve2D_Split_HDG_Triangle_AD_btest_build
[ 97%] Linking CXX executable LocalSolve2D_Split_HDG_Triangle_AD_btest
[ 97%] Built target LocalSolve2D_Split_HDG_Triangle_AD_btest_build
Scanning dependencies of target ElementDualLocalSolve3D_Galerkin_Stabilized_Triangle_AD_btest_OBJECT
[ 97%] Building CXX object test/system/LocalSolve/CMakeFiles/ElementDualLocalSolve3D_Galerkin_Stabilized_Triangle_AD_btest_OBJECT.dir/ElementDualLocalSolve3D_Galerkin_Stabilized_Triangle_AD_btest.cpp.o
[ 97%] Built target ElementDualLocalSolve3D_Galerkin_Stabilized_Triangle_AD_btest_OBJECT
Scanning dependencies of target ElementDualLocalSolve3D_Galerkin_Stabilized_Triangle_AD_btest_build_vera
[ 97%] Checking style of test/system/LocalSolve/ElementDualLocalSolve3D_Galerkin_Stabilized_Triangle_AD_btest.cpp
[ 97%] Built target ElementDualLocalSolve3D_Galerkin_Stabilized_Triangle_AD_btest_build_vera
Scanning dependencies of target ElementDualLocalSolve3D_Galerkin_Stabilized_Triangle_AD_btest_build
[ 97%] Linking CXX executable ElementDualLocalSolve3D_Galerkin_Stabilized_Triangle_AD_btest
[ 97%] Built target ElementDualLocalSolve3D_Galerkin_Stabilized_Triangle_AD_btest_build
Scanning dependencies of target ElementLocalSolve2D_DGBR2_Triangle_AD_btest_OBJECT
[ 97%] Building CXX object test/system/LocalSolve/CMakeFiles/ElementLocalSolve2D_DGBR2_Triangle_AD_btest_OBJECT.dir/ElementLocalSolve2D_DGBR2_Triangle_AD_btest.cpp.o
[ 97%] Built target ElementLocalSolve2D_DGBR2_Triangle_AD_btest_OBJECT
Scanning dependencies of target ElementLocalSolve2D_DGBR2_Triangle_AD_btest_build_vera
[ 97%] Checking style of test/system/LocalSolve/ElementLocalSolve2D_DGBR2_Triangle_AD_btest.cpp
[ 97%] Built target ElementLocalSolve2D_DGBR2_Triangle_AD_btest_build_vera
Scanning dependencies of target ElementLocalSolve2D_DGBR2_Triangle_AD_btest_build
[ 97%] Linking CXX executable ElementLocalSolve2D_DGBR2_Triangle_AD_btest
[ 97%] Built target ElementLocalSolve2D_DGBR2_Triangle_AD_btest_build
Scanning dependencies of target EdgeLocalSolve2D_Dual_Galerkin_Stabilized_AD_btest_build_vera
[ 97%] Checking style of test/system/LocalSolve/EdgeLocalSolve2D_Dual_Galerkin_Stabilized_AD_btest.cpp
[ 97%] Built target EdgeLocalSolve2D_Dual_Galerkin_Stabilized_AD_btest_build_vera
Scanning dependencies of target EdgeLocalSolve2D_Dual_Galerkin_Stabilized_AD_btest_OBJECT
[ 97%] Building CXX object test/system/LocalSolve/CMakeFiles/EdgeLocalSolve2D_Dual_Galerkin_Stabilized_AD_btest_OBJECT.dir/EdgeLocalSolve2D_Dual_Galerkin_Stabilized_AD_btest.cpp.o
[ 97%] Built target EdgeLocalSolve2D_Dual_Galerkin_Stabilized_AD_btest_OBJECT
Scanning dependencies of target EdgeLocalSolve2D_Dual_Galerkin_Stabilized_AD_btest_build
[ 97%] Linking CXX executable EdgeLocalSolve2D_Dual_Galerkin_Stabilized_AD_btest
[ 97%] Built target EdgeLocalSolve2D_Dual_Galerkin_Stabilized_AD_btest_build
Scanning dependencies of target ElementLocalSolve1D_DGBR2_Triangle_AD_btest_build_vera
[ 97%] Checking style of test/system/LocalSolve/ElementLocalSolve1D_DGBR2_Triangle_AD_btest.cpp
[ 97%] Built target ElementLocalSolve1D_DGBR2_Triangle_AD_btest_build_vera
Scanning dependencies of target ElementLocalSolve1D_DGBR2_Triangle_AD_btest_OBJECT
[ 97%] Building CXX object test/system/LocalSolve/CMakeFiles/ElementLocalSolve1D_DGBR2_Triangle_AD_btest_OBJECT.dir/ElementLocalSolve1D_DGBR2_Triangle_AD_btest.cpp.o
[ 97%] Built target ElementLocalSolve1D_DGBR2_Triangle_AD_btest_OBJECT
Scanning dependencies of target ElementLocalSolve1D_DGBR2_Triangle_AD_btest_build
[ 97%] Linking CXX executable ElementLocalSolve1D_DGBR2_Triangle_AD_btest
[ 97%] Built target ElementLocalSolve1D_DGBR2_Triangle_AD_btest_build
Scanning dependencies of target AlgebraicEquationSet_Local_VMSDBR2_Triangle_AD_btest_build_vera
[ 97%] Checking style of test/system/LocalSolve/AlgebraicEquationSet_Local_VMSDBR2_Triangle_AD_btest.cpp
[ 97%] Built target AlgebraicEquationSet_Local_VMSDBR2_Triangle_AD_btest_build_vera
Scanning dependencies of target AlgebraicEquationSet_Local_VMSDBR2_Triangle_AD_btest_OBJECT
[ 97%] Building CXX object test/system/LocalSolve/CMakeFiles/AlgebraicEquationSet_Local_VMSDBR2_Triangle_AD_btest_OBJECT.dir/AlgebraicEquationSet_Local_VMSDBR2_Triangle_AD_btest.cpp.o
[ 97%] Built target AlgebraicEquationSet_Local_VMSDBR2_Triangle_AD_btest_OBJECT
Scanning dependencies of target AlgebraicEquationSet_Local_VMSDBR2_Triangle_AD_btest_build
[ 97%] Linking CXX executable AlgebraicEquationSet_Local_VMSDBR2_Triangle_AD_btest
[ 97%] Built target AlgebraicEquationSet_Local_VMSDBR2_Triangle_AD_btest_build
Scanning dependencies of target ElementLocalSolve3D_DGAdvective_Tet_AD_btest_OBJECT
[ 97%] Building CXX object test/system/LocalSolve/CMakeFiles/ElementLocalSolve3D_DGAdvective_Tet_AD_btest_OBJECT.dir/ElementLocalSolve3D_DGAdvective_Tet_AD_btest.cpp.o
[ 97%] Built target ElementLocalSolve3D_DGAdvective_Tet_AD_btest_OBJECT
Scanning dependencies of target ElementLocalSolve3D_DGAdvective_Tet_AD_btest_build_vera
[ 97%] Checking style of test/system/LocalSolve/ElementLocalSolve3D_DGAdvective_Tet_AD_btest.cpp
[ 97%] Built target ElementLocalSolve3D_DGAdvective_Tet_AD_btest_build_vera
Scanning dependencies of target ElementLocalSolve3D_DGAdvective_Tet_AD_btest_build
[ 97%] Linking CXX executable ElementLocalSolve3D_DGAdvective_Tet_AD_btest
[ 97%] Built target ElementLocalSolve3D_DGAdvective_Tet_AD_btest_build
Scanning dependencies of target EdgeLocalSolve1D_Dual_Galerkin_Stabilized_Line_AD_btest_build_vera
[ 97%] Checking style of test/system/LocalSolve/EdgeLocalSolve1D_Dual_Galerkin_Stabilized_Line_AD_btest.cpp
[ 97%] Built target EdgeLocalSolve1D_Dual_Galerkin_Stabilized_Line_AD_btest_build_vera
Scanning dependencies of target EdgeLocalSolve1D_Dual_Galerkin_Stabilized_Line_AD_btest_OBJECT
[ 97%] Building CXX object test/system/LocalSolve/CMakeFiles/EdgeLocalSolve1D_Dual_Galerkin_Stabilized_Line_AD_btest_OBJECT.dir/EdgeLocalSolve1D_Dual_Galerkin_Stabilized_Line_AD_btest.cpp.o
[ 97%] Built target EdgeLocalSolve1D_Dual_Galerkin_Stabilized_Line_AD_btest_OBJECT
Scanning dependencies of target EdgeLocalSolve1D_Dual_Galerkin_Stabilized_Line_AD_btest_build
[ 97%] Linking CXX executable EdgeLocalSolve1D_Dual_Galerkin_Stabilized_Line_AD_btest
[ 97%] Built target EdgeLocalSolve1D_Dual_Galerkin_Stabilized_Line_AD_btest_build
Scanning dependencies of target Block_1D_Decoupled_AD_btest_build_vera
[ 97%] Checking style of test/system/BlockSolve/Block_1D_Decoupled_AD_btest.cpp
[ 97%] Built target Block_1D_Decoupled_AD_btest_build_vera
Scanning dependencies of target Block_1D_Decoupled_AD_btest_OBJECT
[ 97%] Building CXX object test/system/BlockSolve/CMakeFiles/Block_1D_Decoupled_AD_btest_OBJECT.dir/Block_1D_Decoupled_AD_btest.cpp.o
[ 97%] Built target Block_1D_Decoupled_AD_btest_OBJECT
Scanning dependencies of target Block_1D_Decoupled_AD_btest_build
[ 97%] Linking CXX executable Block_1D_Decoupled_AD_btest
[ 97%] Built target Block_1D_Decoupled_AD_btest_build
Scanning dependencies of target Block_1D_Decoupled_Burgers_btest_OBJECT
[ 97%] Building CXX object test/system/BlockSolve/CMakeFiles/Block_1D_Decoupled_Burgers_btest_OBJECT.dir/Block_1D_Decoupled_Burgers_btest.cpp.o
[ 97%] Built target Block_1D_Decoupled_Burgers_btest_OBJECT
Scanning dependencies of target Block_1D_Decoupled_Burgers_btest_build_vera
[ 97%] Checking style of test/system/BlockSolve/Block_1D_Decoupled_Burgers_btest.cpp
[ 97%] Built target Block_1D_Decoupled_Burgers_btest_build_vera
Scanning dependencies of target Block_1D_Decoupled_Burgers_btest_build
[ 97%] Linking CXX executable Block_1D_Decoupled_Burgers_btest
[ 97%] Built target Block_1D_Decoupled_Burgers_btest_build
Scanning dependencies of target AnalyticSolve2D_DGAdvective_Triangle_Euler_UniformStream_btest_build_vera
[ 97%] Checking style of test/system/AnalyticSolve/AnalyticSolve2D_DGAdvective_Triangle_Euler_UniformStream_btest.cpp
[ 97%] Built target AnalyticSolve2D_DGAdvective_Triangle_Euler_UniformStream_btest_build_vera
[ 97%] Generating CXX unity source src/Discretization/cotire/DGBR2NSLib_CXX_unity.cxx
[ 97%] Generating CXX prefix source src/Discretization/cotire/DGBR2NSLib_CXX_prefix.cxx
[ 97%] Generating CXX prefix header src/Discretization/cotire/DGBR2NSLib_CXX_prefix.hxx
[ 97%] Building CXX precompiled header src/Discretization/cotire/DGBR2NSLib_CXX_prefix.hxx.gch
Scanning dependencies of target DGBR2NSLib
[ 97%] Building CXX object src/Discretization/CMakeFiles/DGBR2NSLib.dir/DG/DGBR2_Instantiate/AlgebraicEquationSet_DGBR2_NavierStokes2D_ConservativeConstVisc.cpp.o
[ 97%] Building CXX object src/Discretization/CMakeFiles/DGBR2NSLib.dir/DG/DGBR2_Instantiate/AlgebraicEquationSet_DGBR2_NavierStokes2D_PrimitiveConstVisc.cpp.o
[ 97%] Building CXX object src/Discretization/CMakeFiles/DGBR2NSLib.dir/DG/DGBR2_Instantiate/AlgebraicEquationSet_DGBR2_NavierStokes3D_PrimitiveConstVisc.cpp.o
[ 97%] Building CXX object src/Discretization/CMakeFiles/DGBR2NSLib.dir/DG/DGBR2_Instantiate/AlgebraicEquationSet_DGBR2_NavierStokes3D_PrimitiveSutherland.cpp.o
[ 97%] Building CXX object src/Discretization/CMakeFiles/DGBR2NSLib.dir/DG/DGBR2_Instantiate/AlgebraicEquationSet_DGBR2_NavierStokes3D_SurrogateSutherland.cpp.o
[ 97%] Linking CXX static library libDGBR2NSLib.a
[ 97%] Built target DGBR2NSLib
Scanning dependencies of target AnalyticSolve2D_DGAdvective_Triangle_Euler_UniformStream_btest_OBJECT
[ 97%] Building CXX object test/system/AnalyticSolve/CMakeFiles/AnalyticSolve2D_DGAdvective_Triangle_Euler_UniformStream_btest_OBJECT.dir/AnalyticSolve2D_DGAdvective_Triangle_Euler_UniformStream_btest.cpp.o
[ 97%] Built target AnalyticSolve2D_DGAdvective_Triangle_Euler_UniformStream_btest_OBJECT
Scanning dependencies of target AnalyticSolve2D_DGAdvective_Triangle_Euler_UniformStream_btest_build
[ 97%] Linking CXX executable AnalyticSolve2D_DGAdvective_Triangle_Euler_UniformStream_btest
[ 97%] Built target AnalyticSolve2D_DGAdvective_Triangle_Euler_UniformStream_btest_build
Scanning dependencies of target AnalyticSolve2D_DGBR2_Triangle_NavierStokes_UniformStream_btest_build_vera
[ 97%] Checking style of test/system/AnalyticSolve/AnalyticSolve2D_DGBR2_Triangle_NavierStokes_UniformStream_btest.cpp
[ 97%] Built target AnalyticSolve2D_DGBR2_Triangle_NavierStokes_UniformStream_btest_build_vera
Scanning dependencies of target AnalyticSolve2D_DGBR2_Triangle_NavierStokes_UniformStream_btest_OBJECT
[ 97%] Building CXX object test/system/AnalyticSolve/CMakeFiles/AnalyticSolve2D_DGBR2_Triangle_NavierStokes_UniformStream_btest_OBJECT.dir/AnalyticSolve2D_DGBR2_Triangle_NavierStokes_UniformStream_btest.cpp.o
[ 97%] Built target AnalyticSolve2D_DGBR2_Triangle_NavierStokes_UniformStream_btest_OBJECT
Scanning dependencies of target AnalyticSolve2D_DGBR2_Triangle_NavierStokes_UniformStream_btest_build
[ 97%] Linking CXX executable AnalyticSolve2D_DGBR2_Triangle_NavierStokes_UniformStream_btest
[ 97%] Built target AnalyticSolve2D_DGBR2_Triangle_NavierStokes_UniformStream_btest_build
Scanning dependencies of target AnalyticSolve2D_HDG_Triangle_NavierStokes_btest_build_vera
[ 97%] Checking style of test/system/AnalyticSolve/AnalyticSolve2D_HDG_Triangle_NavierStokes_btest.cpp
[ 97%] Built target AnalyticSolve2D_HDG_Triangle_NavierStokes_btest_build_vera
Scanning dependencies of target AnalyticSolve2D_HDG_Triangle_NavierStokes_btest_OBJECT
[ 97%] Building CXX object test/system/AnalyticSolve/CMakeFiles/AnalyticSolve2D_HDG_Triangle_NavierStokes_btest_OBJECT.dir/AnalyticSolve2D_HDG_Triangle_NavierStokes_btest.cpp.o
[ 97%] Built target AnalyticSolve2D_HDG_Triangle_NavierStokes_btest_OBJECT
Scanning dependencies of target AnalyticSolve2D_HDG_Triangle_NavierStokes_btest_build
[ 97%] Linking CXX executable AnalyticSolve2D_HDG_Triangle_NavierStokes_btest
[ 97%] Built target AnalyticSolve2D_HDG_Triangle_NavierStokes_btest_build
Scanning dependencies of target AnalyticSolve2D_DGAdvective_IBL_StagnationFlow_LamiBL_btest_OBJECT
[ 97%] Building CXX object test/system/AnalyticSolve/CMakeFiles/AnalyticSolve2D_DGAdvective_IBL_StagnationFlow_LamiBL_btest_OBJECT.dir/AnalyticSolve2D_DGAdvective_IBL_StagnationFlow_LamiBL_btest.cpp.o
[ 97%] Built target AnalyticSolve2D_DGAdvective_IBL_StagnationFlow_LamiBL_btest_OBJECT
Scanning dependencies of target AnalyticSolve2D_DGAdvective_IBL_StagnationFlow_LamiBL_btest_build_vera
[ 97%] Checking style of test/system/AnalyticSolve/AnalyticSolve2D_DGAdvective_IBL_StagnationFlow_LamiBL_btest.cpp
[ 97%] Built target AnalyticSolve2D_DGAdvective_IBL_StagnationFlow_LamiBL_btest_build_vera
Scanning dependencies of target AnalyticSolve2D_DGAdvective_IBL_StagnationFlow_LamiBL_btest_build
[ 97%] Linking CXX executable AnalyticSolve2D_DGAdvective_IBL_StagnationFlow_LamiBL_btest
[ 97%] Built target AnalyticSolve2D_DGAdvective_IBL_StagnationFlow_LamiBL_btest_build
Scanning dependencies of target AnalyticSolve2D_DGAdvective_IBL_StagnationFlow_SingleElem_LamiBL_btest_OBJECT
[ 97%] Building CXX object test/system/AnalyticSolve/CMakeFiles/AnalyticSolve2D_DGAdvective_IBL_StagnationFlow_SingleElem_LamiBL_btest_OBJECT.dir/AnalyticSolve2D_DGAdvective_IBL_StagnationFlow_SingleElem_LamiBL_btest.cpp.o
[ 97%] Built target AnalyticSolve2D_DGAdvective_IBL_StagnationFlow_SingleElem_LamiBL_btest_OBJECT
Scanning dependencies of target AnalyticSolve2D_DGAdvective_IBL_StagnationFlow_SingleElem_LamiBL_btest_build_vera
[ 97%] Checking style of test/system/AnalyticSolve/AnalyticSolve2D_DGAdvective_IBL_StagnationFlow_SingleElem_LamiBL_btest.cpp
[ 97%] Built target AnalyticSolve2D_DGAdvective_IBL_StagnationFlow_SingleElem_LamiBL_btest_build_vera
Scanning dependencies of target AnalyticSolve2D_DGAdvective_IBL_StagnationFlow_SingleElem_LamiBL_btest_build
[ 97%] Linking CXX executable AnalyticSolve2D_DGAdvective_IBL_StagnationFlow_SingleElem_LamiBL_btest
[ 97%] Built target AnalyticSolve2D_DGAdvective_IBL_StagnationFlow_SingleElem_LamiBL_btest_build
Scanning dependencies of target AnalyticSolve2D_HDG_Triangle_NavierStokes_UniformStream_btest_OBJECT
[ 97%] Building CXX object test/system/AnalyticSolve/CMakeFiles/AnalyticSolve2D_HDG_Triangle_NavierStokes_UniformStream_btest_OBJECT.dir/AnalyticSolve2D_HDG_Triangle_NavierStokes_UniformStream_btest.cpp.o
[ 97%] Built target AnalyticSolve2D_HDG_Triangle_NavierStokes_UniformStream_btest_OBJECT
Scanning dependencies of target AnalyticSolve2D_HDG_Triangle_NavierStokes_UniformStream_btest_build_vera
[ 97%] Checking style of test/system/AnalyticSolve/AnalyticSolve2D_HDG_Triangle_NavierStokes_UniformStream_btest.cpp
[ 97%] Built target AnalyticSolve2D_HDG_Triangle_NavierStokes_UniformStream_btest_build_vera
Scanning dependencies of target AnalyticSolve2D_HDG_Triangle_NavierStokes_UniformStream_btest_build
[ 97%] Linking CXX executable AnalyticSolve2D_HDG_Triangle_NavierStokes_UniformStream_btest
[ 97%] Built target AnalyticSolve2D_HDG_Triangle_NavierStokes_UniformStream_btest_build
Scanning dependencies of target AnalyticSolve_HDG_AD_btest_build_vera
[ 97%] Checking style of test/system/AnalyticSolve/AnalyticSolve_HDG_AD_btest.cpp
[ 97%] Built target AnalyticSolve_HDG_AD_btest_build_vera
Scanning dependencies of target AnalyticSolve_HDG_AD_btest_OBJECT
[ 97%] Building CXX object test/system/AnalyticSolve/CMakeFiles/AnalyticSolve_HDG_AD_btest_OBJECT.dir/AnalyticSolve_HDG_AD_btest.cpp.o
[ 97%] Built target AnalyticSolve_HDG_AD_btest_OBJECT
Scanning dependencies of target AnalyticSolve_HDG_AD_btest_build
[ 97%] Linking CXX executable AnalyticSolve_HDG_AD_btest
[ 97%] Built target AnalyticSolve_HDG_AD_btest_build
Scanning dependencies of target AnalyticSolve2D_DGBR2_Triangle_NavierStokes_btest_build_vera
[ 97%] Checking style of test/system/AnalyticSolve/AnalyticSolve2D_DGBR2_Triangle_NavierStokes_btest.cpp
[ 97%] Built target AnalyticSolve2D_DGBR2_Triangle_NavierStokes_btest_build_vera
Scanning dependencies of target AnalyticSolve2D_DGBR2_Triangle_NavierStokes_btest_OBJECT
[ 97%] Building CXX object test/system/AnalyticSolve/CMakeFiles/AnalyticSolve2D_DGBR2_Triangle_NavierStokes_btest_OBJECT.dir/AnalyticSolve2D_DGBR2_Triangle_NavierStokes_btest.cpp.o
[ 97%] Built target AnalyticSolve2D_DGBR2_Triangle_NavierStokes_btest_OBJECT
Scanning dependencies of target AnalyticSolve2D_DGBR2_Triangle_NavierStokes_btest_build
[ 97%] Linking CXX executable AnalyticSolve2D_DGBR2_Triangle_NavierStokes_btest
[ 97%] Built target AnalyticSolve2D_DGBR2_Triangle_NavierStokes_btest_build
Scanning dependencies of target PDEEulermitAVDiffusion2D_Consistency_btest_build_vera
[ 97%] Checking style of test/system/CodeConsistency/PDEEulermitAVDiffusion2D_Consistency_btest.cpp
[ 97%] Built target PDEEulermitAVDiffusion2D_Consistency_btest_build_vera
Scanning dependencies of target PDEEulermitAVDiffusion2D_Consistency_btest_OBJECT
[ 97%] Building CXX object test/system/CodeConsistency/CMakeFiles/PDEEulermitAVDiffusion2D_Consistency_btest_OBJECT.dir/PDEEulermitAVDiffusion2D_Consistency_btest.cpp.o
[ 97%] Built target PDEEulermitAVDiffusion2D_Consistency_btest_OBJECT
Scanning dependencies of target PDEEulermitAVDiffusion2D_Consistency_btest_build
[ 97%] Linking CXX executable PDEEulermitAVDiffusion2D_Consistency_btest
[ 97%] Built target PDEEulermitAVDiffusion2D_Consistency_btest_build
Scanning dependencies of target PDEmitAVSensor3D_Consistency_btest_build_vera
[ 97%] Checking style of test/system/CodeConsistency/PDEmitAVSensor3D_Consistency_btest.cpp
[ 97%] Built target PDEmitAVSensor3D_Consistency_btest_build_vera
Scanning dependencies of target PDEmitAVSensor3D_Consistency_btest_OBJECT
[ 97%] Building CXX object test/system/CodeConsistency/CMakeFiles/PDEmitAVSensor3D_Consistency_btest_OBJECT.dir/PDEmitAVSensor3D_Consistency_btest.cpp.o
[ 97%] Built target PDEmitAVSensor3D_Consistency_btest_OBJECT
Scanning dependencies of target PDEmitAVSensor3D_Consistency_btest_build
[ 97%] Linking CXX executable PDEmitAVSensor3D_Consistency_btest
[ 97%] Built target PDEmitAVSensor3D_Consistency_btest_build
Scanning dependencies of target Solve2D_Uncoupled_HDGAdvectiveIBL_LamiBL_btest_OBJECT
[ 97%] Building CXX object test/system/CodeConsistency/CMakeFiles/Solve2D_Uncoupled_HDGAdvectiveIBL_LamiBL_btest_OBJECT.dir/Solve2D_Uncoupled_HDGAdvectiveIBL_LamiBL_btest.cpp.o
[ 97%] Built target Solve2D_Uncoupled_HDGAdvectiveIBL_LamiBL_btest_OBJECT
Scanning dependencies of target Solve2D_Uncoupled_HDGAdvectiveIBL_LamiBL_btest_build_vera
[ 97%] Checking style of test/system/CodeConsistency/Solve2D_Uncoupled_HDGAdvectiveIBL_LamiBL_btest.cpp
[ 97%] Built target Solve2D_Uncoupled_HDGAdvectiveIBL_LamiBL_btest_build_vera
Scanning dependencies of target Solve2D_Uncoupled_HDGAdvectiveIBL_LamiBL_btest_build
[ 97%] Linking CXX executable Solve2D_Uncoupled_HDGAdvectiveIBL_LamiBL_btest
[ 97%] Built target Solve2D_Uncoupled_HDGAdvectiveIBL_LamiBL_btest_build
Scanning dependencies of target PDEEulermitAVDiffusion3D_Consistency_btest_OBJECT
[ 97%] Building CXX object test/system/CodeConsistency/CMakeFiles/PDEEulermitAVDiffusion3D_Consistency_btest_OBJECT.dir/PDEEulermitAVDiffusion3D_Consistency_btest.cpp.o
[ 97%] Built target PDEEulermitAVDiffusion3D_Consistency_btest_OBJECT
Scanning dependencies of target PDEEulermitAVDiffusion3D_Consistency_btest_build_vera
[ 97%] Checking style of test/system/CodeConsistency/PDEEulermitAVDiffusion3D_Consistency_btest.cpp
[ 97%] Built target PDEEulermitAVDiffusion3D_Consistency_btest_build_vera
Scanning dependencies of target PDEEulermitAVDiffusion3D_Consistency_btest_build
[ 97%] Linking CXX executable PDEEulermitAVDiffusion3D_Consistency_btest
[ 97%] Built target PDEEulermitAVDiffusion3D_Consistency_btest_build
Scanning dependencies of target Solve2D_Coupled4x4_IBLSplitAmpLag_CorrelationClosure_CapturedTransition_PTC_btest_OBJECT
[ 97%] Building CXX object test/system/CodeConsistency/CMakeFiles/Solve2D_Coupled4x4_IBLSplitAmpLag_CorrelationClosure_CapturedTransition_PTC_btest_OBJECT.dir/Solve2D_Coupled4x4_IBLSplitAmpLag_CorrelationClosure_CapturedTransition_PTC_btest.cpp.o
[ 97%] Built target Solve2D_Coupled4x4_IBLSplitAmpLag_CorrelationClosure_CapturedTransition_PTC_btest_OBJECT
Scanning dependencies of target Solve2D_Coupled4x4_IBLSplitAmpLag_CorrelationClosure_CapturedTransition_PTC_btest_build_vera
[ 97%] Checking style of test/system/CodeConsistency/Solve2D_Coupled4x4_IBLSplitAmpLag_CorrelationClosure_CapturedTransition_PTC_btest.cpp
[ 97%] Built target Solve2D_Coupled4x4_IBLSplitAmpLag_CorrelationClosure_CapturedTransition_PTC_btest_build_vera
Scanning dependencies of target Solve2D_Coupled4x4_IBLSplitAmpLag_CorrelationClosure_CapturedTransition_PTC_btest_build
[ 97%] Linking CXX executable Solve2D_Coupled4x4_IBLSplitAmpLag_CorrelationClosure_CapturedTransition_PTC_btest
[ 97%] Built target Solve2D_Coupled4x4_IBLSplitAmpLag_CorrelationClosure_CapturedTransition_PTC_btest_build
Scanning dependencies of target PDEEulermitAVDiffusion3D_RANSSA_Consistency_btest_OBJECT
[ 97%] Building CXX object test/system/CodeConsistency/CMakeFiles/PDEEulermitAVDiffusion3D_RANSSA_Consistency_btest_OBJECT.dir/PDEEulermitAVDiffusion3D_RANSSA_Consistency_btest.cpp.o
[ 97%] Built target PDEEulermitAVDiffusion3D_RANSSA_Consistency_btest_OBJECT
Scanning dependencies of target PDEEulermitAVDiffusion3D_RANSSA_Consistency_btest_build_vera
[ 97%] Checking style of test/system/CodeConsistency/PDEEulermitAVDiffusion3D_RANSSA_Consistency_btest.cpp
[ 97%] Built target PDEEulermitAVDiffusion3D_RANSSA_Consistency_btest_build_vera
Scanning dependencies of target PDEEulermitAVDiffusion3D_RANSSA_Consistency_btest_build
[ 97%] Linking CXX executable PDEEulermitAVDiffusion3D_RANSSA_Consistency_btest
[ 97%] Built target PDEEulermitAVDiffusion3D_RANSSA_Consistency_btest_build
Scanning dependencies of target BCEulermitAVSensor2D_Consistency_RANSSA_btest_build_vera
[ 97%] Checking style of test/system/CodeConsistency/BCEulermitAVSensor2D_Consistency_RANSSA_btest.cpp
[ 97%] Built target BCEulermitAVSensor2D_Consistency_RANSSA_btest_build_vera
Scanning dependencies of target BCEulermitAVSensor2D_Consistency_RANSSA_btest_OBJECT
[ 97%] Building CXX object test/system/CodeConsistency/CMakeFiles/BCEulermitAVSensor2D_Consistency_RANSSA_btest_OBJECT.dir/BCEulermitAVSensor2D_Consistency_RANSSA_btest.cpp.o
[ 97%] Built target BCEulermitAVSensor2D_Consistency_RANSSA_btest_OBJECT
Scanning dependencies of target BCEulermitAVSensor2D_Consistency_RANSSA_btest_build
[ 97%] Linking CXX executable BCEulermitAVSensor2D_Consistency_RANSSA_btest
[ 97%] Built target BCEulermitAVSensor2D_Consistency_RANSSA_btest_build
Scanning dependencies of target PDEmitAVSensor2D_Consistency_RANSSA_btest_build_vera
[ 97%] Checking style of test/system/CodeConsistency/PDEmitAVSensor2D_Consistency_RANSSA_btest.cpp
[ 97%] Built target PDEmitAVSensor2D_Consistency_RANSSA_btest_build_vera
Scanning dependencies of target PDEmitAVSensor2D_Consistency_RANSSA_btest_OBJECT
[ 97%] Building CXX object test/system/CodeConsistency/CMakeFiles/PDEmitAVSensor2D_Consistency_RANSSA_btest_OBJECT.dir/PDEmitAVSensor2D_Consistency_RANSSA_btest.cpp.o
[ 97%] Built target PDEmitAVSensor2D_Consistency_RANSSA_btest_OBJECT
Scanning dependencies of target PDEmitAVSensor2D_Consistency_RANSSA_btest_build
[ 97%] Linking CXX executable PDEmitAVSensor2D_Consistency_RANSSA_btest
[ 97%] Built target PDEmitAVSensor2D_Consistency_RANSSA_btest_build
Scanning dependencies of target AlgebraicEquationSet_PTC_VMSD_Triangle_SA_btest_OBJECT
[ 97%] Building CXX object test/system/CodeConsistency/CMakeFiles/AlgebraicEquationSet_PTC_VMSD_Triangle_SA_btest_OBJECT.dir/AlgebraicEquationSet_PTC_VMSD_Triangle_SA_btest.cpp.o
[ 97%] Built target AlgebraicEquationSet_PTC_VMSD_Triangle_SA_btest_OBJECT
Scanning dependencies of target AlgebraicEquationSet_PTC_VMSD_Triangle_SA_btest_build_vera
[ 97%] Checking style of test/system/CodeConsistency/AlgebraicEquationSet_PTC_VMSD_Triangle_SA_btest.cpp
[ 97%] Built target AlgebraicEquationSet_PTC_VMSD_Triangle_SA_btest_build_vera
Scanning dependencies of target AlgebraicEquationSet_PTC_VMSD_Triangle_SA_btest_build
[ 97%] Linking CXX executable AlgebraicEquationSet_PTC_VMSD_Triangle_SA_btest
[ 97%] Built target AlgebraicEquationSet_PTC_VMSD_Triangle_SA_btest_build
Scanning dependencies of target PDEmitAVSensor1D_Consistency_btest_build_vera
[ 97%] Checking style of test/system/CodeConsistency/PDEmitAVSensor1D_Consistency_btest.cpp
[ 97%] Built target PDEmitAVSensor1D_Consistency_btest_build_vera
Scanning dependencies of target PDEmitAVSensor1D_Consistency_btest_OBJECT
[ 97%] Building CXX object test/system/CodeConsistency/CMakeFiles/PDEmitAVSensor1D_Consistency_btest_OBJECT.dir/PDEmitAVSensor1D_Consistency_btest.cpp.o
[ 97%] Built target PDEmitAVSensor1D_Consistency_btest_OBJECT
Scanning dependencies of target PDEmitAVSensor1D_Consistency_btest_build
[ 97%] Linking CXX executable PDEmitAVSensor1D_Consistency_btest
[ 97%] Built target PDEmitAVSensor1D_Consistency_btest_build
Scanning dependencies of target Solve2D_Coupled4x4_IBL_Panel_NACA0004_FittedTransition_TwoLayerNewton_btest_OBJECT
[ 97%] Building CXX object test/system/CodeConsistency/CMakeFiles/Solve2D_Coupled4x4_IBL_Panel_NACA0004_FittedTransition_TwoLayerNewton_btest_OBJECT.dir/Solve2D_Coupled4x4_IBL_Panel_NACA0004_FittedTransition_TwoLayerNewton_btest.cpp.o
[ 97%] Built target Solve2D_Coupled4x4_IBL_Panel_NACA0004_FittedTransition_TwoLayerNewton_btest_OBJECT
Scanning dependencies of target Solve2D_Coupled4x4_IBL_Panel_NACA0004_FittedTransition_TwoLayerNewton_btest_build_vera
[ 97%] Checking style of test/system/CodeConsistency/Solve2D_Coupled4x4_IBL_Panel_NACA0004_FittedTransition_TwoLayerNewton_btest.cpp
[ 97%] Built target Solve2D_Coupled4x4_IBL_Panel_NACA0004_FittedTransition_TwoLayerNewton_btest_build_vera
Scanning dependencies of target Solve2D_Coupled4x4_IBL_Panel_NACA0004_FittedTransition_TwoLayerNewton_btest_build
[ 97%] Linking CXX executable Solve2D_Coupled4x4_IBL_Panel_NACA0004_FittedTransition_TwoLayerNewton_btest
[ 97%] Built target Solve2D_Coupled4x4_IBL_Panel_NACA0004_FittedTransition_TwoLayerNewton_btest_build
Scanning dependencies of target BCEulermitAVSensor3D_Consistency_btest_OBJECT
[ 97%] Building CXX object test/system/CodeConsistency/CMakeFiles/BCEulermitAVSensor3D_Consistency_btest_OBJECT.dir/BCEulermitAVSensor3D_Consistency_btest.cpp.o
[ 97%] Built target BCEulermitAVSensor3D_Consistency_btest_OBJECT
Scanning dependencies of target BCEulermitAVSensor3D_Consistency_btest_build_vera
[ 97%] Checking style of test/system/CodeConsistency/BCEulermitAVSensor3D_Consistency_btest.cpp
[ 97%] Built target BCEulermitAVSensor3D_Consistency_btest_build_vera
Scanning dependencies of target BCEulermitAVSensor3D_Consistency_btest_build
[ 97%] Linking CXX executable BCEulermitAVSensor3D_Consistency_btest
[ 97%] Built target BCEulermitAVSensor3D_Consistency_btest_build
Scanning dependencies of target PDEEulermitAVDiffusion2D_RANSSA_Consistency_btest_build_vera
[ 97%] Checking style of test/system/CodeConsistency/PDEEulermitAVDiffusion2D_RANSSA_Consistency_btest.cpp
[ 97%] Built target PDEEulermitAVDiffusion2D_RANSSA_Consistency_btest_build_vera
Scanning dependencies of target PDEEulermitAVDiffusion2D_RANSSA_Consistency_btest_OBJECT
[100%] Building CXX object test/system/CodeConsistency/CMakeFiles/PDEEulermitAVDiffusion2D_RANSSA_Consistency_btest_OBJECT.dir/PDEEulermitAVDiffusion2D_RANSSA_Consistency_btest.cpp.o
[100%] Built target PDEEulermitAVDiffusion2D_RANSSA_Consistency_btest_OBJECT
Scanning dependencies of target PDEEulermitAVDiffusion2D_RANSSA_Consistency_btest_build
[100%] Linking CXX executable PDEEulermitAVDiffusion2D_RANSSA_Consistency_btest
[100%] Built target PDEEulermitAVDiffusion2D_RANSSA_Consistency_btest_build
Scanning dependencies of target Solve2D_Uncoupled_DGAdvectiveIBL_LamiBL_PTC_btest_OBJECT
[100%] Building CXX object test/system/CodeConsistency/CMakeFiles/Solve2D_Uncoupled_DGAdvectiveIBL_LamiBL_PTC_btest_OBJECT.dir/Solve2D_Uncoupled_DGAdvectiveIBL_LamiBL_PTC_btest.cpp.o
[100%] Built target Solve2D_Uncoupled_DGAdvectiveIBL_LamiBL_PTC_btest_OBJECT
Scanning dependencies of target Solve2D_Uncoupled_DGAdvectiveIBL_LamiBL_PTC_btest_build_vera
[100%] Checking style of test/system/CodeConsistency/Solve2D_Uncoupled_DGAdvectiveIBL_LamiBL_PTC_btest.cpp
[100%] Built target Solve2D_Uncoupled_DGAdvectiveIBL_LamiBL_PTC_btest_build_vera
Scanning dependencies of target Solve2D_Uncoupled_DGAdvectiveIBL_LamiBL_PTC_btest_build
[100%] Linking CXX executable Solve2D_Uncoupled_DGAdvectiveIBL_LamiBL_PTC_btest
[100%] Built target Solve2D_Uncoupled_DGAdvectiveIBL_LamiBL_PTC_btest_build
Scanning dependencies of target BCEulermitAVSensor2D_Consistency_btest_OBJECT
[100%] Building CXX object test/system/CodeConsistency/CMakeFiles/BCEulermitAVSensor2D_Consistency_btest_OBJECT.dir/BCEulermitAVSensor2D_Consistency_btest.cpp.o
[100%] Built target BCEulermitAVSensor2D_Consistency_btest_OBJECT
Scanning dependencies of target BCEulermitAVSensor2D_Consistency_btest_build_vera
[100%] Checking style of test/system/CodeConsistency/BCEulermitAVSensor2D_Consistency_btest.cpp
[100%] Built target BCEulermitAVSensor2D_Consistency_btest_build_vera
Scanning dependencies of target BCEulermitAVSensor2D_Consistency_btest_build
[100%] Linking CXX executable BCEulermitAVSensor2D_Consistency_btest
[100%] Built target BCEulermitAVSensor2D_Consistency_btest_build
Scanning dependencies of target BCEulermitAVSensor3D_Consistency_RANSSA_btest_OBJECT
[100%] Building CXX object test/system/CodeConsistency/CMakeFiles/BCEulermitAVSensor3D_Consistency_RANSSA_btest_OBJECT.dir/BCEulermitAVSensor3D_Consistency_RANSSA_btest.cpp.o
[100%] Built target BCEulermitAVSensor3D_Consistency_RANSSA_btest_OBJECT
Scanning dependencies of target BCEulermitAVSensor3D_Consistency_RANSSA_btest_build_vera
[100%] Checking style of test/system/CodeConsistency/BCEulermitAVSensor3D_Consistency_RANSSA_btest.cpp
[100%] Built target BCEulermitAVSensor3D_Consistency_RANSSA_btest_build_vera
Scanning dependencies of target BCEulermitAVSensor3D_Consistency_RANSSA_btest_build
[100%] Linking CXX executable BCEulermitAVSensor3D_Consistency_RANSSA_btest
[100%] Built target BCEulermitAVSensor3D_Consistency_RANSSA_btest_build
Scanning dependencies of target PDEEulermitAVDiffusion1D_Consistency_btest_OBJECT
[100%] Building CXX object test/system/CodeConsistency/CMakeFiles/PDEEulermitAVDiffusion1D_Consistency_btest_OBJECT.dir/PDEEulermitAVDiffusion1D_Consistency_btest.cpp.o
[100%] Built target PDEEulermitAVDiffusion1D_Consistency_btest_OBJECT
Scanning dependencies of target PDEEulermitAVDiffusion1D_Consistency_btest_build_vera
[100%] Checking style of test/system/CodeConsistency/PDEEulermitAVDiffusion1D_Consistency_btest.cpp
[100%] Built target PDEEulermitAVDiffusion1D_Consistency_btest_build_vera
Scanning dependencies of target PDEEulermitAVDiffusion1D_Consistency_btest_build
[100%] Linking CXX executable PDEEulermitAVDiffusion1D_Consistency_btest
[100%] Built target PDEEulermitAVDiffusion1D_Consistency_btest_build
Scanning dependencies of target Solve2D_Uncoupled_DGAdvectiveIBLUniField_CorrelationClosure_LamiBL_btest_OBJECT
[100%] Building CXX object test/system/CodeConsistency/CMakeFiles/Solve2D_Uncoupled_DGAdvectiveIBLUniField_CorrelationClosure_LamiBL_btest_OBJECT.dir/Solve2D_Uncoupled_DGAdvectiveIBLUniField_CorrelationClosure_LamiBL_btest.cpp.o
[100%] Built target Solve2D_Uncoupled_DGAdvectiveIBLUniField_CorrelationClosure_LamiBL_btest_OBJECT
Scanning dependencies of target Solve2D_Uncoupled_DGAdvectiveIBLUniField_CorrelationClosure_LamiBL_btest_build_vera
[100%] Checking style of test/system/CodeConsistency/Solve2D_Uncoupled_DGAdvectiveIBLUniField_CorrelationClosure_LamiBL_btest.cpp
[100%] Built target Solve2D_Uncoupled_DGAdvectiveIBLUniField_CorrelationClosure_LamiBL_btest_build_vera
Scanning dependencies of target Solve2D_Uncoupled_DGAdvectiveIBLUniField_CorrelationClosure_LamiBL_btest_build
[100%] Linking CXX executable Solve2D_Uncoupled_DGAdvectiveIBLUniField_CorrelationClosure_LamiBL_btest
[100%] Built target Solve2D_Uncoupled_DGAdvectiveIBLUniField_CorrelationClosure_LamiBL_btest_build
Scanning dependencies of target PDEmitAVSensor2D_Consistency_btest_OBJECT
[100%] Building CXX object test/system/CodeConsistency/CMakeFiles/PDEmitAVSensor2D_Consistency_btest_OBJECT.dir/PDEmitAVSensor2D_Consistency_btest.cpp.o
[100%] Built target PDEmitAVSensor2D_Consistency_btest_OBJECT
Scanning dependencies of target PDEmitAVSensor2D_Consistency_btest_build_vera
[100%] Checking style of test/system/CodeConsistency/PDEmitAVSensor2D_Consistency_btest.cpp
[100%] Built target PDEmitAVSensor2D_Consistency_btest_build_vera
Scanning dependencies of target PDEmitAVSensor2D_Consistency_btest_build
[100%] Linking CXX executable PDEmitAVSensor2D_Consistency_btest
[100%] Built target PDEmitAVSensor2D_Consistency_btest_build
Scanning dependencies of target PDEmitAVSensor3D_Consistency_RANSSA_btest_OBJECT
[100%] Building CXX object test/system/CodeConsistency/CMakeFiles/PDEmitAVSensor3D_Consistency_RANSSA_btest_OBJECT.dir/PDEmitAVSensor3D_Consistency_RANSSA_btest.cpp.o
[100%] Built target PDEmitAVSensor3D_Consistency_RANSSA_btest_OBJECT
Scanning dependencies of target PDEmitAVSensor3D_Consistency_RANSSA_btest_build_vera
[100%] Checking style of test/system/CodeConsistency/PDEmitAVSensor3D_Consistency_RANSSA_btest.cpp
[100%] Built target PDEmitAVSensor3D_Consistency_RANSSA_btest_build_vera
Scanning dependencies of target PDEmitAVSensor3D_Consistency_RANSSA_btest_build
[100%] Linking CXX executable PDEmitAVSensor3D_Consistency_RANSSA_btest
[100%] Built target PDEmitAVSensor3D_Consistency_RANSSA_btest_build
Scanning dependencies of target check_system_build
[100%] Built target check_system_build
Scanning dependencies of target memcheck_system
   Site: reynolds
   Build name: Linux-g++-9
Create new tag: 20200416-1334 - Experimental
Test project /jenkins/workspace/SANS_Weekly/builddir/debug_gnu9/buildnode/reynolds/build/debug_gnu9
        Start 1698: SolverInterface_Galerkin_Stabilized_btest_memcheck
  1/103 Test #1698: SolverInterface_Galerkin_Stabilized_btest_memcheck ...........................................   Passed   33.93 sec
        Start 1700: SolverInterface_DGAdvective_btest_memcheck
  2/103 Test #1700: SolverInterface_DGAdvective_btest_memcheck ...................................................   Passed   21.68 sec
        Start 1702: SolverInterface_DGBR2_btest_memcheck
  3/103 Test #1702: SolverInterface_DGBR2_btest_memcheck .........................................................   Passed   61.45 sec
        Start 1704: ErrorOrder_2D_CG_Triangle_AD_btest_memcheck
  4/103 Test #1704: ErrorOrder_2D_CG_Triangle_AD_btest_memcheck ..................................................   Passed   11.23 sec
        Start 1706: ErrorOrder_2D_EDG_Triangle_AD_btest_memcheck
  5/103 Test #1706: ErrorOrder_2D_EDG_Triangle_AD_btest_memcheck .................................................   Passed   77.50 sec
        Start 1708: ErrorOrder_3D_DGBR2_Sphere_Triangle_AD_btest_memcheck
  6/103 Test #1708: ErrorOrder_3D_DGBR2_Sphere_Triangle_AD_btest_memcheck ........................................   Passed   27.67 sec
        Start 1710: ErrorOrder_3D_CG_Tet_AD_btest_memcheck
  7/103 Test #1710: ErrorOrder_3D_CG_Tet_AD_btest_memcheck .......................................................   Passed   15.34 sec
        Start 1712: ErrorOrder_4D_DG_Pentatope_btest_memcheck
  8/103 Test #1712: ErrorOrder_4D_DG_Pentatope_btest_memcheck ....................................................***Failed   10.95 sec
Running 2 test cases...
creating geometry context with EGADS v1.17 and OpenCASCADE with OpenCASCADE 7.4.1
entity 6 (3683013136) maps to 8
entity 8 (3917754896) maps to 7
entity 4 (3987166224) maps to 6
entity 2 (3989547392) maps to 5
entity 1 (4150608673) maps to 4
entity 3 (4240016946) maps to 3
entity 7 (4257982309) maps to 2
entity 5 (4274689859) maps to 1
added vertices
added cells
added boundary
unknown location(0): fatal error in "ErrorOrder_4D_DG_Pentatope": memory access violation at address: 0x00000000: no mapping at fault address

*** 1 failure detected in test suite "SANS_unit_test"

        Start 1714: ErrorEstimateOrder_2D_HDG_Triangle_AD_btest_memcheck
  9/103 Test #1714: ErrorEstimateOrder_2D_HDG_Triangle_AD_btest_memcheck .........................................   Passed  452.13 sec
        Start 1716: ErrorOrder_1D_DGBR2_BuckleyLeverett_ST_btest_memcheck
 10/103 Test #1716: ErrorOrder_1D_DGBR2_BuckleyLeverett_ST_btest_memcheck ........................................   Passed  348.21 sec
        Start 1718: ErrorOrder_1D_HDG_AD_btest_memcheck
 11/103 Test #1718: ErrorOrder_1D_HDG_AD_btest_memcheck ..........................................................   Passed   11.36 sec
        Start 1720: ErrorOrder_1D_HDG_AD_BDF_btest_memcheck
 12/103 Test #1720: ErrorOrder_1D_HDG_AD_BDF_btest_memcheck ......................................................   Passed  219.15 sec
        Start 1722: ErrorOrder_1D_DGBR2_AD_BDF_btest_memcheck
 13/103 Test #1722: ErrorOrder_1D_DGBR2_AD_BDF_btest_memcheck ....................................................   Passed  133.70 sec
        Start 1724: ErrorEstimateOrder_2D_DGAdvective_Triangle_AD_btest_memcheck
 14/103 Test #1724: ErrorEstimateOrder_2D_DGAdvective_Triangle_AD_btest_memcheck .................................   Passed  426.75 sec
        Start 1726: ErrorEstimateOrder_1D_CG_Line_AD_btest_memcheck
 15/103 Test #1726: ErrorEstimateOrder_1D_CG_Line_AD_btest_memcheck ..............................................   Passed    6.19 sec
        Start 1728: Adjoint2D_HDG_Triangle_AD_sansLG_btest_memcheck
 16/103 Test #1728: Adjoint2D_HDG_Triangle_AD_sansLG_btest_memcheck ..............................................   Passed  205.64 sec
        Start 1730: Adjoint1D_DGBR2_BuckleyLeverett_ST_btest_memcheck
 17/103 Test #1730: Adjoint1D_DGBR2_BuckleyLeverett_ST_btest_memcheck ............................................   Passed  109.51 sec
        Start 1732: ErrorOrder_1D_CG_AD_btest_memcheck
 18/103 Test #1732: ErrorOrder_1D_CG_AD_btest_memcheck ...........................................................   Passed    6.84 sec
        Start 1734: ErrorEstimateOrder_3D_CG_Tet_AD_btest_memcheck
 19/103 Test #1734: ErrorEstimateOrder_3D_CG_Tet_AD_btest_memcheck ...............................................   Passed    1.18 sec
        Start 1736: ErrorOrder_1D_DGBR2_TwoPhase_ST_btest_memcheck
 20/103 Test #1736: ErrorOrder_1D_DGBR2_TwoPhase_ST_btest_memcheck ...............................................   Passed  124.03 sec
        Start 1738: Adjoint2D_DGAdvective_Triangle_AD_btest_memcheck
 21/103 Test #1738: Adjoint2D_DGAdvective_Triangle_AD_btest_memcheck .............................................   Passed   13.50 sec
        Start 1740: Solve2D_DGAdvective_LinearRobin_mitLG_sansLG_Consistency_AD_btest_memcheck
 22/103 Test #1740: Solve2D_DGAdvective_LinearRobin_mitLG_sansLG_Consistency_AD_btest_memcheck ...................   Passed   16.71 sec
        Start 1742: ErrorOrder_2D_HDG_Triangle_AD_btest_memcheck
 23/103 Test #1742: ErrorOrder_2D_HDG_Triangle_AD_btest_memcheck .................................................   Passed   85.80 sec
        Start 1744: ErrorOrder_1D_HDGAdvective_Advection_btest_memcheck
 24/103 Test #1744: ErrorOrder_1D_HDGAdvective_Advection_btest_memcheck ..........................................   Passed    6.06 sec
        Start 1746: ErrorOrder_1D_CG_AD_BDF_btest_memcheck
 25/103 Test #1746: ErrorOrder_1D_CG_AD_BDF_btest_memcheck .......................................................   Passed  409.19 sec
        Start 1748: ErrorOrder_3D_CG_Sphere_Triangle_AD_btest_memcheck
 26/103 Test #1748: ErrorOrder_3D_CG_Sphere_Triangle_AD_btest_memcheck ...........................................   Passed   30.94 sec
        Start 1750: ErrorEstimateOrder_1D_DGBR2_Line_AD_btest_memcheck
 27/103 Test #1750: ErrorEstimateOrder_1D_DGBR2_Line_AD_btest_memcheck ...........................................   Passed   11.35 sec
        Start 1752: ErrorOrder_3D_CG_Hex_AD_btest_memcheck
 28/103 Test #1752: ErrorOrder_3D_CG_Hex_AD_btest_memcheck .......................................................   Passed    9.93 sec
        Start 1754: ErrorOrder_1D_HDG_Burgers_btest_memcheck
 29/103 Test #1754: ErrorOrder_1D_HDG_Burgers_btest_memcheck .....................................................   Passed  819.07 sec
        Start 1756: ErrorEstimateOrder_2D_CG_Nodal_Triangle_AD_btest_memcheck
 30/103 Test #1756: ErrorEstimateOrder_2D_CG_Nodal_Triangle_AD_btest_memcheck ....................................   Passed  480.25 sec
        Start 1758: ErrorOrder_1D_DGBR2_Burgers_btest_memcheck
 31/103 Test #1758: ErrorOrder_1D_DGBR2_Burgers_btest_memcheck ...................................................   Passed  136.50 sec
        Start 1760: ErrorOrder_2D_DGAdvective_Flat_Line_AD_btest_memcheck
 32/103 Test #1760: ErrorOrder_2D_DGAdvective_Flat_Line_AD_btest_memcheck ........................................   Passed   10.94 sec
        Start 1762: ErrorOrder_3D_DGBR2_Tet_AD_btest_memcheck
 33/103 Test #1762: ErrorOrder_3D_DGBR2_Tet_AD_btest_memcheck ....................................................   Passed   16.21 sec
        Start 1764: ErrorOrder_1D_DGBR2_AD_btest_memcheck
 34/103 Test #1764: ErrorOrder_1D_DGBR2_AD_btest_memcheck ........................................................   Passed   11.48 sec
        Start 1766: ErrorOrder_2D_DGAdvective_Annulus_Triangle_btest_memcheck
 35/103 Test #1766: ErrorOrder_2D_DGAdvective_Annulus_Triangle_btest_memcheck ....................................   Passed   10.52 sec
        Start 1768: ErrorEstimateOrder_2D_CG_Triangle_RD_btest_memcheck
 36/103 Test #1768: ErrorEstimateOrder_2D_CG_Triangle_RD_btest_memcheck ..........................................   Passed  165.24 sec
        Start 1770: ErrorOrder_2D_DGAdvective_Circle_Line_AD_btest_memcheck
 37/103 Test #1770: ErrorOrder_2D_DGAdvective_Circle_Line_AD_btest_memcheck ......................................   Passed   10.25 sec
        Start 1772: ErrorOrder_2D_CG_Quad_AD_btest_memcheck
 38/103 Test #1772: ErrorOrder_2D_CG_Quad_AD_btest_memcheck ......................................................   Passed    8.94 sec
        Start 1774: ErrorEstimateOrder_2D_DGBR2_Triangle_AD_btest_memcheck
 39/103 Test #1774: ErrorEstimateOrder_2D_DGBR2_Triangle_AD_btest_memcheck .......................................   Passed  201.85 sec
        Start 1776: ErrorOrder_2D_DGAdvective_Circle_Line_ShallowWater_btest_memcheck
 40/103 Test #1776: ErrorOrder_2D_DGAdvective_Circle_Line_ShallowWater_btest_memcheck ............................   Passed   10.41 sec
        Start 1778: ErrorEstimateOrder_2D_CG_Triangle_AD_btest_memcheck
 41/103 Test #1778: ErrorEstimateOrder_2D_CG_Triangle_AD_btest_memcheck ..........................................   Passed  446.48 sec
        Start 1780: ErrorOrder_2D_DGBR2_Triangle_AD_btest_memcheck
 42/103 Test #1780: ErrorOrder_2D_DGBR2_Triangle_AD_btest_memcheck ...............................................   Passed   25.00 sec
        Start 1782: ErrorOrder_1D_DGAdvective_ShallowWater_btest_memcheck
 43/103 Test #1782: ErrorOrder_1D_DGAdvective_ShallowWater_btest_memcheck ........................................   Passed   10.09 sec
        Start 1784: ErrorOrder_3D_DGBR2_Periodic_Hex_AD_btest_memcheck
 44/103 Test #1784: ErrorOrder_3D_DGBR2_Periodic_Hex_AD_btest_memcheck ...........................................   Passed   12.85 sec
        Start 1786: ErrorOrder_1D_DGBR2_AD_HB_btest_memcheck
 45/103 Test #1786: ErrorOrder_1D_DGBR2_AD_HB_btest_memcheck .....................................................   Passed   26.03 sec
        Start 1788: ErrorOrder_2D_DGAdvective_Annulus_Quad_btest_memcheck
 46/103 Test #1788: ErrorOrder_2D_DGAdvective_Annulus_Quad_btest_memcheck ........................................   Passed   11.06 sec
        Start 1790: ErrorOrder_2D_CGStabilized_RANS_MMS_btest_memcheck
 47/103 Test #1790: ErrorOrder_2D_CGStabilized_RANS_MMS_btest_memcheck ...........................................   Passed   50.13 sec
        Start 1792: Adjoint2D_HDG_Triangle_AD_mitState_btest_memcheck
 48/103 Test #1792: Adjoint2D_HDG_Triangle_AD_mitState_btest_memcheck ............................................   Passed  203.38 sec
        Start 1794: ErrorOrder_2D_DGBR2_RANS_MMS_btest_memcheck
 49/103 Test #1794: ErrorOrder_2D_DGBR2_RANS_MMS_btest_memcheck ..................................................   Passed   53.06 sec
        Start 1796: Adjoint2D_DGBR2_Triangle_AD_btest_memcheck
 50/103 Test #1796: Adjoint2D_DGBR2_Triangle_AD_btest_memcheck ...................................................   Passed   29.07 sec
        Start 1798: Adjoint2D_CG_Triangle_AD_btest_memcheck
 51/103 Test #1798: Adjoint2D_CG_Triangle_AD_btest_memcheck ......................................................   Passed    9.54 sec
        Start 1800: ElementLocalSolve3D_DGBR2_Tet_AD_btest_memcheck
 52/103 Test #1800: ElementLocalSolve3D_DGBR2_Tet_AD_btest_memcheck ..............................................   Passed  265.44 sec
        Start 1802: AlgebraicEquationSet_Local_VMSD_Triangle_AD_btest_memcheck
 53/103 Test #1802: AlgebraicEquationSet_Local_VMSD_Triangle_AD_btest_memcheck ...................................   Passed   12.75 sec
        Start 1804: LocalSolve3D_HDG_Tet_AD_btest_memcheck
 54/103 Test #1804: LocalSolve3D_HDG_Tet_AD_btest_memcheck .......................................................   Passed  672.50 sec
        Start 1806: LocalSolve3D_Split_HDG_Tet_AD_btest_memcheck
 55/103 Test #1806: LocalSolve3D_Split_HDG_Tet_AD_btest_memcheck .................................................   Passed  542.26 sec
        Start 1808: EdgeLocalSolve3D_Dual_Galerkin_Stabilized_AD_btest_memcheck
 56/103 Test #1808: EdgeLocalSolve3D_Dual_Galerkin_Stabilized_AD_btest_memcheck ..................................   Passed  120.65 sec
        Start 1810: EdgeLocalSolve2D_Dual_Galerkin_Stabilized_AR_btest_memcheck
 57/103 Test #1810: EdgeLocalSolve2D_Dual_Galerkin_Stabilized_AR_btest_memcheck ..................................   Passed  173.87 sec
        Start 1812: EdgeLocalSolve2D_Dual_Galerkin_Stabilized_Euler_btest_memcheck
 58/103 Test #1812: EdgeLocalSolve2D_Dual_Galerkin_Stabilized_Euler_btest_memcheck ...............................   Passed   17.66 sec
        Start 1814: LocalSolve2D_Split_HDG_Triangle_AD_btest_memcheck
 59/103 Test #1814: LocalSolve2D_Split_HDG_Triangle_AD_btest_memcheck ............................................   Passed   71.78 sec
        Start 1816: LocalSolve1D_Split_DGBR2_AD_btest_memcheck
 60/103 Test #1816: LocalSolve1D_Split_DGBR2_AD_btest_memcheck ...................................................   Passed   13.46 sec
        Start 1818: LocalSolve1D_HDG_AD_btest_memcheck
 61/103 Test #1818: LocalSolve1D_HDG_AD_btest_memcheck ...........................................................   Passed   13.14 sec
        Start 1820: AlgebraicEquationSet_Local_VMSDBR2_Triangle_AD_btest_memcheck
 62/103 Test #1820: AlgebraicEquationSet_Local_VMSDBR2_Triangle_AD_btest_memcheck ................................   Passed   12.27 sec
        Start 1822: LocalSolve2D_HDG_Triangle_AD_btest_memcheck
 63/103 Test #1822: LocalSolve2D_HDG_Triangle_AD_btest_memcheck ..................................................   Passed   65.17 sec
        Start 1824: ElementLocalSolve1D_DGBR2_Triangle_AD_btest_memcheck
 64/103 Test #1824: ElementLocalSolve1D_DGBR2_Triangle_AD_btest_memcheck .........................................   Passed   14.54 sec
        Start 1826: LocalSolve1D_Split_HDG_AD_btest_memcheck
 65/103 Test #1826: LocalSolve1D_Split_HDG_AD_btest_memcheck .....................................................   Passed   13.73 sec
        Start 1828: LocalSolve2D_Split_DGBR2_Triangle_AD_AV_btest_memcheck
 66/103 Test #1828: LocalSolve2D_Split_DGBR2_Triangle_AD_AV_btest_memcheck .......................................   Passed  320.70 sec
        Start 1830: ElementLocalSolve3D_DGAdvective_Tet_AD_btest_memcheck
 67/103 Test #1830: ElementLocalSolve3D_DGAdvective_Tet_AD_btest_memcheck ........................................   Passed  113.99 sec
        Start 1832: EdgeLocalSolve1D_Dual_Galerkin_Stabilized_Line_AD_btest_memcheck
 68/103 Test #1832: EdgeLocalSolve1D_Dual_Galerkin_Stabilized_Line_AD_btest_memcheck .............................   Passed   16.77 sec
        Start 1834: ElementDualLocalSolve3D_Galerkin_Stabilized_Triangle_AD_btest_memcheck
 69/103 Test #1834: ElementDualLocalSolve3D_Galerkin_Stabilized_Triangle_AD_btest_memcheck .......................   Passed  409.30 sec
        Start 1836: EdgeLocalSolve2D_Dual_Galerkin_Stabilized_AD_btest_memcheck
 70/103 Test #1836: EdgeLocalSolve2D_Dual_Galerkin_Stabilized_AD_btest_memcheck ..................................   Passed  210.30 sec
        Start 1838: ElementLocalSolve2D_DGBR2_Triangle_AD_btest_memcheck
 71/103 Test #1838: ElementLocalSolve2D_DGBR2_Triangle_AD_btest_memcheck .........................................   Passed  230.49 sec
        Start 1840: ElementDualLocalSolve2D_Galerkin_Stabilized_Triangle_AD_btest_memcheck
 72/103 Test #1840: ElementDualLocalSolve2D_Galerkin_Stabilized_Triangle_AD_btest_memcheck .......................   Passed  150.00 sec
        Start 1842: Block_1D_Decoupled_Burgers_btest_memcheck
 73/103 Test #1842: Block_1D_Decoupled_Burgers_btest_memcheck ....................................................   Passed  597.18 sec
        Start 1844: Block_1D_Decoupled_AD_btest_memcheck
 74/103 Test #1844: Block_1D_Decoupled_AD_btest_memcheck .........................................................   Passed    6.04 sec
        Start 1846: AnalyticSolve2D_HDG_Triangle_NavierStokes_UniformStream_btest_memcheck
 75/103 Test #1846: AnalyticSolve2D_HDG_Triangle_NavierStokes_UniformStream_btest_memcheck .......................   Passed   17.11 sec
        Start 1848: AnalyticSolve2D_DGAdvective_IBL_StagnationFlow_SingleElem_LamiBL_btest_memcheck
 76/103 Test #1848: AnalyticSolve2D_DGAdvective_IBL_StagnationFlow_SingleElem_LamiBL_btest_memcheck ..............   Passed   20.44 sec
        Start 1850: AnalyticSolve2D_HDG_Triangle_NavierStokes_btest_memcheck
 77/103 Test #1850: AnalyticSolve2D_HDG_Triangle_NavierStokes_btest_memcheck .....................................   Passed  573.72 sec
        Start 1852: AnalyticSolve2D_DGBR2_Triangle_NavierStokes_UniformStream_btest_memcheck
 78/103 Test #1852: AnalyticSolve2D_DGBR2_Triangle_NavierStokes_UniformStream_btest_memcheck .....................   Passed   48.24 sec
        Start 1854: AnalyticSolve2D_DGAdvective_Triangle_Euler_UniformStream_btest_memcheck
 79/103 Test #1854: AnalyticSolve2D_DGAdvective_Triangle_Euler_UniformStream_btest_memcheck ......................   Passed   57.52 sec
        Start 1856: AnalyticSolve2D_DGAdvective_IBL_StagnationFlow_LamiBL_btest_memcheck
 80/103 Test #1856: AnalyticSolve2D_DGAdvective_IBL_StagnationFlow_LamiBL_btest_memcheck .........................   Passed   24.42 sec
        Start 1858: AnalyticSolve_HDG_AD_btest_memcheck
 81/103 Test #1858: AnalyticSolve_HDG_AD_btest_memcheck ..........................................................   Passed   11.19 sec
        Start 1860: AnalyticSolve2D_DGBR2_Triangle_NavierStokes_btest_memcheck
 82/103 Test #1860: AnalyticSolve2D_DGBR2_Triangle_NavierStokes_btest_memcheck ...................................   Passed   61.99 sec
        Start 1862: PDEmitAVSensor2D_Consistency_RANSSA_btest_memcheck
 83/103 Test #1862: PDEmitAVSensor2D_Consistency_RANSSA_btest_memcheck ...........................................   Passed    2.72 sec
        Start 1864: Solve2D_Uncoupled_HDGAdvectiveIBL_LamiBL_btest_memcheck
 84/103 Test #1864: Solve2D_Uncoupled_HDGAdvectiveIBL_LamiBL_btest_memcheck ......................................   Passed  144.45 sec
        Start 1866: AlgebraicEquationSet_PTC_VMSD_Triangle_SA_btest_memcheck
 85/103 Test #1866: AlgebraicEquationSet_PTC_VMSD_Triangle_SA_btest_memcheck .....................................   Passed    0.93 sec
        Start 1868: PDEmitAVSensor1D_Consistency_btest_memcheck
 86/103 Test #1868: PDEmitAVSensor1D_Consistency_btest_memcheck ..................................................   Passed    2.08 sec
        Start 1870: PDEEulermitAVDiffusion3D_RANSSA_Consistency_btest_memcheck
 87/103 Test #1870: PDEEulermitAVDiffusion3D_RANSSA_Consistency_btest_memcheck ...................................   Passed    1.64 sec
        Start 1872: Solve2D_Coupled4x4_IBLSplitAmpLag_CorrelationClosure_CapturedTransition_PTC_btest_memcheck
 88/103 Test #1872: Solve2D_Coupled4x4_IBLSplitAmpLag_CorrelationClosure_CapturedTransition_PTC_btest_memcheck ...   Passed  356.73 sec
        Start 1874: PDEEulermitAVDiffusion3D_Consistency_btest_memcheck
 89/103 Test #1874: PDEEulermitAVDiffusion3D_Consistency_btest_memcheck ..........................................   Passed    2.42 sec
        Start 1876: Solve2D_Coupled4x4_IBL_Panel_NACA0004_FittedTransition_TwoLayerNewton_btest_memcheck
 90/103 Test #1876: Solve2D_Coupled4x4_IBL_Panel_NACA0004_FittedTransition_TwoLayerNewton_btest_memcheck .........   Passed  1144.70 sec
        Start 1878: PDEEulermitAVDiffusion1D_Consistency_btest_memcheck
 91/103 Test #1878: PDEEulermitAVDiffusion1D_Consistency_btest_memcheck ..........................................   Passed    1.86 sec
        Start 1880: PDEEulermitAVDiffusion2D_RANSSA_Consistency_btest_memcheck
 92/103 Test #1880: PDEEulermitAVDiffusion2D_RANSSA_Consistency_btest_memcheck ...................................   Passed    1.65 sec
        Start 1882: BCEulermitAVSensor2D_Consistency_RANSSA_btest_memcheck
 93/103 Test #1882: BCEulermitAVSensor2D_Consistency_RANSSA_btest_memcheck .......................................   Passed    3.38 sec
        Start 1884: BCEulermitAVSensor3D_Consistency_btest_memcheck
 94/103 Test #1884: BCEulermitAVSensor3D_Consistency_btest_memcheck ..............................................   Passed    2.93 sec
        Start 1886: BCEulermitAVSensor3D_Consistency_RANSSA_btest_memcheck
 95/103 Test #1886: BCEulermitAVSensor3D_Consistency_RANSSA_btest_memcheck .......................................   Passed    2.97 sec
        Start 1888: Solve2D_Uncoupled_DGAdvectiveIBLUniField_CorrelationClosure_LamiBL_btest_memcheck
 96/103 Test #1888: Solve2D_Uncoupled_DGAdvectiveIBLUniField_CorrelationClosure_LamiBL_btest_memcheck ............   Passed   44.99 sec
        Start 1890: PDEmitAVSensor2D_Consistency_btest_memcheck
 97/103 Test #1890: PDEmitAVSensor2D_Consistency_btest_memcheck ..................................................   Passed    5.90 sec
        Start 1892: PDEmitAVSensor3D_Consistency_RANSSA_btest_memcheck
 98/103 Test #1892: PDEmitAVSensor3D_Consistency_RANSSA_btest_memcheck ...........................................   Passed    3.35 sec
        Start 1894: Solve2D_XfoilLikePanelMethod_btest_memcheck
 99/103 Test #1894: Solve2D_XfoilLikePanelMethod_btest_memcheck ..................................................   Passed  588.15 sec
        Start 1896: PDEmitAVSensor3D_Consistency_btest_memcheck
100/103 Test #1896: PDEmitAVSensor3D_Consistency_btest_memcheck ..................................................   Passed    6.01 sec
        Start 1898: Solve2D_Uncoupled_DGAdvectiveIBL_LamiBL_PTC_btest_memcheck
101/103 Test #1898: Solve2D_Uncoupled_DGAdvectiveIBL_LamiBL_PTC_btest_memcheck ...................................   Passed  795.89 sec
        Start 1900: BCEulermitAVSensor2D_Consistency_btest_memcheck
102/103 Test #1900: BCEulermitAVSensor2D_Consistency_btest_memcheck ..............................................   Passed    4.61 sec
        Start 1902: PDEEulermitAVDiffusion2D_Consistency_btest_memcheck
103/103 Test #1902: PDEEulermitAVDiffusion2D_Consistency_btest_memcheck ..........................................   Passed    3.88 sec

99% tests passed, 1 tests failed out of 103

Label Time Summary:
SANSMemCheck_system    = 13646.10 sec (103 tests)

Total Test time (real) = 13646.31 sec

The following tests FAILED:
	1712 - ErrorOrder_4D_DG_Pentatope_btest_memcheck (Failed)
Errors while running CTest
test/system/CMakeFiles/memcheck_system.dir/build.make:57: recipe for target 'test/system/CMakeFiles/memcheck_system' failed
make[3]: *** [test/system/CMakeFiles/memcheck_system] Error 8
CMakeFiles/Makefile2:177155: recipe for target 'test/system/CMakeFiles/memcheck_system.dir/all' failed
make[2]: *** [test/system/CMakeFiles/memcheck_system.dir/all] Error 2
CMakeFiles/Makefile2:177162: recipe for target 'test/system/CMakeFiles/memcheck_system.dir/rule' failed
make[1]: *** [test/system/CMakeFiles/memcheck_system.dir/rule] Error 2
Makefile:62001: recipe for target 'memcheck_system' failed
make: *** [memcheck_system] Error 2

real	313m57.397s
user	295m29.468s
sys	7m58.176s
+ status=1
++ find /jenkins/workspace/SANS_Weekly/builddir/debug_gnu9/buildnode/reynolds/build/debug_gnu9 -name Test.xml
+ mv /jenkins/workspace/SANS_Weekly/builddir/debug_gnu9/buildnode/reynolds/build/debug_gnu9/Testing/20200416-1334/Test.xml /jenkins/workspace/SANS_Weekly/builddir/debug_gnu9/buildnode/reynolds/build/Test_system_memcheck.xml
+ '[' 1 -eq 1 ']'
+ exit 1
Build step 'Execute shell' marked build as failure
[GNU C Compiler (gcc)Clang (LLVM based)Intel Compiler (C, Fortran)Vera++] Skipping execution of recorder since overall result is 'FAILURE'
[Valgrind] Files to copy:
[Valgrind] build/debug_gnu9/test/valgrind.1010.memcheck.xml
[Valgrind] build/debug_gnu9/test/valgrind.10435.memcheck.xml
[Valgrind] build/debug_gnu9/test/valgrind.10650.memcheck.xml
[Valgrind] build/debug_gnu9/test/valgrind.10840.memcheck.xml
[Valgrind] build/debug_gnu9/test/valgrind.11477.memcheck.xml
[Valgrind] build/debug_gnu9/test/valgrind.11559.memcheck.xml
[Valgrind] build/debug_gnu9/test/valgrind.11585.memcheck.xml
[Valgrind] build/debug_gnu9/test/valgrind.11588.memcheck.xml
[Valgrind] build/debug_gnu9/test/valgrind.11592.memcheck.xml
[Valgrind] build/debug_gnu9/test/valgrind.11593.memcheck.xml
[Valgrind] build/debug_gnu9/test/valgrind.11598.memcheck.xml
[Valgrind] build/debug_gnu9/test/valgrind.11599.memcheck.xml
[Valgrind] build/debug_gnu9/test/valgrind.11619.memcheck.xml
[Valgrind] build/debug_gnu9/test/valgrind.11620.memcheck.xml
[Valgrind] build/debug_gnu9/test/valgrind.11621.memcheck.xml
[Valgrind] build/debug_gnu9/test/valgrind.11623.memcheck.xml
[Valgrind] build/debug_gnu9/test/valgrind.11676.memcheck.xml
[Valgrind] build/debug_gnu9/test/valgrind.11677.memcheck.xml
[Valgrind] build/debug_gnu9/test/valgrind.11792.memcheck.xml
[Valgrind] build/debug_gnu9/test/valgrind.11793.memcheck.xml
[Valgrind] build/debug_gnu9/test/valgrind.11795.memcheck.xml
[Valgrind] build/debug_gnu9/test/valgrind.11797.memcheck.xml
[Valgrind] build/debug_gnu9/test/valgrind.11798.memcheck.xml
[Valgrind] build/debug_gnu9/test/valgrind.11799.memcheck.xml
[Valgrind] build/debug_gnu9/test/valgrind.11806.memcheck.xml
[Valgrind] build/debug_gnu9/test/valgrind.11813.memcheck.xml
[Valgrind] build/debug_gnu9/test/valgrind.11814.memcheck.xml
[Valgrind] build/debug_gnu9/test/valgrind.11949.memcheck.xml
[Valgrind] build/debug_gnu9/test/valgrind.1201.memcheck.xml
[Valgrind] build/debug_gnu9/test/valgrind.12100.memcheck.xml
[Valgrind] build/debug_gnu9/test/valgrind.12723.memcheck.xml
[Valgrind] build/debug_gnu9/test/valgrind.12784.memcheck.xml
[Valgrind] build/debug_gnu9/test/valgrind.12799.memcheck.xml
[Valgrind] build/debug_gnu9/test/valgrind.12952.memcheck.xml
[Valgrind] build/debug_gnu9/test/valgrind.14550.memcheck.xml
[Valgrind] build/debug_gnu9/test/valgrind.14564.memcheck.xml
[Valgrind] build/debug_gnu9/test/valgrind.15132.memcheck.xml
[Valgrind] build/debug_gnu9/test/valgrind.15137.memcheck.xml
[Valgrind] build/debug_gnu9/test/valgrind.15516.memcheck.xml
[Valgrind] build/debug_gnu9/test/valgrind.17282.memcheck.xml
[Valgrind] build/debug_gnu9/test/valgrind.1893.memcheck.xml
[Valgrind] build/debug_gnu9/test/valgrind.19651.memcheck.xml
[Valgrind] build/debug_gnu9/test/valgrind.20630.memcheck.xml
[Valgrind] build/debug_gnu9/test/valgrind.20858.memcheck.xml
[Valgrind] build/debug_gnu9/test/valgrind.21012.memcheck.xml
[Valgrind] build/debug_gnu9/test/valgrind.21581.memcheck.xml
[Valgrind] build/debug_gnu9/test/valgrind.2199.memcheck.xml
[Valgrind] build/debug_gnu9/test/valgrind.22704.memcheck.xml
[Valgrind] build/debug_gnu9/test/valgrind.23313.memcheck.xml
[Valgrind] build/debug_gnu9/test/valgrind.25229.memcheck.xml
[Valgrind] build/debug_gnu9/test/valgrind.26029.memcheck.xml
[Valgrind] build/debug_gnu9/test/valgrind.26106.memcheck.xml
[Valgrind] build/debug_gnu9/test/valgrind.27201.memcheck.xml
[Valgrind] build/debug_gnu9/test/valgrind.27740.memcheck.xml
[Valgrind] build/debug_gnu9/test/valgrind.29347.memcheck.xml
[Valgrind] build/debug_gnu9/test/valgrind.29463.memcheck.xml
[Valgrind] build/debug_gnu9/test/valgrind.29800.memcheck.xml
[Valgrind] build/debug_gnu9/test/valgrind.30062.memcheck.xml
[Valgrind] build/debug_gnu9/test/valgrind.30411.memcheck.xml
[Valgrind] build/debug_gnu9/test/valgrind.30719.memcheck.xml
[Valgrind] build/debug_gnu9/test/valgrind.30973.memcheck.xml
[Valgrind] build/debug_gnu9/test/valgrind.31194.memcheck.xml
[Valgrind] build/debug_gnu9/test/valgrind.3137.memcheck.xml
[Valgrind] build/debug_gnu9/test/valgrind.33659.memcheck.xml
[Valgrind] build/debug_gnu9/test/valgrind.33847.memcheck.xml
[Valgrind] build/debug_gnu9/test/valgrind.33882.memcheck.xml
[Valgrind] build/debug_gnu9/test/valgrind.34261.memcheck.xml
[Valgrind] build/debug_gnu9/test/valgrind.35589.memcheck.xml
[Valgrind] build/debug_gnu9/test/valgrind.35748.memcheck.xml
[Valgrind] build/debug_gnu9/test/valgrind.35921.memcheck.xml
[Valgrind] build/debug_gnu9/test/valgrind.36425.memcheck.xml
[Valgrind] build/debug_gnu9/test/valgrind.3647.memcheck.xml
[Valgrind] build/debug_gnu9/test/valgrind.3652.memcheck.xml
[Valgrind] build/debug_gnu9/test/valgrind.36659.memcheck.xml
[Valgrind] build/debug_gnu9/test/valgrind.36915.memcheck.xml
[Valgrind] build/debug_gnu9/test/valgrind.37039.memcheck.xml
[Valgrind] build/debug_gnu9/test/valgrind.37063.memcheck.xml
[Valgrind] build/debug_gnu9/test/valgrind.37419.memcheck.xml
[Valgrind] build/debug_gnu9/test/valgrind.3747.memcheck.xml
[Valgrind] build/debug_gnu9/test/valgrind.37915.memcheck.xml
[Valgrind] build/debug_gnu9/test/valgrind.38253.memcheck.xml
[Valgrind] build/debug_gnu9/test/valgrind.38429.memcheck.xml
[Valgrind] build/debug_gnu9/test/valgrind.38437.memcheck.xml
[Valgrind] build/debug_gnu9/test/valgrind.38542.memcheck.xml
[Valgrind] build/debug_gnu9/test/valgrind.3869.memcheck.xml
[Valgrind] build/debug_gnu9/test/valgrind.38739.memcheck.xml
[Valgrind] build/debug_gnu9/test/valgrind.38867.memcheck.xml
[Valgrind] build/debug_gnu9/test/valgrind.3901.memcheck.xml
[Valgrind] build/debug_gnu9/test/valgrind.39136.memcheck.xml
[Valgrind] build/debug_gnu9/test/valgrind.39207.memcheck.xml
[Valgrind] build/debug_gnu9/test/valgrind.40314.memcheck.xml
[Valgrind] build/debug_gnu9/test/valgrind.40509.memcheck.xml
[Valgrind] build/debug_gnu9/test/valgrind.40551.memcheck.xml
[Valgrind] build/debug_gnu9/test/valgrind.40750.memcheck.xml
[Valgrind] build/debug_gnu9/test/valgrind.5412.memcheck.xml
[Valgrind] build/debug_gnu9/test/valgrind.6902.memcheck.xml
[Valgrind] build/debug_gnu9/test/valgrind.7825.memcheck.xml
[Valgrind] build/debug_gnu9/test/valgrind.8343.memcheck.xml
[Valgrind] build/debug_gnu9/test/valgrind.8345.memcheck.xml
[Valgrind] build/debug_gnu9/test/valgrind.8350.memcheck.xml
[Valgrind] build/debug_gnu9/test/valgrind.8352.memcheck.xml
[Valgrind] build/debug_gnu9/test/valgrind.9953.memcheck.xml
[Valgrind] Copying build/debug_gnu9/test/valgrind.1010.memcheck.xml to /var/lib/jenkins/jobs/SANS_Weekly/configurations/axis-builddir/debug_gnu9/axis-buildnode/reynolds/builds/259/valgrind-plugin/valgrind-results/build/debug_gnu9/test/valgrind.1010.memcheck.xml
[Valgrind] Copying build/debug_gnu9/test/valgrind.10435.memcheck.xml to /var/lib/jenkins/jobs/SANS_Weekly/configurations/axis-builddir/debug_gnu9/axis-buildnode/reynolds/builds/259/valgrind-plugin/valgrind-results/build/debug_gnu9/test/valgrind.10435.memcheck.xml
[Valgrind] Copying build/debug_gnu9/test/valgrind.10650.memcheck.xml to /var/lib/jenkins/jobs/SANS_Weekly/configurations/axis-builddir/debug_gnu9/axis-buildnode/reynolds/builds/259/valgrind-plugin/valgrind-results/build/debug_gnu9/test/valgrind.10650.memcheck.xml
[Valgrind] Copying build/debug_gnu9/test/valgrind.10840.memcheck.xml to /var/lib/jenkins/jobs/SANS_Weekly/configurations/axis-builddir/debug_gnu9/axis-buildnode/reynolds/builds/259/valgrind-plugin/valgrind-results/build/debug_gnu9/test/valgrind.10840.memcheck.xml
[Valgrind] Copying build/debug_gnu9/test/valgrind.11477.memcheck.xml to /var/lib/jenkins/jobs/SANS_Weekly/configurations/axis-builddir/debug_gnu9/axis-buildnode/reynolds/builds/259/valgrind-plugin/valgrind-results/build/debug_gnu9/test/valgrind.11477.memcheck.xml
[Valgrind] Copying build/debug_gnu9/test/valgrind.11559.memcheck.xml to /var/lib/jenkins/jobs/SANS_Weekly/configurations/axis-builddir/debug_gnu9/axis-buildnode/reynolds/builds/259/valgrind-plugin/valgrind-results/build/debug_gnu9/test/valgrind.11559.memcheck.xml
[Valgrind] Copying build/debug_gnu9/test/valgrind.11585.memcheck.xml to /var/lib/jenkins/jobs/SANS_Weekly/configurations/axis-builddir/debug_gnu9/axis-buildnode/reynolds/builds/259/valgrind-plugin/valgrind-results/build/debug_gnu9/test/valgrind.11585.memcheck.xml
[Valgrind] Copying build/debug_gnu9/test/valgrind.11588.memcheck.xml to /var/lib/jenkins/jobs/SANS_Weekly/configurations/axis-builddir/debug_gnu9/axis-buildnode/reynolds/builds/259/valgrind-plugin/valgrind-results/build/debug_gnu9/test/valgrind.11588.memcheck.xml
[Valgrind] Copying build/debug_gnu9/test/valgrind.11592.memcheck.xml to /var/lib/jenkins/jobs/SANS_Weekly/configurations/axis-builddir/debug_gnu9/axis-buildnode/reynolds/builds/259/valgrind-plugin/valgrind-results/build/debug_gnu9/test/valgrind.11592.memcheck.xml
[Valgrind] Copying build/debug_gnu9/test/valgrind.11593.memcheck.xml to /var/lib/jenkins/jobs/SANS_Weekly/configurations/axis-builddir/debug_gnu9/axis-buildnode/reynolds/builds/259/valgrind-plugin/valgrind-results/build/debug_gnu9/test/valgrind.11593.memcheck.xml
[Valgrind] Copying build/debug_gnu9/test/valgrind.11598.memcheck.xml to /var/lib/jenkins/jobs/SANS_Weekly/configurations/axis-builddir/debug_gnu9/axis-buildnode/reynolds/builds/259/valgrind-plugin/valgrind-results/build/debug_gnu9/test/valgrind.11598.memcheck.xml
[Valgrind] Copying build/debug_gnu9/test/valgrind.11599.memcheck.xml to /var/lib/jenkins/jobs/SANS_Weekly/configurations/axis-builddir/debug_gnu9/axis-buildnode/reynolds/builds/259/valgrind-plugin/valgrind-results/build/debug_gnu9/test/valgrind.11599.memcheck.xml
[Valgrind] Copying build/debug_gnu9/test/valgrind.11619.memcheck.xml to /var/lib/jenkins/jobs/SANS_Weekly/configurations/axis-builddir/debug_gnu9/axis-buildnode/reynolds/builds/259/valgrind-plugin/valgrind-results/build/debug_gnu9/test/valgrind.11619.memcheck.xml
[Valgrind] Copying build/debug_gnu9/test/valgrind.11620.memcheck.xml to /var/lib/jenkins/jobs/SANS_Weekly/configurations/axis-builddir/debug_gnu9/axis-buildnode/reynolds/builds/259/valgrind-plugin/valgrind-results/build/debug_gnu9/test/valgrind.11620.memcheck.xml
[Valgrind] Copying build/debug_gnu9/test/valgrind.11621.memcheck.xml to /var/lib/jenkins/jobs/SANS_Weekly/configurations/axis-builddir/debug_gnu9/axis-buildnode/reynolds/builds/259/valgrind-plugin/valgrind-results/build/debug_gnu9/test/valgrind.11621.memcheck.xml
[Valgrind] Copying build/debug_gnu9/test/valgrind.11623.memcheck.xml to /var/lib/jenkins/jobs/SANS_Weekly/configurations/axis-builddir/debug_gnu9/axis-buildnode/reynolds/builds/259/valgrind-plugin/valgrind-results/build/debug_gnu9/test/valgrind.11623.memcheck.xml
[Valgrind] Copying build/debug_gnu9/test/valgrind.11676.memcheck.xml to /var/lib/jenkins/jobs/SANS_Weekly/configurations/axis-builddir/debug_gnu9/axis-buildnode/reynolds/builds/259/valgrind-plugin/valgrind-results/build/debug_gnu9/test/valgrind.11676.memcheck.xml
[Valgrind] Copying build/debug_gnu9/test/valgrind.11677.memcheck.xml to /var/lib/jenkins/jobs/SANS_Weekly/configurations/axis-builddir/debug_gnu9/axis-buildnode/reynolds/builds/259/valgrind-plugin/valgrind-results/build/debug_gnu9/test/valgrind.11677.memcheck.xml
[Valgrind] Copying build/debug_gnu9/test/valgrind.11792.memcheck.xml to /var/lib/jenkins/jobs/SANS_Weekly/configurations/axis-builddir/debug_gnu9/axis-buildnode/reynolds/builds/259/valgrind-plugin/valgrind-results/build/debug_gnu9/test/valgrind.11792.memcheck.xml
[Valgrind] Copying build/debug_gnu9/test/valgrind.11793.memcheck.xml to /var/lib/jenkins/jobs/SANS_Weekly/configurations/axis-builddir/debug_gnu9/axis-buildnode/reynolds/builds/259/valgrind-plugin/valgrind-results/build/debug_gnu9/test/valgrind.11793.memcheck.xml
[Valgrind] Copying build/debug_gnu9/test/valgrind.11795.memcheck.xml to /var/lib/jenkins/jobs/SANS_Weekly/configurations/axis-builddir/debug_gnu9/axis-buildnode/reynolds/builds/259/valgrind-plugin/valgrind-results/build/debug_gnu9/test/valgrind.11795.memcheck.xml
[Valgrind] Copying build/debug_gnu9/test/valgrind.11797.memcheck.xml to /var/lib/jenkins/jobs/SANS_Weekly/configurations/axis-builddir/debug_gnu9/axis-buildnode/reynolds/builds/259/valgrind-plugin/valgrind-results/build/debug_gnu9/test/valgrind.11797.memcheck.xml
[Valgrind] Copying build/debug_gnu9/test/valgrind.11798.memcheck.xml to /var/lib/jenkins/jobs/SANS_Weekly/configurations/axis-builddir/debug_gnu9/axis-buildnode/reynolds/builds/259/valgrind-plugin/valgrind-results/build/debug_gnu9/test/valgrind.11798.memcheck.xml
[Valgrind] Copying build/debug_gnu9/test/valgrind.11799.memcheck.xml to /var/lib/jenkins/jobs/SANS_Weekly/configurations/axis-builddir/debug_gnu9/axis-buildnode/reynolds/builds/259/valgrind-plugin/valgrind-results/build/debug_gnu9/test/valgrind.11799.memcheck.xml
[Valgrind] Copying build/debug_gnu9/test/valgrind.11806.memcheck.xml to /var/lib/jenkins/jobs/SANS_Weekly/configurations/axis-builddir/debug_gnu9/axis-buildnode/reynolds/builds/259/valgrind-plugin/valgrind-results/build/debug_gnu9/test/valgrind.11806.memcheck.xml
[Valgrind] Copying build/debug_gnu9/test/valgrind.11813.memcheck.xml to /var/lib/jenkins/jobs/SANS_Weekly/configurations/axis-builddir/debug_gnu9/axis-buildnode/reynolds/builds/259/valgrind-plugin/valgrind-results/build/debug_gnu9/test/valgrind.11813.memcheck.xml
[Valgrind] Copying build/debug_gnu9/test/valgrind.11814.memcheck.xml to /var/lib/jenkins/jobs/SANS_Weekly/configurations/axis-builddir/debug_gnu9/axis-buildnode/reynolds/builds/259/valgrind-plugin/valgrind-results/build/debug_gnu9/test/valgrind.11814.memcheck.xml
[Valgrind] Copying build/debug_gnu9/test/valgrind.11949.memcheck.xml to /var/lib/jenkins/jobs/SANS_Weekly/configurations/axis-builddir/debug_gnu9/axis-buildnode/reynolds/builds/259/valgrind-plugin/valgrind-results/build/debug_gnu9/test/valgrind.11949.memcheck.xml
[Valgrind] Copying build/debug_gnu9/test/valgrind.1201.memcheck.xml to /var/lib/jenkins/jobs/SANS_Weekly/configurations/axis-builddir/debug_gnu9/axis-buildnode/reynolds/builds/259/valgrind-plugin/valgrind-results/build/debug_gnu9/test/valgrind.1201.memcheck.xml
[Valgrind] Copying build/debug_gnu9/test/valgrind.12100.memcheck.xml to /var/lib/jenkins/jobs/SANS_Weekly/configurations/axis-builddir/debug_gnu9/axis-buildnode/reynolds/builds/259/valgrind-plugin/valgrind-results/build/debug_gnu9/test/valgrind.12100.memcheck.xml
[Valgrind] Copying build/debug_gnu9/test/valgrind.12723.memcheck.xml to /var/lib/jenkins/jobs/SANS_Weekly/configurations/axis-builddir/debug_gnu9/axis-buildnode/reynolds/builds/259/valgrind-plugin/valgrind-results/build/debug_gnu9/test/valgrind.12723.memcheck.xml
[Valgrind] Copying build/debug_gnu9/test/valgrind.12784.memcheck.xml to /var/lib/jenkins/jobs/SANS_Weekly/configurations/axis-builddir/debug_gnu9/axis-buildnode/reynolds/builds/259/valgrind-plugin/valgrind-results/build/debug_gnu9/test/valgrind.12784.memcheck.xml
[Valgrind] Copying build/debug_gnu9/test/valgrind.12799.memcheck.xml to /var/lib/jenkins/jobs/SANS_Weekly/configurations/axis-builddir/debug_gnu9/axis-buildnode/reynolds/builds/259/valgrind-plugin/valgrind-results/build/debug_gnu9/test/valgrind.12799.memcheck.xml
[Valgrind] Copying build/debug_gnu9/test/valgrind.12952.memcheck.xml to /var/lib/jenkins/jobs/SANS_Weekly/configurations/axis-builddir/debug_gnu9/axis-buildnode/reynolds/builds/259/valgrind-plugin/valgrind-results/build/debug_gnu9/test/valgrind.12952.memcheck.xml
[Valgrind] Copying build/debug_gnu9/test/valgrind.14550.memcheck.xml to /var/lib/jenkins/jobs/SANS_Weekly/configurations/axis-builddir/debug_gnu9/axis-buildnode/reynolds/builds/259/valgrind-plugin/valgrind-results/build/debug_gnu9/test/valgrind.14550.memcheck.xml
[Valgrind] Copying build/debug_gnu9/test/valgrind.14564.memcheck.xml to /var/lib/jenkins/jobs/SANS_Weekly/configurations/axis-builddir/debug_gnu9/axis-buildnode/reynolds/builds/259/valgrind-plugin/valgrind-results/build/debug_gnu9/test/valgrind.14564.memcheck.xml
[Valgrind] Copying build/debug_gnu9/test/valgrind.15132.memcheck.xml to /var/lib/jenkins/jobs/SANS_Weekly/configurations/axis-builddir/debug_gnu9/axis-buildnode/reynolds/builds/259/valgrind-plugin/valgrind-results/build/debug_gnu9/test/valgrind.15132.memcheck.xml
[Valgrind] Copying build/debug_gnu9/test/valgrind.15137.memcheck.xml to /var/lib/jenkins/jobs/SANS_Weekly/configurations/axis-builddir/debug_gnu9/axis-buildnode/reynolds/builds/259/valgrind-plugin/valgrind-results/build/debug_gnu9/test/valgrind.15137.memcheck.xml
[Valgrind] Copying build/debug_gnu9/test/valgrind.15516.memcheck.xml to /var/lib/jenkins/jobs/SANS_Weekly/configurations/axis-builddir/debug_gnu9/axis-buildnode/reynolds/builds/259/valgrind-plugin/valgrind-results/build/debug_gnu9/test/valgrind.15516.memcheck.xml
[Valgrind] Copying build/debug_gnu9/test/valgrind.17282.memcheck.xml to /var/lib/jenkins/jobs/SANS_Weekly/configurations/axis-builddir/debug_gnu9/axis-buildnode/reynolds/builds/259/valgrind-plugin/valgrind-results/build/debug_gnu9/test/valgrind.17282.memcheck.xml
[Valgrind] Copying build/debug_gnu9/test/valgrind.1893.memcheck.xml to /var/lib/jenkins/jobs/SANS_Weekly/configurations/axis-builddir/debug_gnu9/axis-buildnode/reynolds/builds/259/valgrind-plugin/valgrind-results/build/debug_gnu9/test/valgrind.1893.memcheck.xml
[Valgrind] Copying build/debug_gnu9/test/valgrind.19651.memcheck.xml to /var/lib/jenkins/jobs/SANS_Weekly/configurations/axis-builddir/debug_gnu9/axis-buildnode/reynolds/builds/259/valgrind-plugin/valgrind-results/build/debug_gnu9/test/valgrind.19651.memcheck.xml
[Valgrind] Copying build/debug_gnu9/test/valgrind.20630.memcheck.xml to /var/lib/jenkins/jobs/SANS_Weekly/configurations/axis-builddir/debug_gnu9/axis-buildnode/reynolds/builds/259/valgrind-plugin/valgrind-results/build/debug_gnu9/test/valgrind.20630.memcheck.xml
[Valgrind] Copying build/debug_gnu9/test/valgrind.20858.memcheck.xml to /var/lib/jenkins/jobs/SANS_Weekly/configurations/axis-builddir/debug_gnu9/axis-buildnode/reynolds/builds/259/valgrind-plugin/valgrind-results/build/debug_gnu9/test/valgrind.20858.memcheck.xml
[Valgrind] Copying build/debug_gnu9/test/valgrind.21012.memcheck.xml to /var/lib/jenkins/jobs/SANS_Weekly/configurations/axis-builddir/debug_gnu9/axis-buildnode/reynolds/builds/259/valgrind-plugin/valgrind-results/build/debug_gnu9/test/valgrind.21012.memcheck.xml
[Valgrind] Copying build/debug_gnu9/test/valgrind.21581.memcheck.xml to /var/lib/jenkins/jobs/SANS_Weekly/configurations/axis-builddir/debug_gnu9/axis-buildnode/reynolds/builds/259/valgrind-plugin/valgrind-results/build/debug_gnu9/test/valgrind.21581.memcheck.xml
[Valgrind] Copying build/debug_gnu9/test/valgrind.2199.memcheck.xml to /var/lib/jenkins/jobs/SANS_Weekly/configurations/axis-builddir/debug_gnu9/axis-buildnode/reynolds/builds/259/valgrind-plugin/valgrind-results/build/debug_gnu9/test/valgrind.2199.memcheck.xml
[Valgrind] Copying build/debug_gnu9/test/valgrind.22704.memcheck.xml to /var/lib/jenkins/jobs/SANS_Weekly/configurations/axis-builddir/debug_gnu9/axis-buildnode/reynolds/builds/259/valgrind-plugin/valgrind-results/build/debug_gnu9/test/valgrind.22704.memcheck.xml
[Valgrind] Copying build/debug_gnu9/test/valgrind.23313.memcheck.xml to /var/lib/jenkins/jobs/SANS_Weekly/configurations/axis-builddir/debug_gnu9/axis-buildnode/reynolds/builds/259/valgrind-plugin/valgrind-results/build/debug_gnu9/test/valgrind.23313.memcheck.xml
[Valgrind] Copying build/debug_gnu9/test/valgrind.25229.memcheck.xml to /var/lib/jenkins/jobs/SANS_Weekly/configurations/axis-builddir/debug_gnu9/axis-buildnode/reynolds/builds/259/valgrind-plugin/valgrind-results/build/debug_gnu9/test/valgrind.25229.memcheck.xml
[Valgrind] Copying build/debug_gnu9/test/valgrind.26029.memcheck.xml to /var/lib/jenkins/jobs/SANS_Weekly/configurations/axis-builddir/debug_gnu9/axis-buildnode/reynolds/builds/259/valgrind-plugin/valgrind-results/build/debug_gnu9/test/valgrind.26029.memcheck.xml
[Valgrind] Copying build/debug_gnu9/test/valgrind.26106.memcheck.xml to /var/lib/jenkins/jobs/SANS_Weekly/configurations/axis-builddir/debug_gnu9/axis-buildnode/reynolds/builds/259/valgrind-plugin/valgrind-results/build/debug_gnu9/test/valgrind.26106.memcheck.xml
[Valgrind] Copying build/debug_gnu9/test/valgrind.27201.memcheck.xml to /var/lib/jenkins/jobs/SANS_Weekly/configurations/axis-builddir/debug_gnu9/axis-buildnode/reynolds/builds/259/valgrind-plugin/valgrind-results/build/debug_gnu9/test/valgrind.27201.memcheck.xml
[Valgrind] Copying build/debug_gnu9/test/valgrind.27740.memcheck.xml to /var/lib/jenkins/jobs/SANS_Weekly/configurations/axis-builddir/debug_gnu9/axis-buildnode/reynolds/builds/259/valgrind-plugin/valgrind-results/build/debug_gnu9/test/valgrind.27740.memcheck.xml
[Valgrind] Copying build/debug_gnu9/test/valgrind.29347.memcheck.xml to /var/lib/jenkins/jobs/SANS_Weekly/configurations/axis-builddir/debug_gnu9/axis-buildnode/reynolds/builds/259/valgrind-plugin/valgrind-results/build/debug_gnu9/test/valgrind.29347.memcheck.xml
[Valgrind] Copying build/debug_gnu9/test/valgrind.29463.memcheck.xml to /var/lib/jenkins/jobs/SANS_Weekly/configurations/axis-builddir/debug_gnu9/axis-buildnode/reynolds/builds/259/valgrind-plugin/valgrind-results/build/debug_gnu9/test/valgrind.29463.memcheck.xml
[Valgrind] Copying build/debug_gnu9/test/valgrind.29800.memcheck.xml to /var/lib/jenkins/jobs/SANS_Weekly/configurations/axis-builddir/debug_gnu9/axis-buildnode/reynolds/builds/259/valgrind-plugin/valgrind-results/build/debug_gnu9/test/valgrind.29800.memcheck.xml
[Valgrind] Copying build/debug_gnu9/test/valgrind.30062.memcheck.xml to /var/lib/jenkins/jobs/SANS_Weekly/configurations/axis-builddir/debug_gnu9/axis-buildnode/reynolds/builds/259/valgrind-plugin/valgrind-results/build/debug_gnu9/test/valgrind.30062.memcheck.xml
[Valgrind] Copying build/debug_gnu9/test/valgrind.30411.memcheck.xml to /var/lib/jenkins/jobs/SANS_Weekly/configurations/axis-builddir/debug_gnu9/axis-buildnode/reynolds/builds/259/valgrind-plugin/valgrind-results/build/debug_gnu9/test/valgrind.30411.memcheck.xml
[Valgrind] Copying build/debug_gnu9/test/valgrind.30719.memcheck.xml to /var/lib/jenkins/jobs/SANS_Weekly/configurations/axis-builddir/debug_gnu9/axis-buildnode/reynolds/builds/259/valgrind-plugin/valgrind-results/build/debug_gnu9/test/valgrind.30719.memcheck.xml
[Valgrind] Copying build/debug_gnu9/test/valgrind.30973.memcheck.xml to /var/lib/jenkins/jobs/SANS_Weekly/configurations/axis-builddir/debug_gnu9/axis-buildnode/reynolds/builds/259/valgrind-plugin/valgrind-results/build/debug_gnu9/test/valgrind.30973.memcheck.xml
[Valgrind] Copying build/debug_gnu9/test/valgrind.31194.memcheck.xml to /var/lib/jenkins/jobs/SANS_Weekly/configurations/axis-builddir/debug_gnu9/axis-buildnode/reynolds/builds/259/valgrind-plugin/valgrind-results/build/debug_gnu9/test/valgrind.31194.memcheck.xml
[Valgrind] Copying build/debug_gnu9/test/valgrind.3137.memcheck.xml to /var/lib/jenkins/jobs/SANS_Weekly/configurations/axis-builddir/debug_gnu9/axis-buildnode/reynolds/builds/259/valgrind-plugin/valgrind-results/build/debug_gnu9/test/valgrind.3137.memcheck.xml
[Valgrind] Copying build/debug_gnu9/test/valgrind.33659.memcheck.xml to /var/lib/jenkins/jobs/SANS_Weekly/configurations/axis-builddir/debug_gnu9/axis-buildnode/reynolds/builds/259/valgrind-plugin/valgrind-results/build/debug_gnu9/test/valgrind.33659.memcheck.xml
[Valgrind] Copying build/debug_gnu9/test/valgrind.33847.memcheck.xml to /var/lib/jenkins/jobs/SANS_Weekly/configurations/axis-builddir/debug_gnu9/axis-buildnode/reynolds/builds/259/valgrind-plugin/valgrind-results/build/debug_gnu9/test/valgrind.33847.memcheck.xml
[Valgrind] Copying build/debug_gnu9/test/valgrind.33882.memcheck.xml to /var/lib/jenkins/jobs/SANS_Weekly/configurations/axis-builddir/debug_gnu9/axis-buildnode/reynolds/builds/259/valgrind-plugin/valgrind-results/build/debug_gnu9/test/valgrind.33882.memcheck.xml
[Valgrind] Copying build/debug_gnu9/test/valgrind.34261.memcheck.xml to /var/lib/jenkins/jobs/SANS_Weekly/configurations/axis-builddir/debug_gnu9/axis-buildnode/reynolds/builds/259/valgrind-plugin/valgrind-results/build/debug_gnu9/test/valgrind.34261.memcheck.xml
[Valgrind] Copying build/debug_gnu9/test/valgrind.35589.memcheck.xml to /var/lib/jenkins/jobs/SANS_Weekly/configurations/axis-builddir/debug_gnu9/axis-buildnode/reynolds/builds/259/valgrind-plugin/valgrind-results/build/debug_gnu9/test/valgrind.35589.memcheck.xml
[Valgrind] Copying build/debug_gnu9/test/valgrind.35748.memcheck.xml to /var/lib/jenkins/jobs/SANS_Weekly/configurations/axis-builddir/debug_gnu9/axis-buildnode/reynolds/builds/259/valgrind-plugin/valgrind-results/build/debug_gnu9/test/valgrind.35748.memcheck.xml
[Valgrind] Copying build/debug_gnu9/test/valgrind.35921.memcheck.xml to /var/lib/jenkins/jobs/SANS_Weekly/configurations/axis-builddir/debug_gnu9/axis-buildnode/reynolds/builds/259/valgrind-plugin/valgrind-results/build/debug_gnu9/test/valgrind.35921.memcheck.xml
[Valgrind] Copying build/debug_gnu9/test/valgrind.36425.memcheck.xml to /var/lib/jenkins/jobs/SANS_Weekly/configurations/axis-builddir/debug_gnu9/axis-buildnode/reynolds/builds/259/valgrind-plugin/valgrind-results/build/debug_gnu9/test/valgrind.36425.memcheck.xml
[Valgrind] Copying build/debug_gnu9/test/valgrind.3647.memcheck.xml to /var/lib/jenkins/jobs/SANS_Weekly/configurations/axis-builddir/debug_gnu9/axis-buildnode/reynolds/builds/259/valgrind-plugin/valgrind-results/build/debug_gnu9/test/valgrind.3647.memcheck.xml
[Valgrind] Copying build/debug_gnu9/test/valgrind.3652.memcheck.xml to /var/lib/jenkins/jobs/SANS_Weekly/configurations/axis-builddir/debug_gnu9/axis-buildnode/reynolds/builds/259/valgrind-plugin/valgrind-results/build/debug_gnu9/test/valgrind.3652.memcheck.xml
[Valgrind] Copying build/debug_gnu9/test/valgrind.36659.memcheck.xml to /var/lib/jenkins/jobs/SANS_Weekly/configurations/axis-builddir/debug_gnu9/axis-buildnode/reynolds/builds/259/valgrind-plugin/valgrind-results/build/debug_gnu9/test/valgrind.36659.memcheck.xml
[Valgrind] Copying build/debug_gnu9/test/valgrind.36915.memcheck.xml to /var/lib/jenkins/jobs/SANS_Weekly/configurations/axis-builddir/debug_gnu9/axis-buildnode/reynolds/builds/259/valgrind-plugin/valgrind-results/build/debug_gnu9/test/valgrind.36915.memcheck.xml
[Valgrind] Copying build/debug_gnu9/test/valgrind.37039.memcheck.xml to /var/lib/jenkins/jobs/SANS_Weekly/configurations/axis-builddir/debug_gnu9/axis-buildnode/reynolds/builds/259/valgrind-plugin/valgrind-results/build/debug_gnu9/test/valgrind.37039.memcheck.xml
[Valgrind] Copying build/debug_gnu9/test/valgrind.37063.memcheck.xml to /var/lib/jenkins/jobs/SANS_Weekly/configurations/axis-builddir/debug_gnu9/axis-buildnode/reynolds/builds/259/valgrind-plugin/valgrind-results/build/debug_gnu9/test/valgrind.37063.memcheck.xml
[Valgrind] Copying build/debug_gnu9/test/valgrind.37419.memcheck.xml to /var/lib/jenkins/jobs/SANS_Weekly/configurations/axis-builddir/debug_gnu9/axis-buildnode/reynolds/builds/259/valgrind-plugin/valgrind-results/build/debug_gnu9/test/valgrind.37419.memcheck.xml
[Valgrind] Copying build/debug_gnu9/test/valgrind.3747.memcheck.xml to /var/lib/jenkins/jobs/SANS_Weekly/configurations/axis-builddir/debug_gnu9/axis-buildnode/reynolds/builds/259/valgrind-plugin/valgrind-results/build/debug_gnu9/test/valgrind.3747.memcheck.xml
[Valgrind] Copying build/debug_gnu9/test/valgrind.37915.memcheck.xml to /var/lib/jenkins/jobs/SANS_Weekly/configurations/axis-builddir/debug_gnu9/axis-buildnode/reynolds/builds/259/valgrind-plugin/valgrind-results/build/debug_gnu9/test/valgrind.37915.memcheck.xml
[Valgrind] Copying build/debug_gnu9/test/valgrind.38253.memcheck.xml to /var/lib/jenkins/jobs/SANS_Weekly/configurations/axis-builddir/debug_gnu9/axis-buildnode/reynolds/builds/259/valgrind-plugin/valgrind-results/build/debug_gnu9/test/valgrind.38253.memcheck.xml
[Valgrind] Copying build/debug_gnu9/test/valgrind.38429.memcheck.xml to /var/lib/jenkins/jobs/SANS_Weekly/configurations/axis-builddir/debug_gnu9/axis-buildnode/reynolds/builds/259/valgrind-plugin/valgrind-results/build/debug_gnu9/test/valgrind.38429.memcheck.xml
[Valgrind] Copying build/debug_gnu9/test/valgrind.38437.memcheck.xml to /var/lib/jenkins/jobs/SANS_Weekly/configurations/axis-builddir/debug_gnu9/axis-buildnode/reynolds/builds/259/valgrind-plugin/valgrind-results/build/debug_gnu9/test/valgrind.38437.memcheck.xml
[Valgrind] Copying build/debug_gnu9/test/valgrind.38542.memcheck.xml to /var/lib/jenkins/jobs/SANS_Weekly/configurations/axis-builddir/debug_gnu9/axis-buildnode/reynolds/builds/259/valgrind-plugin/valgrind-results/build/debug_gnu9/test/valgrind.38542.memcheck.xml
[Valgrind] Copying build/debug_gnu9/test/valgrind.3869.memcheck.xml to /var/lib/jenkins/jobs/SANS_Weekly/configurations/axis-builddir/debug_gnu9/axis-buildnode/reynolds/builds/259/valgrind-plugin/valgrind-results/build/debug_gnu9/test/valgrind.3869.memcheck.xml
[Valgrind] Copying build/debug_gnu9/test/valgrind.38739.memcheck.xml to /var/lib/jenkins/jobs/SANS_Weekly/configurations/axis-builddir/debug_gnu9/axis-buildnode/reynolds/builds/259/valgrind-plugin/valgrind-results/build/debug_gnu9/test/valgrind.38739.memcheck.xml
[Valgrind] Copying build/debug_gnu9/test/valgrind.38867.memcheck.xml to /var/lib/jenkins/jobs/SANS_Weekly/configurations/axis-builddir/debug_gnu9/axis-buildnode/reynolds/builds/259/valgrind-plugin/valgrind-results/build/debug_gnu9/test/valgrind.38867.memcheck.xml
[Valgrind] Copying build/debug_gnu9/test/valgrind.3901.memcheck.xml to /var/lib/jenkins/jobs/SANS_Weekly/configurations/axis-builddir/debug_gnu9/axis-buildnode/reynolds/builds/259/valgrind-plugin/valgrind-results/build/debug_gnu9/test/valgrind.3901.memcheck.xml
[Valgrind] Copying build/debug_gnu9/test/valgrind.39136.memcheck.xml to /var/lib/jenkins/jobs/SANS_Weekly/configurations/axis-builddir/debug_gnu9/axis-buildnode/reynolds/builds/259/valgrind-plugin/valgrind-results/build/debug_gnu9/test/valgrind.39136.memcheck.xml
[Valgrind] Copying build/debug_gnu9/test/valgrind.39207.memcheck.xml to /var/lib/jenkins/jobs/SANS_Weekly/configurations/axis-builddir/debug_gnu9/axis-buildnode/reynolds/builds/259/valgrind-plugin/valgrind-results/build/debug_gnu9/test/valgrind.39207.memcheck.xml
[Valgrind] Copying build/debug_gnu9/test/valgrind.40314.memcheck.xml to /var/lib/jenkins/jobs/SANS_Weekly/configurations/axis-builddir/debug_gnu9/axis-buildnode/reynolds/builds/259/valgrind-plugin/valgrind-results/build/debug_gnu9/test/valgrind.40314.memcheck.xml
[Valgrind] Copying build/debug_gnu9/test/valgrind.40509.memcheck.xml to /var/lib/jenkins/jobs/SANS_Weekly/configurations/axis-builddir/debug_gnu9/axis-buildnode/reynolds/builds/259/valgrind-plugin/valgrind-results/build/debug_gnu9/test/valgrind.40509.memcheck.xml
[Valgrind] Copying build/debug_gnu9/test/valgrind.40551.memcheck.xml to /var/lib/jenkins/jobs/SANS_Weekly/configurations/axis-builddir/debug_gnu9/axis-buildnode/reynolds/builds/259/valgrind-plugin/valgrind-results/build/debug_gnu9/test/valgrind.40551.memcheck.xml
[Valgrind] Copying build/debug_gnu9/test/valgrind.40750.memcheck.xml to /var/lib/jenkins/jobs/SANS_Weekly/configurations/axis-builddir/debug_gnu9/axis-buildnode/reynolds/builds/259/valgrind-plugin/valgrind-results/build/debug_gnu9/test/valgrind.40750.memcheck.xml
[Valgrind] Copying build/debug_gnu9/test/valgrind.5412.memcheck.xml to /var/lib/jenkins/jobs/SANS_Weekly/configurations/axis-builddir/debug_gnu9/axis-buildnode/reynolds/builds/259/valgrind-plugin/valgrind-results/build/debug_gnu9/test/valgrind.5412.memcheck.xml
[Valgrind] Copying build/debug_gnu9/test/valgrind.6902.memcheck.xml to /var/lib/jenkins/jobs/SANS_Weekly/configurations/axis-builddir/debug_gnu9/axis-buildnode/reynolds/builds/259/valgrind-plugin/valgrind-results/build/debug_gnu9/test/valgrind.6902.memcheck.xml
[Valgrind] Copying build/debug_gnu9/test/valgrind.7825.memcheck.xml to /var/lib/jenkins/jobs/SANS_Weekly/configurations/axis-builddir/debug_gnu9/axis-buildnode/reynolds/builds/259/valgrind-plugin/valgrind-results/build/debug_gnu9/test/valgrind.7825.memcheck.xml
[Valgrind] Copying build/debug_gnu9/test/valgrind.8343.memcheck.xml to /var/lib/jenkins/jobs/SANS_Weekly/configurations/axis-builddir/debug_gnu9/axis-buildnode/reynolds/builds/259/valgrind-plugin/valgrind-results/build/debug_gnu9/test/valgrind.8343.memcheck.xml
[Valgrind] Copying build/debug_gnu9/test/valgrind.8345.memcheck.xml to /var/lib/jenkins/jobs/SANS_Weekly/configurations/axis-builddir/debug_gnu9/axis-buildnode/reynolds/builds/259/valgrind-plugin/valgrind-results/build/debug_gnu9/test/valgrind.8345.memcheck.xml
[Valgrind] Copying build/debug_gnu9/test/valgrind.8350.memcheck.xml to /var/lib/jenkins/jobs/SANS_Weekly/configurations/axis-builddir/debug_gnu9/axis-buildnode/reynolds/builds/259/valgrind-plugin/valgrind-results/build/debug_gnu9/test/valgrind.8350.memcheck.xml
[Valgrind] Copying build/debug_gnu9/test/valgrind.8352.memcheck.xml to /var/lib/jenkins/jobs/SANS_Weekly/configurations/axis-builddir/debug_gnu9/axis-buildnode/reynolds/builds/259/valgrind-plugin/valgrind-results/build/debug_gnu9/test/valgrind.8352.memcheck.xml
[Valgrind] Copying build/debug_gnu9/test/valgrind.9953.memcheck.xml to /var/lib/jenkins/jobs/SANS_Weekly/configurations/axis-builddir/debug_gnu9/axis-buildnode/reynolds/builds/259/valgrind-plugin/valgrind-results/build/debug_gnu9/test/valgrind.9953.memcheck.xml
[Valgrind] Analysing valgrind results
[Valgrind] copying source file '/usr/include/c++/9/bits/stl_bvector.h' to 'source_1.tmp'...
[Valgrind] copying source file '/usr/include/c++/5/bits/stl_bvector.h' to 'source_2.tmp'...
[Valgrind] copying source file '/home/jenkins/util/avro/src/lib/mesh/vertices.cpp' to 'source_3.tmp'...
[Valgrind] copying source file '/home/jenkins/util/avro/src/lib/library/cube.cpp' to 'source_4.tmp'...
[Valgrind] copying source file '/jenkins/workspace/SANS_Weekly/builddir/debug_gnu9/buildnode/reynolds/test/unit/UnitGrids/XField_KuhnFreudenthal.cpp' to 'source_5.tmp'...
[Valgrind] copying source file '/usr/include/c++/9/ext/new_allocator.h' to 'source_6.tmp'...
[Valgrind] copying source file '/usr/include/c++/9/bits/alloc_traits.h' to 'source_7.tmp'...
[Valgrind] copying source file '/usr/include/c++/9/bits/shared_ptr_base.h' to 'source_8.tmp'...
[Valgrind] copying source file '/usr/include/c++/9/bits/shared_ptr.h' to 'source_9.tmp'...
[Valgrind] copying source file '/jenkins/workspace/SANS_Weekly/builddir/debug_gnu9/buildnode/reynolds/test/system/Asymptotic/ErrorOrder_4D_DG_Pentatope_btest.cpp' to 'source_10.tmp'...
[Valgrind] copying source file '/usr/include/boost/test/utils/callback.hpp' to 'source_11.tmp'...
[Valgrind] copying source file '/usr/include/boost/test/unit_test.hpp' to 'source_12.tmp'...
[Valgrind] copying source file '/home/jenkins/util/valgrind/valgrind-3.15.0/coregrind/m_replacemalloc/vg_replace_malloc.c' to 'source_13.tmp'...
[Valgrind] copying source file '/home/jenkins/util/avro/src/lib/geometry/context.cpp' to 'source_14.tmp'...
[Valgrind] copying source file '/jenkins/workspace/SANS_Weekly/builddir/debug_gnu9/buildnode/reynolds/src/tools/PointerArray.h' to 'source_15.tmp'...
[Valgrind] copying source file '/jenkins/workspace/SANS_Weekly/builddir/debug_gnu9/buildnode/reynolds/src/Field/FieldBase_impl.h' to 'source_16.tmp'...
[Valgrind] copying source file '/jenkins/workspace/SANS_Weekly/builddir/debug_gnu9/buildnode/reynolds/src/Field/XField_impl.h' to 'source_17.tmp'...
[Valgrind] copying source file '/usr/include/c++/9/bits/stl_vector.h' to 'source_18.tmp'...
[Valgrind] copying source file '/usr/include/c++/5/ext/new_allocator.h' to 'source_19.tmp'...
[Valgrind] copying source file '/usr/include/c++/5/bits/alloc_traits.h' to 'source_20.tmp'...
[Valgrind] copying source file '/usr/include/c++/5/bits/stl_vector.h' to 'source_21.tmp'...
[Valgrind] copying source file '/usr/include/c++/5/bits/vector.tcc' to 'source_22.tmp'...
[Valgrind] copying source file '/home/jenkins/util/avro/src/lib/mesh/mesh.h' to 'source_23.tmp'...
[Valgrind] copying source file '/usr/include/c++/9/bits/allocated_ptr.h' to 'source_24.tmp'...
[Valgrind] copying source file '/jenkins/workspace/SANS_Weekly/builddir/debug_gnu9/buildnode/reynolds/src/Field/Partition/XField_Lagrange_impl.h' to 'source_25.tmp'...
[Valgrind] copying source file '/usr/include/c++/9/bits/vector.tcc' to 'source_26.tmp'...
[Valgrind] copying source file '/home/jenkins/util/avro/src/lib/mesh/neighbours.cpp' to 'source_27.tmp'...
[Valgrind] copying source file '/home/jenkins/util/avro/src/lib/mesh/topology.hpp' to 'source_28.tmp'...
[Valgrind] copying source file '/usr/include/c++/5/bits/shared_ptr_base.h' to 'source_29.tmp'...
[Valgrind] copying source file '/usr/include/c++/5/bits/shared_ptr.h' to 'source_30.tmp'...
[Valgrind] copying source file '/home/jenkins/util/avro/src/lib/mesh/neighbours.h' to 'source_31.tmp'...
[Valgrind] copying source file '/home/jenkins/util/ESP/EngSketchPad/src/EGADS/util/emp.c' to 'source_32.tmp'...
[Valgrind] copying source file '/home/jenkins/util/ESP/EngSketchPad/src/EGADS/src/egadsBase.c' to 'source_33.tmp'...
[Valgrind] copying source file '/jenkins/workspace/SANS_Weekly/builddir/debug_gnu9/buildnode/reynolds/src/Field/XFieldSpacetime_impl.h' to 'source_34.tmp'...
[Valgrind] copying source file '/home/jenkins/util/ESP/EngSketchPad/src/EGADS/src/egadsMemory.c' to 'source_35.tmp'...
[Valgrind] copying source file '/home/jenkins/util/avro/src/lib/mesh/simplex.cpp' to 'source_36.tmp'...
[Valgrind] copying source file '/home/jenkins/util/avro/src/lib/geometry/body.cpp' to 'source_37.tmp'...
[Valgrind] copying source file '/home/jenkins/util/avro/src/lib/library/tesseract.cpp' to 'source_38.tmp'...
[Valgrind] copying source file '/jenkins/workspace/SANS_Weekly/builddir/debug_gnu9/buildnode/reynolds/src/Field/ElementConnectivity.h' to 'source_39.tmp'...
[Valgrind] copying source file '/home/jenkins/util/avro/src/lib/mesh/curvilinear.cpp' to 'source_40.tmp'...
[Valgrind] copying source file '/home/jenkins/util/avro/src/lib/common/hierarchical.hpp' to 'source_41.tmp'...
[Valgrind] copying source file '/home/jenkins/util/avro/src/lib/library/tesseract.h' to 'source_42.tmp'...
[Valgrind] copying source file '/jenkins/workspace/SANS_Weekly/builddir/debug_gnu9/buildnode/reynolds/src/Field/Element/ElementAssociativitySpacetime.cpp' to 'source_43.tmp'...
[Valgrind] copying source file '/jenkins/workspace/SANS_Weekly/builddir/debug_gnu9/buildnode/reynolds/src/Field/FieldAssociativity.h' to 'source_44.tmp'...
[Valgrind] copying source file '/jenkins/workspace/SANS_Weekly/builddir/debug_gnu9/buildnode/reynolds/src/Field/Element/ElementAssociativityVolume.cpp' to 'source_45.tmp'...
[Valgrind] copying source file '/home/jenkins/util/avro/src/lib/common/hierarchical.h' to 'source_46.tmp'...
[Valgrind] copying source file '/usr/include/c++/5/bits/allocated_ptr.h' to 'source_47.tmp'...
[Valgrind] workspacePath: /jenkins/workspace/SANS_Weekly/builddir/debug_gnu9/buildnode/reynolds/
[Valgrind] Ending the valgrind analysis.
INFO: Starting to record.
INFO: Processing CTest-Version 3.x (default)
INFO: [CTest-Version 3.x (default)] - 1 test report file(s) were found with the pattern 'build/Test*.xml' relative to '/jenkins/workspace/SANS_Weekly/builddir/debug_gnu9/buildnode/reynolds' for the testing framework 'CTest-Version 3.x (default)'.
INFO: Check 'Failed Tests' threshold.
INFO: The total number of tests for the threshold 'Failed Tests' exceeds the specified "failure threshold" value.
INFO: Setting the build status to FAILURE
INFO: Stopping recording.
[PostBuildScript] - [INFO] Executing post build scripts.
[PostBuildScript] - [INFO] Build does not have any of the results []. Did not execute build step #0.
[WS-CLEANUP] Deleting project workspace...
[WS-CLEANUP] Deferred wipeout is used...
[WS-CLEANUP] done
Finished: FAILURE