Console Output

Skipping 325 KB.. Full Log
[ 87%] Built target ShallowWaterLib_vera
Scanning dependencies of target ShallowWaterLib
[ 87%] Building CXX object src/pde/ShallowWater/CMakeFiles/ShallowWaterLib.dir/PDEShallowWater1D.cpp.o
[ 87%] Building CXX object src/pde/ShallowWater/CMakeFiles/ShallowWaterLib.dir/ShallowWaterSolution1D.cpp.o
[ 90%] Building CXX object src/pde/ShallowWater/CMakeFiles/ShallowWaterLib.dir/BCShallowWater1D.cpp.o
[ 90%] Building CXX object src/pde/ShallowWater/CMakeFiles/ShallowWaterLib.dir/PDEShallowWater2D.cpp.o
[ 90%] Building CXX object src/pde/ShallowWater/CMakeFiles/ShallowWaterLib.dir/ShallowWaterSolution2D.cpp.o
[ 90%] Building CXX object src/pde/ShallowWater/CMakeFiles/ShallowWaterLib.dir/BCShallowWater2D.cpp.o
[ 90%] Building CXX object src/pde/ShallowWater/CMakeFiles/ShallowWaterLib.dir/PDEShallowWater2D_manifold.cpp.o
[ 90%] Building CXX object src/pde/ShallowWater/CMakeFiles/ShallowWaterLib.dir/ShallowWaterSolution2D_manifold.cpp.o
[ 90%] Building CXX object src/pde/ShallowWater/CMakeFiles/ShallowWaterLib.dir/BCShallowWater2D_manifold.cpp.o
[ 90%] Linking CXX static library libShallowWaterLib.a
[ 90%] Built target ShallowWaterLib
Scanning dependencies of target Adjoint2D_HDG_Triangle_AD_mitState_btest_OBJECT
[ 90%] Building CXX object test/system/Asymptotic/CMakeFiles/Adjoint2D_HDG_Triangle_AD_mitState_btest_OBJECT.dir/Adjoint2D_HDG_Triangle_AD_mitState_btest.cpp.o
[ 90%] Built target Adjoint2D_HDG_Triangle_AD_mitState_btest_OBJECT
Scanning dependencies of target Adjoint2D_HDG_Triangle_AD_mitState_btest_build
[ 90%] Linking CXX executable Adjoint2D_HDG_Triangle_AD_mitState_btest
[ 90%] Built target Adjoint2D_HDG_Triangle_AD_mitState_btest_build
Scanning dependencies of target ErrorOrder_2D_CGStabilized_RANS_MMS_btest_OBJECT
[ 90%] Building CXX object test/system/Asymptotic/CMakeFiles/ErrorOrder_2D_CGStabilized_RANS_MMS_btest_OBJECT.dir/ErrorOrder_2D_CGStabilized_RANS_MMS_btest.cpp.o
[ 90%] Built target ErrorOrder_2D_CGStabilized_RANS_MMS_btest_OBJECT
Scanning dependencies of target ErrorOrder_2D_CGStabilized_RANS_MMS_btest_build_vera
[ 90%] Checking style of test/system/Asymptotic/ErrorOrder_2D_CGStabilized_RANS_MMS_btest.cpp
[ 90%] Built target ErrorOrder_2D_CGStabilized_RANS_MMS_btest_build_vera
Scanning dependencies of target ErrorOrder_2D_CGStabilized_RANS_MMS_btest_build
[ 90%] Linking CXX executable ErrorOrder_2D_CGStabilized_RANS_MMS_btest
[ 90%] Built target ErrorOrder_2D_CGStabilized_RANS_MMS_btest_build
Scanning dependencies of target ErrorOrder_2D_DGAdvective_Annulus_Quad_btest_OBJECT
[ 90%] Building CXX object test/system/Asymptotic/CMakeFiles/ErrorOrder_2D_DGAdvective_Annulus_Quad_btest_OBJECT.dir/ErrorOrder_2D_DGAdvective_Annulus_Quad_btest.cpp.o
[ 90%] Built target ErrorOrder_2D_DGAdvective_Annulus_Quad_btest_OBJECT
Scanning dependencies of target ErrorOrder_2D_DGAdvective_Annulus_Quad_btest_build_vera
[ 90%] Checking style of test/system/Asymptotic/ErrorOrder_2D_DGAdvective_Annulus_Quad_btest.cpp
[ 90%] Built target ErrorOrder_2D_DGAdvective_Annulus_Quad_btest_build_vera
Scanning dependencies of target ErrorOrder_2D_DGAdvective_Annulus_Quad_btest_build
[ 90%] Linking CXX executable ErrorOrder_2D_DGAdvective_Annulus_Quad_btest
[ 90%] Built target ErrorOrder_2D_DGAdvective_Annulus_Quad_btest_build
Scanning dependencies of target ErrorOrder_1D_DGBR2_AD_HB_btest_build_vera
[ 90%] Checking style of test/system/Asymptotic/ErrorOrder_1D_DGBR2_AD_HB_btest.cpp
[ 90%] Built target ErrorOrder_1D_DGBR2_AD_HB_btest_build_vera
Scanning dependencies of target ErrorOrder_1D_DGBR2_AD_HB_btest_OBJECT
[ 90%] Building CXX object test/system/Asymptotic/CMakeFiles/ErrorOrder_1D_DGBR2_AD_HB_btest_OBJECT.dir/ErrorOrder_1D_DGBR2_AD_HB_btest.cpp.o
[ 90%] Built target ErrorOrder_1D_DGBR2_AD_HB_btest_OBJECT
Scanning dependencies of target ErrorOrder_1D_DGBR2_AD_HB_btest_build
[ 90%] Linking CXX executable ErrorOrder_1D_DGBR2_AD_HB_btest
[ 90%] Built target ErrorOrder_1D_DGBR2_AD_HB_btest_build
Scanning dependencies of target ErrorOrder_3D_DGBR2_Periodic_Hex_AD_btest_build_vera
[ 90%] Checking style of test/system/Asymptotic/ErrorOrder_3D_DGBR2_Periodic_Hex_AD_btest.cpp
[ 90%] Built target ErrorOrder_3D_DGBR2_Periodic_Hex_AD_btest_build_vera
Scanning dependencies of target ErrorOrder_3D_DGBR2_Periodic_Hex_AD_btest_OBJECT
[ 90%] Building CXX object test/system/Asymptotic/CMakeFiles/ErrorOrder_3D_DGBR2_Periodic_Hex_AD_btest_OBJECT.dir/ErrorOrder_3D_DGBR2_Periodic_Hex_AD_btest.cpp.o
[ 90%] Built target ErrorOrder_3D_DGBR2_Periodic_Hex_AD_btest_OBJECT
Scanning dependencies of target ErrorOrder_3D_DGBR2_Periodic_Hex_AD_btest_build
[ 90%] Linking CXX executable ErrorOrder_3D_DGBR2_Periodic_Hex_AD_btest
[ 90%] Built target ErrorOrder_3D_DGBR2_Periodic_Hex_AD_btest_build
Scanning dependencies of target Adjoint2D_DGBR2_Triangle_AD_btest_build_vera
[ 90%] Checking style of test/system/Asymptotic/Adjoint2D_DGBR2_Triangle_AD_btest.cpp
[ 90%] Built target Adjoint2D_DGBR2_Triangle_AD_btest_build_vera
Scanning dependencies of target Adjoint2D_DGBR2_Triangle_AD_btest_OBJECT
[ 90%] Building CXX object test/system/Asymptotic/CMakeFiles/Adjoint2D_DGBR2_Triangle_AD_btest_OBJECT.dir/Adjoint2D_DGBR2_Triangle_AD_btest.cpp.o
[ 90%] Built target Adjoint2D_DGBR2_Triangle_AD_btest_OBJECT
Scanning dependencies of target Adjoint2D_DGBR2_Triangle_AD_btest_build
[ 90%] Linking CXX executable Adjoint2D_DGBR2_Triangle_AD_btest
[ 90%] Built target Adjoint2D_DGBR2_Triangle_AD_btest_build
Scanning dependencies of target ErrorEstimateOrder_3D_CG_Tet_AD_btest_build_vera
[ 90%] Checking style of test/system/Asymptotic/ErrorEstimateOrder_3D_CG_Tet_AD_btest.cpp
[ 90%] Built target ErrorEstimateOrder_3D_CG_Tet_AD_btest_build_vera
Scanning dependencies of target ErrorEstimateOrder_3D_CG_Tet_AD_btest_OBJECT
[ 90%] Building CXX object test/system/Asymptotic/CMakeFiles/ErrorEstimateOrder_3D_CG_Tet_AD_btest_OBJECT.dir/ErrorEstimateOrder_3D_CG_Tet_AD_btest.cpp.o
[ 90%] Built target ErrorEstimateOrder_3D_CG_Tet_AD_btest_OBJECT
Scanning dependencies of target ErrorEstimateOrder_3D_CG_Tet_AD_btest_build
[ 90%] Linking CXX executable ErrorEstimateOrder_3D_CG_Tet_AD_btest
[ 90%] Built target ErrorEstimateOrder_3D_CG_Tet_AD_btest_build
Scanning dependencies of target ErrorOrder_1D_CG_AD_btest_build_vera
[ 90%] Checking style of test/system/Asymptotic/ErrorOrder_1D_CG_AD_btest.cpp
[ 90%] Built target ErrorOrder_1D_CG_AD_btest_build_vera
Scanning dependencies of target ErrorOrder_1D_CG_AD_btest_OBJECT
[ 90%] Building CXX object test/system/Asymptotic/CMakeFiles/ErrorOrder_1D_CG_AD_btest_OBJECT.dir/ErrorOrder_1D_CG_AD_btest.cpp.o
[ 90%] Built target ErrorOrder_1D_CG_AD_btest_OBJECT
Scanning dependencies of target ErrorOrder_1D_CG_AD_btest_build
[ 90%] Linking CXX executable ErrorOrder_1D_CG_AD_btest
[ 90%] Built target ErrorOrder_1D_CG_AD_btest_build
Scanning dependencies of target Adjoint2D_CG_Triangle_AD_btest_build_vera
[ 90%] Checking style of test/system/Asymptotic/Adjoint2D_CG_Triangle_AD_btest.cpp
[ 90%] Built target Adjoint2D_CG_Triangle_AD_btest_build_vera
Scanning dependencies of target Adjoint2D_CG_Triangle_AD_btest_OBJECT
[ 90%] Building CXX object test/system/Asymptotic/CMakeFiles/Adjoint2D_CG_Triangle_AD_btest_OBJECT.dir/Adjoint2D_CG_Triangle_AD_btest.cpp.o
[ 90%] Built target Adjoint2D_CG_Triangle_AD_btest_OBJECT
Scanning dependencies of target Adjoint2D_CG_Triangle_AD_btest_build
[ 90%] Linking CXX executable Adjoint2D_CG_Triangle_AD_btest
[ 90%] Built target Adjoint2D_CG_Triangle_AD_btest_build
Scanning dependencies of target ErrorOrder_2D_DGBR2_Triangle_AD_btest_OBJECT
[ 90%] Building CXX object test/system/Asymptotic/CMakeFiles/ErrorOrder_2D_DGBR2_Triangle_AD_btest_OBJECT.dir/ErrorOrder_2D_DGBR2_Triangle_AD_btest.cpp.o
[ 90%] Built target ErrorOrder_2D_DGBR2_Triangle_AD_btest_OBJECT
Scanning dependencies of target ErrorOrder_2D_DGBR2_Triangle_AD_btest_build_vera
[ 90%] Checking style of test/system/Asymptotic/ErrorOrder_2D_DGBR2_Triangle_AD_btest.cpp
[ 90%] Built target ErrorOrder_2D_DGBR2_Triangle_AD_btest_build_vera
Scanning dependencies of target ErrorOrder_2D_DGBR2_Triangle_AD_btest_build
[ 90%] Linking CXX executable ErrorOrder_2D_DGBR2_Triangle_AD_btest
[ 90%] Built target ErrorOrder_2D_DGBR2_Triangle_AD_btest_build
Scanning dependencies of target ErrorOrder_2D_DGBR2_RANS_MMS_btest_OBJECT
[ 90%] Building CXX object test/system/Asymptotic/CMakeFiles/ErrorOrder_2D_DGBR2_RANS_MMS_btest_OBJECT.dir/ErrorOrder_2D_DGBR2_RANS_MMS_btest.cpp.o
[ 90%] Built target ErrorOrder_2D_DGBR2_RANS_MMS_btest_OBJECT
Scanning dependencies of target ErrorOrder_2D_DGBR2_RANS_MMS_btest_build_vera
[ 90%] Checking style of test/system/Asymptotic/ErrorOrder_2D_DGBR2_RANS_MMS_btest.cpp
[ 90%] Built target ErrorOrder_2D_DGBR2_RANS_MMS_btest_build_vera
Scanning dependencies of target ErrorOrder_2D_DGBR2_RANS_MMS_btest_build
[ 90%] Linking CXX executable ErrorOrder_2D_DGBR2_RANS_MMS_btest
[ 90%] Built target ErrorOrder_2D_DGBR2_RANS_MMS_btest_build
Scanning dependencies of target Adjoint2D_HDG_Triangle_AD_sansLG_btest_build_vera
[ 90%] Checking style of test/system/Asymptotic/Adjoint2D_HDG_Triangle_AD_sansLG_btest.cpp
[ 90%] Built target Adjoint2D_HDG_Triangle_AD_sansLG_btest_build_vera
Scanning dependencies of target Adjoint2D_HDG_Triangle_AD_sansLG_btest_OBJECT
[ 90%] Building CXX object test/system/Asymptotic/CMakeFiles/Adjoint2D_HDG_Triangle_AD_sansLG_btest_OBJECT.dir/Adjoint2D_HDG_Triangle_AD_sansLG_btest.cpp.o
[ 90%] Built target Adjoint2D_HDG_Triangle_AD_sansLG_btest_OBJECT
Scanning dependencies of target Adjoint2D_HDG_Triangle_AD_sansLG_btest_build
[ 90%] Linking CXX executable Adjoint2D_HDG_Triangle_AD_sansLG_btest
[ 90%] Built target Adjoint2D_HDG_Triangle_AD_sansLG_btest_build
Scanning dependencies of target ErrorEstimateOrder_2D_DGAdvective_Triangle_AD_btest_OBJECT
[ 90%] Building CXX object test/system/Asymptotic/CMakeFiles/ErrorEstimateOrder_2D_DGAdvective_Triangle_AD_btest_OBJECT.dir/ErrorEstimateOrder_2D_DGAdvective_Triangle_AD_btest.cpp.o
[ 90%] Built target ErrorEstimateOrder_2D_DGAdvective_Triangle_AD_btest_OBJECT
Scanning dependencies of target ErrorEstimateOrder_2D_DGAdvective_Triangle_AD_btest_build_vera
[ 90%] Checking style of test/system/Asymptotic/ErrorEstimateOrder_2D_DGAdvective_Triangle_AD_btest.cpp
[ 90%] Built target ErrorEstimateOrder_2D_DGAdvective_Triangle_AD_btest_build_vera
Scanning dependencies of target ErrorEstimateOrder_2D_DGAdvective_Triangle_AD_btest_build
[ 90%] Linking CXX executable ErrorEstimateOrder_2D_DGAdvective_Triangle_AD_btest
[ 90%] Built target ErrorEstimateOrder_2D_DGAdvective_Triangle_AD_btest_build
Scanning dependencies of target ErrorOrder_3D_DGBR2_Tet_AD_btest_OBJECT
[ 90%] Building CXX object test/system/Asymptotic/CMakeFiles/ErrorOrder_3D_DGBR2_Tet_AD_btest_OBJECT.dir/ErrorOrder_3D_DGBR2_Tet_AD_btest.cpp.o
[ 90%] Built target ErrorOrder_3D_DGBR2_Tet_AD_btest_OBJECT
Scanning dependencies of target ErrorOrder_3D_DGBR2_Tet_AD_btest_build_vera
[ 90%] Checking style of test/system/Asymptotic/ErrorOrder_3D_DGBR2_Tet_AD_btest.cpp
[ 90%] Built target ErrorOrder_3D_DGBR2_Tet_AD_btest_build_vera
Scanning dependencies of target ErrorOrder_3D_DGBR2_Tet_AD_btest_build
[ 90%] Linking CXX executable ErrorOrder_3D_DGBR2_Tet_AD_btest
[ 90%] Built target ErrorOrder_3D_DGBR2_Tet_AD_btest_build
Scanning dependencies of target ErrorOrder_3D_CG_Tet_AD_btest_build_vera
[ 90%] Checking style of test/system/Asymptotic/ErrorOrder_3D_CG_Tet_AD_btest.cpp
[ 90%] Built target ErrorOrder_3D_CG_Tet_AD_btest_build_vera
Scanning dependencies of target ErrorOrder_3D_CG_Tet_AD_btest_OBJECT
[ 90%] Building CXX object test/system/Asymptotic/CMakeFiles/ErrorOrder_3D_CG_Tet_AD_btest_OBJECT.dir/ErrorOrder_3D_CG_Tet_AD_btest.cpp.o
[ 90%] Built target ErrorOrder_3D_CG_Tet_AD_btest_OBJECT
Scanning dependencies of target ErrorOrder_3D_CG_Tet_AD_btest_build
[ 90%] Linking CXX executable ErrorOrder_3D_CG_Tet_AD_btest
[ 90%] Built target ErrorOrder_3D_CG_Tet_AD_btest_build
Scanning dependencies of target ErrorOrder_3D_DGBR2_Sphere_Triangle_AD_btest_build_vera
[ 90%] Checking style of test/system/Asymptotic/ErrorOrder_3D_DGBR2_Sphere_Triangle_AD_btest.cpp
[ 90%] Built target ErrorOrder_3D_DGBR2_Sphere_Triangle_AD_btest_build_vera
Scanning dependencies of target ErrorOrder_3D_DGBR2_Sphere_Triangle_AD_btest_OBJECT
[ 90%] Building CXX object test/system/Asymptotic/CMakeFiles/ErrorOrder_3D_DGBR2_Sphere_Triangle_AD_btest_OBJECT.dir/ErrorOrder_3D_DGBR2_Sphere_Triangle_AD_btest.cpp.o
[ 90%] Built target ErrorOrder_3D_DGBR2_Sphere_Triangle_AD_btest_OBJECT
Scanning dependencies of target ErrorOrder_3D_DGBR2_Sphere_Triangle_AD_btest_build
[ 90%] Linking CXX executable ErrorOrder_3D_DGBR2_Sphere_Triangle_AD_btest
[ 90%] Built target ErrorOrder_3D_DGBR2_Sphere_Triangle_AD_btest_build
Scanning dependencies of target ErrorOrder_1D_DGBR2_Burgers_btest_build_vera
[ 90%] Checking style of test/system/Asymptotic/ErrorOrder_1D_DGBR2_Burgers_btest.cpp
[ 90%] Built target ErrorOrder_1D_DGBR2_Burgers_btest_build_vera
Scanning dependencies of target ErrorOrder_1D_DGBR2_Burgers_btest_OBJECT
[ 90%] Building CXX object test/system/Asymptotic/CMakeFiles/ErrorOrder_1D_DGBR2_Burgers_btest_OBJECT.dir/ErrorOrder_1D_DGBR2_Burgers_btest.cpp.o
[ 90%] Built target ErrorOrder_1D_DGBR2_Burgers_btest_OBJECT
Scanning dependencies of target ErrorOrder_1D_DGBR2_Burgers_btest_build
[ 90%] Linking CXX executable ErrorOrder_1D_DGBR2_Burgers_btest
[ 90%] Built target ErrorOrder_1D_DGBR2_Burgers_btest_build
Scanning dependencies of target Solve2D_DGAdvective_LinearRobin_mitLG_sansLG_Consistency_AD_btest_build_vera
[ 90%] Checking style of test/system/Asymptotic/Solve2D_DGAdvective_LinearRobin_mitLG_sansLG_Consistency_AD_btest.cpp
[ 90%] Built target Solve2D_DGAdvective_LinearRobin_mitLG_sansLG_Consistency_AD_btest_build_vera
Scanning dependencies of target Solve2D_DGAdvective_LinearRobin_mitLG_sansLG_Consistency_AD_btest_OBJECT
[ 90%] Building CXX object test/system/Asymptotic/CMakeFiles/Solve2D_DGAdvective_LinearRobin_mitLG_sansLG_Consistency_AD_btest_OBJECT.dir/Solve2D_DGAdvective_LinearRobin_mitLG_sansLG_Consistency_AD_btest.cpp.o
[ 90%] Built target Solve2D_DGAdvective_LinearRobin_mitLG_sansLG_Consistency_AD_btest_OBJECT
Scanning dependencies of target Solve2D_DGAdvective_LinearRobin_mitLG_sansLG_Consistency_AD_btest_build
[ 90%] Linking CXX executable Solve2D_DGAdvective_LinearRobin_mitLG_sansLG_Consistency_AD_btest
[ 90%] Built target Solve2D_DGAdvective_LinearRobin_mitLG_sansLG_Consistency_AD_btest_build
Scanning dependencies of target Adjoint2D_DGAdvective_Triangle_AD_btest_build_vera
[ 90%] Checking style of test/system/Asymptotic/Adjoint2D_DGAdvective_Triangle_AD_btest.cpp
[ 90%] Built target Adjoint2D_DGAdvective_Triangle_AD_btest_build_vera
Scanning dependencies of target Adjoint2D_DGAdvective_Triangle_AD_btest_OBJECT
[ 90%] Building CXX object test/system/Asymptotic/CMakeFiles/Adjoint2D_DGAdvective_Triangle_AD_btest_OBJECT.dir/Adjoint2D_DGAdvective_Triangle_AD_btest.cpp.o
[ 90%] Built target Adjoint2D_DGAdvective_Triangle_AD_btest_OBJECT
Scanning dependencies of target Adjoint2D_DGAdvective_Triangle_AD_btest_build
[ 90%] Linking CXX executable Adjoint2D_DGAdvective_Triangle_AD_btest
[ 90%] Built target Adjoint2D_DGAdvective_Triangle_AD_btest_build
Scanning dependencies of target ErrorOrder_4D_DG_Pentatope_btest_OBJECT
[ 90%] Building CXX object test/system/Asymptotic/CMakeFiles/ErrorOrder_4D_DG_Pentatope_btest_OBJECT.dir/ErrorOrder_4D_DG_Pentatope_btest.cpp.o
[ 90%] Built target ErrorOrder_4D_DG_Pentatope_btest_OBJECT
Scanning dependencies of target ErrorOrder_4D_DG_Pentatope_btest_build_vera
[ 90%] Checking style of test/system/Asymptotic/ErrorOrder_4D_DG_Pentatope_btest.cpp
[ 90%] Built target ErrorOrder_4D_DG_Pentatope_btest_build_vera
Scanning dependencies of target ErrorOrder_4D_DG_Pentatope_btest_build
[ 90%] Linking CXX executable ErrorOrder_4D_DG_Pentatope_btest
[ 90%] Built target ErrorOrder_4D_DG_Pentatope_btest_build
Scanning dependencies of target ErrorOrder_2D_EDG_Triangle_AD_btest_OBJECT
[ 90%] Building CXX object test/system/Asymptotic/CMakeFiles/ErrorOrder_2D_EDG_Triangle_AD_btest_OBJECT.dir/ErrorOrder_2D_EDG_Triangle_AD_btest.cpp.o
[ 90%] Built target ErrorOrder_2D_EDG_Triangle_AD_btest_OBJECT
Scanning dependencies of target ErrorOrder_2D_EDG_Triangle_AD_btest_build_vera
[ 90%] Checking style of test/system/Asymptotic/ErrorOrder_2D_EDG_Triangle_AD_btest.cpp
[ 90%] Built target ErrorOrder_2D_EDG_Triangle_AD_btest_build_vera
Scanning dependencies of target ErrorOrder_2D_EDG_Triangle_AD_btest_build
[ 90%] Linking CXX executable ErrorOrder_2D_EDG_Triangle_AD_btest
[ 90%] Built target ErrorOrder_2D_EDG_Triangle_AD_btest_build
Scanning dependencies of target ErrorEstimateOrder_1D_CG_Line_AD_btest_OBJECT
[ 90%] Building CXX object test/system/Asymptotic/CMakeFiles/ErrorEstimateOrder_1D_CG_Line_AD_btest_OBJECT.dir/ErrorEstimateOrder_1D_CG_Line_AD_btest.cpp.o
[ 90%] Built target ErrorEstimateOrder_1D_CG_Line_AD_btest_OBJECT
Scanning dependencies of target ErrorEstimateOrder_1D_CG_Line_AD_btest_build_vera
[ 90%] Checking style of test/system/Asymptotic/ErrorEstimateOrder_1D_CG_Line_AD_btest.cpp
[ 90%] Built target ErrorEstimateOrder_1D_CG_Line_AD_btest_build_vera
Scanning dependencies of target ErrorEstimateOrder_1D_CG_Line_AD_btest_build
[ 90%] Linking CXX executable ErrorEstimateOrder_1D_CG_Line_AD_btest
[ 90%] Built target ErrorEstimateOrder_1D_CG_Line_AD_btest_build
Scanning dependencies of target ErrorEstimateOrder_2D_HDG_Triangle_AD_btest_build_vera
[ 90%] Checking style of test/system/Asymptotic/ErrorEstimateOrder_2D_HDG_Triangle_AD_btest.cpp
[ 90%] Built target ErrorEstimateOrder_2D_HDG_Triangle_AD_btest_build_vera
Scanning dependencies of target ErrorEstimateOrder_2D_HDG_Triangle_AD_btest_OBJECT
[ 90%] Building CXX object test/system/Asymptotic/CMakeFiles/ErrorEstimateOrder_2D_HDG_Triangle_AD_btest_OBJECT.dir/ErrorEstimateOrder_2D_HDG_Triangle_AD_btest.cpp.o
[ 90%] Built target ErrorEstimateOrder_2D_HDG_Triangle_AD_btest_OBJECT
Scanning dependencies of target ErrorEstimateOrder_2D_HDG_Triangle_AD_btest_build
[ 90%] Linking CXX executable ErrorEstimateOrder_2D_HDG_Triangle_AD_btest
[ 90%] Built target ErrorEstimateOrder_2D_HDG_Triangle_AD_btest_build
Scanning dependencies of target ErrorOrder_1D_HDG_Burgers_btest_OBJECT
[ 90%] Building CXX object test/system/Asymptotic/CMakeFiles/ErrorOrder_1D_HDG_Burgers_btest_OBJECT.dir/ErrorOrder_1D_HDG_Burgers_btest.cpp.o
[ 90%] Built target ErrorOrder_1D_HDG_Burgers_btest_OBJECT
Scanning dependencies of target ErrorOrder_1D_HDG_Burgers_btest_build_vera
[ 90%] Checking style of test/system/Asymptotic/ErrorOrder_1D_HDG_Burgers_btest.cpp
[ 90%] Built target ErrorOrder_1D_HDG_Burgers_btest_build_vera
Scanning dependencies of target ErrorOrder_1D_HDG_Burgers_btest_build
[ 90%] Linking CXX executable ErrorOrder_1D_HDG_Burgers_btest
[ 90%] Built target ErrorOrder_1D_HDG_Burgers_btest_build
Scanning dependencies of target ErrorOrder_1D_DGBR2_TwoPhase_ST_btest_build_vera
[ 90%] Checking style of test/system/Asymptotic/ErrorOrder_1D_DGBR2_TwoPhase_ST_btest.cpp
[ 90%] Built target ErrorOrder_1D_DGBR2_TwoPhase_ST_btest_build_vera
Scanning dependencies of target ErrorOrder_1D_DGBR2_TwoPhase_ST_btest_OBJECT
[ 90%] Building CXX object test/system/Asymptotic/CMakeFiles/ErrorOrder_1D_DGBR2_TwoPhase_ST_btest_OBJECT.dir/ErrorOrder_1D_DGBR2_TwoPhase_ST_btest.cpp.o
[ 90%] Built target ErrorOrder_1D_DGBR2_TwoPhase_ST_btest_OBJECT
Scanning dependencies of target ErrorOrder_1D_DGBR2_TwoPhase_ST_btest_build
[ 90%] Linking CXX executable ErrorOrder_1D_DGBR2_TwoPhase_ST_btest
[ 90%] Built target ErrorOrder_1D_DGBR2_TwoPhase_ST_btest_build
Scanning dependencies of target Adjoint1D_DGBR2_BuckleyLeverett_ST_btest_build_vera
[ 90%] Checking style of test/system/Asymptotic/Adjoint1D_DGBR2_BuckleyLeverett_ST_btest.cpp
[ 90%] Built target Adjoint1D_DGBR2_BuckleyLeverett_ST_btest_build_vera
Scanning dependencies of target Adjoint1D_DGBR2_BuckleyLeverett_ST_btest_OBJECT
[ 90%] Building CXX object test/system/Asymptotic/CMakeFiles/Adjoint1D_DGBR2_BuckleyLeverett_ST_btest_OBJECT.dir/Adjoint1D_DGBR2_BuckleyLeverett_ST_btest.cpp.o
[ 90%] Built target Adjoint1D_DGBR2_BuckleyLeverett_ST_btest_OBJECT
Scanning dependencies of target Adjoint1D_DGBR2_BuckleyLeverett_ST_btest_build
[ 90%] Linking CXX executable Adjoint1D_DGBR2_BuckleyLeverett_ST_btest
[ 90%] Built target Adjoint1D_DGBR2_BuckleyLeverett_ST_btest_build
Scanning dependencies of target ErrorOrder_3D_CG_Sphere_Triangle_AD_btest_build_vera
[ 90%] Checking style of test/system/Asymptotic/ErrorOrder_3D_CG_Sphere_Triangle_AD_btest.cpp
[ 90%] Built target ErrorOrder_3D_CG_Sphere_Triangle_AD_btest_build_vera
Scanning dependencies of target ErrorOrder_3D_CG_Sphere_Triangle_AD_btest_OBJECT
[ 90%] Building CXX object test/system/Asymptotic/CMakeFiles/ErrorOrder_3D_CG_Sphere_Triangle_AD_btest_OBJECT.dir/ErrorOrder_3D_CG_Sphere_Triangle_AD_btest.cpp.o
[ 90%] Built target ErrorOrder_3D_CG_Sphere_Triangle_AD_btest_OBJECT
Scanning dependencies of target ErrorOrder_3D_CG_Sphere_Triangle_AD_btest_build
[ 90%] Linking CXX executable ErrorOrder_3D_CG_Sphere_Triangle_AD_btest
[ 90%] Built target ErrorOrder_3D_CG_Sphere_Triangle_AD_btest_build
Scanning dependencies of target ErrorOrder_1D_HDG_AD_btest_build_vera
[ 90%] Checking style of test/system/Asymptotic/ErrorOrder_1D_HDG_AD_btest.cpp
[ 90%] Built target ErrorOrder_1D_HDG_AD_btest_build_vera
Scanning dependencies of target ErrorOrder_1D_HDG_AD_btest_OBJECT
[ 90%] Building CXX object test/system/Asymptotic/CMakeFiles/ErrorOrder_1D_HDG_AD_btest_OBJECT.dir/ErrorOrder_1D_HDG_AD_btest.cpp.o
[ 90%] Built target ErrorOrder_1D_HDG_AD_btest_OBJECT
Scanning dependencies of target ErrorOrder_1D_HDG_AD_btest_build
[ 90%] Linking CXX executable ErrorOrder_1D_HDG_AD_btest
[ 90%] Built target ErrorOrder_1D_HDG_AD_btest_build
Scanning dependencies of target ErrorOrder_1D_HDG_AD_BDF_btest_build_vera
[ 90%] Checking style of test/system/Asymptotic/ErrorOrder_1D_HDG_AD_BDF_btest.cpp
[ 90%] Built target ErrorOrder_1D_HDG_AD_BDF_btest_build_vera
Scanning dependencies of target ErrorOrder_1D_HDG_AD_BDF_btest_OBJECT
[ 90%] Building CXX object test/system/Asymptotic/CMakeFiles/ErrorOrder_1D_HDG_AD_BDF_btest_OBJECT.dir/ErrorOrder_1D_HDG_AD_BDF_btest.cpp.o
[ 90%] Built target ErrorOrder_1D_HDG_AD_BDF_btest_OBJECT
Scanning dependencies of target ErrorOrder_1D_HDG_AD_BDF_btest_build
[ 90%] Linking CXX executable ErrorOrder_1D_HDG_AD_BDF_btest
[ 90%] Built target ErrorOrder_1D_HDG_AD_BDF_btest_build
Scanning dependencies of target ErrorOrder_1D_DGBR2_AD_BDF_btest_build_vera
[ 90%] Checking style of test/system/Asymptotic/ErrorOrder_1D_DGBR2_AD_BDF_btest.cpp
[ 90%] Built target ErrorOrder_1D_DGBR2_AD_BDF_btest_build_vera
Scanning dependencies of target ErrorOrder_1D_DGBR2_AD_BDF_btest_OBJECT
[ 90%] Building CXX object test/system/Asymptotic/CMakeFiles/ErrorOrder_1D_DGBR2_AD_BDF_btest_OBJECT.dir/ErrorOrder_1D_DGBR2_AD_BDF_btest.cpp.o
[ 90%] Built target ErrorOrder_1D_DGBR2_AD_BDF_btest_OBJECT
Scanning dependencies of target ErrorOrder_1D_DGBR2_AD_BDF_btest_build
[ 90%] Linking CXX executable ErrorOrder_1D_DGBR2_AD_BDF_btest
[ 90%] Built target ErrorOrder_1D_DGBR2_AD_BDF_btest_build
Scanning dependencies of target ErrorOrder_1D_HDGAdvective_Advection_btest_build_vera
[ 90%] Checking style of test/system/Asymptotic/ErrorOrder_1D_HDGAdvective_Advection_btest.cpp
[ 90%] Built target ErrorOrder_1D_HDGAdvective_Advection_btest_build_vera
Scanning dependencies of target ErrorOrder_1D_HDGAdvective_Advection_btest_OBJECT
[ 90%] Building CXX object test/system/Asymptotic/CMakeFiles/ErrorOrder_1D_HDGAdvective_Advection_btest_OBJECT.dir/ErrorOrder_1D_HDGAdvective_Advection_btest.cpp.o
[ 90%] Built target ErrorOrder_1D_HDGAdvective_Advection_btest_OBJECT
Scanning dependencies of target ErrorOrder_1D_HDGAdvective_Advection_btest_build
[ 90%] Linking CXX executable ErrorOrder_1D_HDGAdvective_Advection_btest
[ 90%] Built target ErrorOrder_1D_HDGAdvective_Advection_btest_build
Scanning dependencies of target ErrorEstimateOrder_2D_CG_Triangle_AD_btest_OBJECT
[ 90%] Building CXX object test/system/Asymptotic/CMakeFiles/ErrorEstimateOrder_2D_CG_Triangle_AD_btest_OBJECT.dir/ErrorEstimateOrder_2D_CG_Triangle_AD_btest.cpp.o
[ 90%] Built target ErrorEstimateOrder_2D_CG_Triangle_AD_btest_OBJECT
Scanning dependencies of target ErrorEstimateOrder_2D_CG_Triangle_AD_btest_build_vera
[ 90%] Checking style of test/system/Asymptotic/ErrorEstimateOrder_2D_CG_Triangle_AD_btest.cpp
[ 90%] Built target ErrorEstimateOrder_2D_CG_Triangle_AD_btest_build_vera
Scanning dependencies of target ErrorEstimateOrder_2D_CG_Triangle_AD_btest_build
[ 90%] Linking CXX executable ErrorEstimateOrder_2D_CG_Triangle_AD_btest
[ 90%] Built target ErrorEstimateOrder_2D_CG_Triangle_AD_btest_build
Scanning dependencies of target ErrorOrder_1D_CG_AD_BDF_btest_OBJECT
[ 90%] Building CXX object test/system/Asymptotic/CMakeFiles/ErrorOrder_1D_CG_AD_BDF_btest_OBJECT.dir/ErrorOrder_1D_CG_AD_BDF_btest.cpp.o
[ 90%] Built target ErrorOrder_1D_CG_AD_BDF_btest_OBJECT
Scanning dependencies of target ErrorOrder_1D_CG_AD_BDF_btest_build_vera
[ 90%] Checking style of test/system/Asymptotic/ErrorOrder_1D_CG_AD_BDF_btest.cpp
[ 90%] Built target ErrorOrder_1D_CG_AD_BDF_btest_build_vera
Scanning dependencies of target ErrorOrder_1D_CG_AD_BDF_btest_build
[ 90%] Linking CXX executable ErrorOrder_1D_CG_AD_BDF_btest
[ 90%] Built target ErrorOrder_1D_CG_AD_BDF_btest_build
Scanning dependencies of target ErrorEstimateOrder_1D_DGBR2_Line_AD_btest_build_vera
[ 90%] Checking style of test/system/Asymptotic/ErrorEstimateOrder_1D_DGBR2_Line_AD_btest.cpp
[ 90%] Built target ErrorEstimateOrder_1D_DGBR2_Line_AD_btest_build_vera
Scanning dependencies of target ErrorEstimateOrder_1D_DGBR2_Line_AD_btest_OBJECT
[ 90%] Building CXX object test/system/Asymptotic/CMakeFiles/ErrorEstimateOrder_1D_DGBR2_Line_AD_btest_OBJECT.dir/ErrorEstimateOrder_1D_DGBR2_Line_AD_btest.cpp.o
[ 90%] Built target ErrorEstimateOrder_1D_DGBR2_Line_AD_btest_OBJECT
Scanning dependencies of target ErrorEstimateOrder_1D_DGBR2_Line_AD_btest_build
[ 90%] Linking CXX executable ErrorEstimateOrder_1D_DGBR2_Line_AD_btest
[ 90%] Built target ErrorEstimateOrder_1D_DGBR2_Line_AD_btest_build
Scanning dependencies of target ErrorOrder_3D_CG_Hex_AD_btest_OBJECT
[ 90%] Building CXX object test/system/Asymptotic/CMakeFiles/ErrorOrder_3D_CG_Hex_AD_btest_OBJECT.dir/ErrorOrder_3D_CG_Hex_AD_btest.cpp.o
[ 90%] Built target ErrorOrder_3D_CG_Hex_AD_btest_OBJECT
Scanning dependencies of target ErrorOrder_3D_CG_Hex_AD_btest_build_vera
[ 90%] Checking style of test/system/Asymptotic/ErrorOrder_3D_CG_Hex_AD_btest.cpp
[ 90%] Built target ErrorOrder_3D_CG_Hex_AD_btest_build_vera
Scanning dependencies of target ErrorOrder_3D_CG_Hex_AD_btest_build
[ 90%] Linking CXX executable ErrorOrder_3D_CG_Hex_AD_btest
[ 90%] Built target ErrorOrder_3D_CG_Hex_AD_btest_build
Scanning dependencies of target ErrorEstimateOrder_2D_CG_Nodal_Triangle_AD_btest_OBJECT
[ 90%] Building CXX object test/system/Asymptotic/CMakeFiles/ErrorEstimateOrder_2D_CG_Nodal_Triangle_AD_btest_OBJECT.dir/ErrorEstimateOrder_2D_CG_Nodal_Triangle_AD_btest.cpp.o
[ 90%] Built target ErrorEstimateOrder_2D_CG_Nodal_Triangle_AD_btest_OBJECT
Scanning dependencies of target ErrorEstimateOrder_2D_CG_Nodal_Triangle_AD_btest_build_vera
[ 90%] Checking style of test/system/Asymptotic/ErrorEstimateOrder_2D_CG_Nodal_Triangle_AD_btest.cpp
[ 90%] Built target ErrorEstimateOrder_2D_CG_Nodal_Triangle_AD_btest_build_vera
Scanning dependencies of target ErrorEstimateOrder_2D_CG_Nodal_Triangle_AD_btest_build
[ 90%] Linking CXX executable ErrorEstimateOrder_2D_CG_Nodal_Triangle_AD_btest
[ 90%] Built target ErrorEstimateOrder_2D_CG_Nodal_Triangle_AD_btest_build
Scanning dependencies of target ErrorOrder_2D_DGAdvective_Flat_Line_AD_btest_OBJECT
[ 90%] Building CXX object test/system/Asymptotic/CMakeFiles/ErrorOrder_2D_DGAdvective_Flat_Line_AD_btest_OBJECT.dir/ErrorOrder_2D_DGAdvective_Flat_Line_AD_btest.cpp.o
[ 90%] Built target ErrorOrder_2D_DGAdvective_Flat_Line_AD_btest_OBJECT
Scanning dependencies of target ErrorOrder_2D_DGAdvective_Flat_Line_AD_btest_build_vera
[ 90%] Checking style of test/system/Asymptotic/ErrorOrder_2D_DGAdvective_Flat_Line_AD_btest.cpp
[ 90%] Built target ErrorOrder_2D_DGAdvective_Flat_Line_AD_btest_build_vera
Scanning dependencies of target ErrorOrder_2D_DGAdvective_Flat_Line_AD_btest_build
[ 90%] Linking CXX executable ErrorOrder_2D_DGAdvective_Flat_Line_AD_btest
[ 90%] Built target ErrorOrder_2D_DGAdvective_Flat_Line_AD_btest_build
Scanning dependencies of target ErrorOrder_1D_DGBR2_AD_btest_OBJECT
[ 90%] Building CXX object test/system/Asymptotic/CMakeFiles/ErrorOrder_1D_DGBR2_AD_btest_OBJECT.dir/ErrorOrder_1D_DGBR2_AD_btest.cpp.o
[ 90%] Built target ErrorOrder_1D_DGBR2_AD_btest_OBJECT
Scanning dependencies of target ErrorOrder_1D_DGBR2_AD_btest_build_vera
[ 90%] Checking style of test/system/Asymptotic/ErrorOrder_1D_DGBR2_AD_btest.cpp
[ 90%] Built target ErrorOrder_1D_DGBR2_AD_btest_build_vera
Scanning dependencies of target ErrorOrder_1D_DGBR2_AD_btest_build
[ 90%] Linking CXX executable ErrorOrder_1D_DGBR2_AD_btest
[ 90%] Built target ErrorOrder_1D_DGBR2_AD_btest_build
Scanning dependencies of target ErrorOrder_2D_HDG_Triangle_AD_btest_build_vera
[ 90%] Checking style of test/system/Asymptotic/ErrorOrder_2D_HDG_Triangle_AD_btest.cpp
[ 90%] Built target ErrorOrder_2D_HDG_Triangle_AD_btest_build_vera
Scanning dependencies of target ErrorOrder_2D_HDG_Triangle_AD_btest_OBJECT
[ 90%] Building CXX object test/system/Asymptotic/CMakeFiles/ErrorOrder_2D_HDG_Triangle_AD_btest_OBJECT.dir/ErrorOrder_2D_HDG_Triangle_AD_btest.cpp.o
[ 90%] Built target ErrorOrder_2D_HDG_Triangle_AD_btest_OBJECT
Scanning dependencies of target ErrorOrder_2D_HDG_Triangle_AD_btest_build
[ 90%] Linking CXX executable ErrorOrder_2D_HDG_Triangle_AD_btest
[ 90%] Built target ErrorOrder_2D_HDG_Triangle_AD_btest_build
Scanning dependencies of target ErrorOrder_2D_DGAdvective_Annulus_Triangle_btest_OBJECT
[ 90%] Building CXX object test/system/Asymptotic/CMakeFiles/ErrorOrder_2D_DGAdvective_Annulus_Triangle_btest_OBJECT.dir/ErrorOrder_2D_DGAdvective_Annulus_Triangle_btest.cpp.o
[ 90%] Built target ErrorOrder_2D_DGAdvective_Annulus_Triangle_btest_OBJECT
Scanning dependencies of target ErrorOrder_2D_DGAdvective_Annulus_Triangle_btest_build_vera
[ 90%] Checking style of test/system/Asymptotic/ErrorOrder_2D_DGAdvective_Annulus_Triangle_btest.cpp
[ 90%] Built target ErrorOrder_2D_DGAdvective_Annulus_Triangle_btest_build_vera
Scanning dependencies of target ErrorOrder_2D_DGAdvective_Annulus_Triangle_btest_build
[ 90%] Linking CXX executable ErrorOrder_2D_DGAdvective_Annulus_Triangle_btest
[ 90%] Built target ErrorOrder_2D_DGAdvective_Annulus_Triangle_btest_build
Scanning dependencies of target ErrorOrder_2D_DGAdvective_Circle_Line_AD_btest_OBJECT
[ 90%] Building CXX object test/system/Asymptotic/CMakeFiles/ErrorOrder_2D_DGAdvective_Circle_Line_AD_btest_OBJECT.dir/ErrorOrder_2D_DGAdvective_Circle_Line_AD_btest.cpp.o
[ 90%] Built target ErrorOrder_2D_DGAdvective_Circle_Line_AD_btest_OBJECT
Scanning dependencies of target ErrorOrder_2D_DGAdvective_Circle_Line_AD_btest_build_vera
[ 90%] Checking style of test/system/Asymptotic/ErrorOrder_2D_DGAdvective_Circle_Line_AD_btest.cpp
[ 90%] Built target ErrorOrder_2D_DGAdvective_Circle_Line_AD_btest_build_vera
Scanning dependencies of target ErrorOrder_2D_DGAdvective_Circle_Line_AD_btest_build
[ 90%] Linking CXX executable ErrorOrder_2D_DGAdvective_Circle_Line_AD_btest
[ 90%] Built target ErrorOrder_2D_DGAdvective_Circle_Line_AD_btest_build
Scanning dependencies of target ErrorEstimateOrder_2D_CG_Triangle_RD_btest_OBJECT
[ 90%] Building CXX object test/system/Asymptotic/CMakeFiles/ErrorEstimateOrder_2D_CG_Triangle_RD_btest_OBJECT.dir/ErrorEstimateOrder_2D_CG_Triangle_RD_btest.cpp.o
[ 90%] Built target ErrorEstimateOrder_2D_CG_Triangle_RD_btest_OBJECT
Scanning dependencies of target ErrorEstimateOrder_2D_CG_Triangle_RD_btest_build_vera
[ 90%] Checking style of test/system/Asymptotic/ErrorEstimateOrder_2D_CG_Triangle_RD_btest.cpp
[ 90%] Built target ErrorEstimateOrder_2D_CG_Triangle_RD_btest_build_vera
Scanning dependencies of target ErrorEstimateOrder_2D_CG_Triangle_RD_btest_build
[ 90%] Linking CXX executable ErrorEstimateOrder_2D_CG_Triangle_RD_btest
[ 90%] Built target ErrorEstimateOrder_2D_CG_Triangle_RD_btest_build
Scanning dependencies of target ErrorOrder_2D_CG_Triangle_AD_btest_OBJECT
[ 90%] Building CXX object test/system/Asymptotic/CMakeFiles/ErrorOrder_2D_CG_Triangle_AD_btest_OBJECT.dir/ErrorOrder_2D_CG_Triangle_AD_btest.cpp.o
[ 90%] Built target ErrorOrder_2D_CG_Triangle_AD_btest_OBJECT
Scanning dependencies of target ErrorOrder_2D_CG_Triangle_AD_btest_build_vera
[ 90%] Checking style of test/system/Asymptotic/ErrorOrder_2D_CG_Triangle_AD_btest.cpp
[ 90%] Built target ErrorOrder_2D_CG_Triangle_AD_btest_build_vera
Scanning dependencies of target ErrorOrder_2D_CG_Triangle_AD_btest_build
[ 90%] Linking CXX executable ErrorOrder_2D_CG_Triangle_AD_btest
[ 90%] Built target ErrorOrder_2D_CG_Triangle_AD_btest_build
Scanning dependencies of target ErrorOrder_1D_DGBR2_BuckleyLeverett_ST_btest_build_vera
[ 90%] Checking style of test/system/Asymptotic/ErrorOrder_1D_DGBR2_BuckleyLeverett_ST_btest.cpp
[ 90%] Built target ErrorOrder_1D_DGBR2_BuckleyLeverett_ST_btest_build_vera
Scanning dependencies of target ErrorOrder_1D_DGBR2_BuckleyLeverett_ST_btest_OBJECT
[ 90%] Building CXX object test/system/Asymptotic/CMakeFiles/ErrorOrder_1D_DGBR2_BuckleyLeverett_ST_btest_OBJECT.dir/ErrorOrder_1D_DGBR2_BuckleyLeverett_ST_btest.cpp.o
[ 90%] Built target ErrorOrder_1D_DGBR2_BuckleyLeverett_ST_btest_OBJECT
Scanning dependencies of target ErrorOrder_1D_DGBR2_BuckleyLeverett_ST_btest_build
[ 90%] Linking CXX executable ErrorOrder_1D_DGBR2_BuckleyLeverett_ST_btest
[ 90%] Built target ErrorOrder_1D_DGBR2_BuckleyLeverett_ST_btest_build
Scanning dependencies of target ErrorOrder_2D_CG_Quad_AD_btest_build_vera
[ 90%] Checking style of test/system/Asymptotic/ErrorOrder_2D_CG_Quad_AD_btest.cpp
[ 90%] Built target ErrorOrder_2D_CG_Quad_AD_btest_build_vera
Scanning dependencies of target ErrorOrder_2D_CG_Quad_AD_btest_OBJECT
[ 90%] Building CXX object test/system/Asymptotic/CMakeFiles/ErrorOrder_2D_CG_Quad_AD_btest_OBJECT.dir/ErrorOrder_2D_CG_Quad_AD_btest.cpp.o
[ 90%] Built target ErrorOrder_2D_CG_Quad_AD_btest_OBJECT
Scanning dependencies of target ErrorOrder_2D_CG_Quad_AD_btest_build
[ 90%] Linking CXX executable ErrorOrder_2D_CG_Quad_AD_btest
[ 90%] Built target ErrorOrder_2D_CG_Quad_AD_btest_build
Scanning dependencies of target ErrorEstimateOrder_2D_DGBR2_Triangle_AD_btest_OBJECT
[ 90%] Building CXX object test/system/Asymptotic/CMakeFiles/ErrorEstimateOrder_2D_DGBR2_Triangle_AD_btest_OBJECT.dir/ErrorEstimateOrder_2D_DGBR2_Triangle_AD_btest.cpp.o
[ 90%] Built target ErrorEstimateOrder_2D_DGBR2_Triangle_AD_btest_OBJECT
Scanning dependencies of target ErrorEstimateOrder_2D_DGBR2_Triangle_AD_btest_build_vera
[ 90%] Checking style of test/system/Asymptotic/ErrorEstimateOrder_2D_DGBR2_Triangle_AD_btest.cpp
[ 90%] Built target ErrorEstimateOrder_2D_DGBR2_Triangle_AD_btest_build_vera
Scanning dependencies of target ErrorEstimateOrder_2D_DGBR2_Triangle_AD_btest_build
[ 90%] Linking CXX executable ErrorEstimateOrder_2D_DGBR2_Triangle_AD_btest
[ 90%] Built target ErrorEstimateOrder_2D_DGBR2_Triangle_AD_btest_build
Scanning dependencies of target ErrorOrder_2D_DGAdvective_Circle_Line_ShallowWater_btest_build_vera
[ 90%] Checking style of test/system/Asymptotic/ErrorOrder_2D_DGAdvective_Circle_Line_ShallowWater_btest.cpp
[ 90%] Built target ErrorOrder_2D_DGAdvective_Circle_Line_ShallowWater_btest_build_vera
Scanning dependencies of target ErrorOrder_2D_DGAdvective_Circle_Line_ShallowWater_btest_OBJECT
[ 90%] Building CXX object test/system/Asymptotic/CMakeFiles/ErrorOrder_2D_DGAdvective_Circle_Line_ShallowWater_btest_OBJECT.dir/ErrorOrder_2D_DGAdvective_Circle_Line_ShallowWater_btest.cpp.o
[ 90%] Built target ErrorOrder_2D_DGAdvective_Circle_Line_ShallowWater_btest_OBJECT
Scanning dependencies of target ErrorOrder_2D_DGAdvective_Circle_Line_ShallowWater_btest_build
[ 90%] Linking CXX executable ErrorOrder_2D_DGAdvective_Circle_Line_ShallowWater_btest
[ 90%] Built target ErrorOrder_2D_DGAdvective_Circle_Line_ShallowWater_btest_build
Scanning dependencies of target ErrorOrder_1D_DGAdvective_ShallowWater_btest_OBJECT
[ 90%] Building CXX object test/system/Asymptotic/CMakeFiles/ErrorOrder_1D_DGAdvective_ShallowWater_btest_OBJECT.dir/ErrorOrder_1D_DGAdvective_ShallowWater_btest.cpp.o
[ 90%] Built target ErrorOrder_1D_DGAdvective_ShallowWater_btest_OBJECT
Scanning dependencies of target ErrorOrder_1D_DGAdvective_ShallowWater_btest_build_vera
[ 90%] Checking style of test/system/Asymptotic/ErrorOrder_1D_DGAdvective_ShallowWater_btest.cpp
[ 90%] Built target ErrorOrder_1D_DGAdvective_ShallowWater_btest_build_vera
Scanning dependencies of target ErrorOrder_1D_DGAdvective_ShallowWater_btest_build
[ 90%] Linking CXX executable ErrorOrder_1D_DGAdvective_ShallowWater_btest
[ 90%] Built target ErrorOrder_1D_DGAdvective_ShallowWater_btest_build
Scanning dependencies of target LocalSolve1D_HDG_AD_btest_build_vera
[ 90%] Checking style of test/system/LocalSolve/LocalSolve1D_HDG_AD_btest.cpp
[ 90%] Built target LocalSolve1D_HDG_AD_btest_build_vera
Scanning dependencies of target BlockLib
[ 90%] Building CXX object src/Discretization/CMakeFiles/BlockLib.dir/Block/AlgebraicEquationSet_Block2x2_Real_Real.cpp.o
[ 90%] Building CXX object src/Discretization/CMakeFiles/BlockLib.dir/Block/AlgebraicEquationSet_Block2x2_VecS3_Real.cpp.o
[ 90%] Building CXX object src/Discretization/CMakeFiles/BlockLib.dir/Block/AlgebraicEquationSet_Block2x2_VecS4_Real.cpp.o
[ 90%] Linking CXX static library libBlockLib.a
[ 90%] Built target BlockLib
Scanning dependencies of target BlockLinAlgLib_vera
[ 90%] Checking style of src/LinearAlgebra/BlockLinAlg/MatrixBlock_3x3.h
[ 90%] Checking style of src/LinearAlgebra/BlockLinAlg/MatrixBlock_2x2.h
[ 90%] Checking style of src/LinearAlgebra/BlockLinAlg/MatrixBlock_2x2_InverseLU.h
[ 90%] Checking style of src/LinearAlgebra/BlockLinAlg/MatrixBlock_2x2_Inverse.h
[ 90%] Checking style of src/LinearAlgebra/BlockLinAlg/BlockLinAlg_Type.h
[ 90%] Checking style of src/LinearAlgebra/BlockLinAlg/MatrixBlock_2x2_Decompose_LU.h
[ 90%] Checking style of src/LinearAlgebra/BlockLinAlg/VectorBlock_4.h
[ 90%] Checking style of src/LinearAlgebra/BlockLinAlg/MatrixBlock_2x2_Transpose.h
[ 90%] Checking style of src/LinearAlgebra/BlockLinAlg/MatrixBlock_2x2_InverseLUP.h
[ 90%] Checking style of src/LinearAlgebra/BlockLinAlg/MatrixBlock_4x4.h
[ 90%] Checking style of src/LinearAlgebra/BlockLinAlg/BlockLinAlg_Add.h
[ 90%] Checking style of src/LinearAlgebra/BlockLinAlg/BlockLinAlg_Mul.h
[ 90%] Checking style of src/LinearAlgebra/BlockLinAlg/MatrixBlock_2x2_Decompose_LUP.h
[ 90%] Checking style of src/LinearAlgebra/BlockLinAlg/VectorBlock_3.h
[ 90%] Checking style of src/LinearAlgebra/BlockLinAlg/VectorBlock_2.h
[ 90%] Checking style of src/LinearAlgebra/BlockLinAlg/MatrixBlock_2x2_InverseLUP.cpp
[ 90%] Checking style of src/LinearAlgebra/BlockLinAlg/MatrixBlock_2x2_Decompose_LUP.cpp
[ 90%] Checking style of src/LinearAlgebra/BlockLinAlg/MatrixBlock_2x2_Decompose_LU.cpp
[ 90%] Checking style of src/LinearAlgebra/BlockLinAlg/MatrixBlock_2x2_InverseLU.cpp
[ 90%] Built target BlockLinAlgLib_vera
Scanning dependencies of target BlockLinAlgLib
[ 90%] Building CXX object src/LinearAlgebra/BlockLinAlg/CMakeFiles/BlockLinAlgLib.dir/MatrixBlock_2x2_Decompose_LU.cpp.o
[ 90%] Building CXX object src/LinearAlgebra/BlockLinAlg/CMakeFiles/BlockLinAlgLib.dir/MatrixBlock_2x2_Decompose_LUP.cpp.o
[ 90%] Building CXX object src/LinearAlgebra/BlockLinAlg/CMakeFiles/BlockLinAlgLib.dir/MatrixBlock_2x2_InverseLU.cpp.o
[ 90%] Building CXX object src/LinearAlgebra/BlockLinAlg/CMakeFiles/BlockLinAlgLib.dir/MatrixBlock_2x2_InverseLUP.cpp.o
[ 90%] Linking CXX static library libBlockLinAlgLib.a
[ 90%] Built target BlockLinAlgLib
Scanning dependencies of target pdeSensorLib_vera
[ 90%] Checking style of src/pde/Sensor/Sensor_ViscousFlux1D.h
[ 90%] Checking style of src/pde/Sensor/Source1D_JumpSensor.h
[ 90%] Checking style of src/pde/Sensor/BCSensorParameter2D.h
[ 90%] Checking style of src/pde/Sensor/Sensor_Source1D.h
[ 90%] Checking style of src/pde/Sensor/Source2D_JumpSensor.h
[ 90%] Checking style of src/pde/Sensor/Sensor_Source2D.h
[ 90%] Checking style of src/pde/Sensor/PDESensorParameter2D.h
[ 90%] Checking style of src/pde/Sensor/Sensor_AdvectiveFlux2D.h
[ 90%] Checking style of src/pde/Sensor/Sensor_ViscousFlux2D.h
[ 90%] Checking style of src/pde/Sensor/BCSensorParameter1D.h
[ 90%] Checking style of src/pde/Sensor/SensorParameter_Traits.h
[ 90%] Checking style of src/pde/Sensor/PDESensorParameter1D.h
[ 90%] Checking style of src/pde/Sensor/Sensor_AdvectiveFlux1D.h
[ 90%] Checking style of src/pde/Sensor/Sensor_ViscousFlux1D.cpp
[ 90%] Checking style of src/pde/Sensor/Sensor_ViscousFlux2D.cpp
[ 90%] Checking style of src/pde/Sensor/Sensor_AdvectiveFlux1D.cpp
[ 90%] Checking style of src/pde/Sensor/PDESensorParameter1D.cpp
[ 90%] Checking style of src/pde/Sensor/Sensor_AdvectiveFlux2D.cpp
[ 90%] Checking style of src/pde/Sensor/BCSensorParameter2D.cpp
[ 90%] Checking style of src/pde/Sensor/BCSensorParameter1D.cpp
[ 90%] Checking style of src/pde/Sensor/PDESensorParameter2D.cpp
[ 90%] Built target pdeSensorLib_vera
Scanning dependencies of target pdeSensorLib
[ 90%] Building CXX object src/pde/Sensor/CMakeFiles/pdeSensorLib.dir/BCSensorParameter1D.cpp.o
[ 90%] Building CXX object src/pde/Sensor/CMakeFiles/pdeSensorLib.dir/BCSensorParameter2D.cpp.o
[ 90%] Building CXX object src/pde/Sensor/CMakeFiles/pdeSensorLib.dir/PDESensorParameter1D.cpp.o
[ 90%] Building CXX object src/pde/Sensor/CMakeFiles/pdeSensorLib.dir/PDESensorParameter2D.cpp.o
[ 90%] Building CXX object src/pde/Sensor/CMakeFiles/pdeSensorLib.dir/Sensor_AdvectiveFlux1D.cpp.o
[ 90%] Building CXX object src/pde/Sensor/CMakeFiles/pdeSensorLib.dir/Sensor_AdvectiveFlux2D.cpp.o
[ 93%] Building CXX object src/pde/Sensor/CMakeFiles/pdeSensorLib.dir/Sensor_ViscousFlux1D.cpp.o
[ 93%] Building CXX object src/pde/Sensor/CMakeFiles/pdeSensorLib.dir/Sensor_ViscousFlux2D.cpp.o
[ 93%] Linking CXX static library libpdeSensorLib.a
[ 93%] Built target pdeSensorLib
Scanning dependencies of target LocalSolve1D_HDG_AD_btest_OBJECT
[ 93%] Building CXX object test/system/LocalSolve/CMakeFiles/LocalSolve1D_HDG_AD_btest_OBJECT.dir/LocalSolve1D_HDG_AD_btest.cpp.o
[ 93%] Built target LocalSolve1D_HDG_AD_btest_OBJECT
Scanning dependencies of target LocalSolve1D_HDG_AD_btest_build
[ 93%] Linking CXX executable LocalSolve1D_HDG_AD_btest
[ 93%] Built target LocalSolve1D_HDG_AD_btest_build
Scanning dependencies of target LocalSolve1D_Split_HDG_AD_btest_build_vera
[ 93%] Checking style of test/system/LocalSolve/LocalSolve1D_Split_HDG_AD_btest.cpp
[ 93%] Built target LocalSolve1D_Split_HDG_AD_btest_build_vera
Scanning dependencies of target LocalSolve1D_Split_HDG_AD_btest_OBJECT
[ 93%] Building CXX object test/system/LocalSolve/CMakeFiles/LocalSolve1D_Split_HDG_AD_btest_OBJECT.dir/LocalSolve1D_Split_HDG_AD_btest.cpp.o
[ 93%] Built target LocalSolve1D_Split_HDG_AD_btest_OBJECT
Scanning dependencies of target LocalSolve1D_Split_HDG_AD_btest_build
[ 93%] Linking CXX executable LocalSolve1D_Split_HDG_AD_btest
[ 93%] Built target LocalSolve1D_Split_HDG_AD_btest_build
Scanning dependencies of target LocalSolve2D_Split_DGBR2_Triangle_AD_AV_btest_build_vera
[ 93%] Checking style of test/system/LocalSolve/LocalSolve2D_Split_DGBR2_Triangle_AD_AV_btest.cpp
[ 93%] Built target LocalSolve2D_Split_DGBR2_Triangle_AD_AV_btest_build_vera
Scanning dependencies of target LocalSolve2D_Split_DGBR2_Triangle_AD_AV_btest_OBJECT
[ 93%] Building CXX object test/system/LocalSolve/CMakeFiles/LocalSolve2D_Split_DGBR2_Triangle_AD_AV_btest_OBJECT.dir/LocalSolve2D_Split_DGBR2_Triangle_AD_AV_btest.cpp.o
[ 93%] Built target LocalSolve2D_Split_DGBR2_Triangle_AD_AV_btest_OBJECT
Scanning dependencies of target LocalSolve2D_Split_DGBR2_Triangle_AD_AV_btest_build
[ 93%] Linking CXX executable LocalSolve2D_Split_DGBR2_Triangle_AD_AV_btest
[ 93%] Built target LocalSolve2D_Split_DGBR2_Triangle_AD_AV_btest_build
Scanning dependencies of target LocalSolve1D_Split_DGBR2_AD_btest_build_vera
[ 93%] Checking style of test/system/LocalSolve/LocalSolve1D_Split_DGBR2_AD_btest.cpp
[ 93%] Built target LocalSolve1D_Split_DGBR2_AD_btest_build_vera
Scanning dependencies of target LocalSolve1D_Split_DGBR2_AD_btest_OBJECT
[ 93%] Building CXX object test/system/LocalSolve/CMakeFiles/LocalSolve1D_Split_DGBR2_AD_btest_OBJECT.dir/LocalSolve1D_Split_DGBR2_AD_btest.cpp.o
[ 93%] Built target LocalSolve1D_Split_DGBR2_AD_btest_OBJECT
Scanning dependencies of target LocalSolve1D_Split_DGBR2_AD_btest_build
[ 93%] Linking CXX executable LocalSolve1D_Split_DGBR2_AD_btest
[ 93%] Built target LocalSolve1D_Split_DGBR2_AD_btest_build
Scanning dependencies of target EdgeLocalSolve2D_Dual_Galerkin_Stabilized_Euler_btest_build_vera
[ 93%] Checking style of test/system/LocalSolve/EdgeLocalSolve2D_Dual_Galerkin_Stabilized_Euler_btest.cpp
[ 93%] Built target EdgeLocalSolve2D_Dual_Galerkin_Stabilized_Euler_btest_build_vera
Scanning dependencies of target EdgeLocalSolve2D_Dual_Galerkin_Stabilized_Euler_btest_OBJECT
[ 93%] Building CXX object test/system/LocalSolve/CMakeFiles/EdgeLocalSolve2D_Dual_Galerkin_Stabilized_Euler_btest_OBJECT.dir/EdgeLocalSolve2D_Dual_Galerkin_Stabilized_Euler_btest.cpp.o
[ 93%] Built target EdgeLocalSolve2D_Dual_Galerkin_Stabilized_Euler_btest_OBJECT
Scanning dependencies of target EdgeLocalSolve2D_Dual_Galerkin_Stabilized_Euler_btest_build
[ 93%] Linking CXX executable EdgeLocalSolve2D_Dual_Galerkin_Stabilized_Euler_btest
[ 93%] Built target EdgeLocalSolve2D_Dual_Galerkin_Stabilized_Euler_btest_build
Scanning dependencies of target ElementDualLocalSolve2D_Galerkin_Stabilized_Triangle_AD_btest_build_vera
[ 93%] Checking style of test/system/LocalSolve/ElementDualLocalSolve2D_Galerkin_Stabilized_Triangle_AD_btest.cpp
[ 93%] Built target ElementDualLocalSolve2D_Galerkin_Stabilized_Triangle_AD_btest_build_vera
Scanning dependencies of target ElementDualLocalSolve2D_Galerkin_Stabilized_Triangle_AD_btest_OBJECT
[ 93%] Building CXX object test/system/LocalSolve/CMakeFiles/ElementDualLocalSolve2D_Galerkin_Stabilized_Triangle_AD_btest_OBJECT.dir/ElementDualLocalSolve2D_Galerkin_Stabilized_Triangle_AD_btest.cpp.o
[ 93%] Built target ElementDualLocalSolve2D_Galerkin_Stabilized_Triangle_AD_btest_OBJECT
Scanning dependencies of target ElementDualLocalSolve2D_Galerkin_Stabilized_Triangle_AD_btest_build
[ 93%] Linking CXX executable ElementDualLocalSolve2D_Galerkin_Stabilized_Triangle_AD_btest
[ 93%] Built target ElementDualLocalSolve2D_Galerkin_Stabilized_Triangle_AD_btest_build
Scanning dependencies of target EdgeLocalSolve2D_Dual_Galerkin_Stabilized_AR_btest_OBJECT
[ 93%] Building CXX object test/system/LocalSolve/CMakeFiles/EdgeLocalSolve2D_Dual_Galerkin_Stabilized_AR_btest_OBJECT.dir/EdgeLocalSolve2D_Dual_Galerkin_Stabilized_AR_btest.cpp.o
[ 93%] Built target EdgeLocalSolve2D_Dual_Galerkin_Stabilized_AR_btest_OBJECT
Scanning dependencies of target EdgeLocalSolve2D_Dual_Galerkin_Stabilized_AR_btest_build_vera
[ 93%] Checking style of test/system/LocalSolve/EdgeLocalSolve2D_Dual_Galerkin_Stabilized_AR_btest.cpp
[ 93%] Built target EdgeLocalSolve2D_Dual_Galerkin_Stabilized_AR_btest_build_vera
Scanning dependencies of target EdgeLocalSolve2D_Dual_Galerkin_Stabilized_AR_btest_build
[ 93%] Linking CXX executable EdgeLocalSolve2D_Dual_Galerkin_Stabilized_AR_btest
[ 93%] Built target EdgeLocalSolve2D_Dual_Galerkin_Stabilized_AR_btest_build
Scanning dependencies of target AlgebraicEquationSet_Local_VMSD_Triangle_AD_btest_OBJECT
[ 93%] Building CXX object test/system/LocalSolve/CMakeFiles/AlgebraicEquationSet_Local_VMSD_Triangle_AD_btest_OBJECT.dir/AlgebraicEquationSet_Local_VMSD_Triangle_AD_btest.cpp.o
[ 93%] Built target AlgebraicEquationSet_Local_VMSD_Triangle_AD_btest_OBJECT
Scanning dependencies of target AlgebraicEquationSet_Local_VMSD_Triangle_AD_btest_build_vera
[ 93%] Checking style of test/system/LocalSolve/AlgebraicEquationSet_Local_VMSD_Triangle_AD_btest.cpp
[ 93%] Built target AlgebraicEquationSet_Local_VMSD_Triangle_AD_btest_build_vera
Scanning dependencies of target AlgebraicEquationSet_Local_VMSD_Triangle_AD_btest_build
[ 93%] Linking CXX executable AlgebraicEquationSet_Local_VMSD_Triangle_AD_btest
[ 93%] Built target AlgebraicEquationSet_Local_VMSD_Triangle_AD_btest_build
Scanning dependencies of target LocalSolve3D_HDG_Tet_AD_btest_build_vera
[ 93%] Checking style of test/system/LocalSolve/LocalSolve3D_HDG_Tet_AD_btest.cpp
[ 93%] Built target LocalSolve3D_HDG_Tet_AD_btest_build_vera
Scanning dependencies of target LocalSolve3D_HDG_Tet_AD_btest_OBJECT
[ 93%] Building CXX object test/system/LocalSolve/CMakeFiles/LocalSolve3D_HDG_Tet_AD_btest_OBJECT.dir/LocalSolve3D_HDG_Tet_AD_btest.cpp.o
[ 93%] Built target LocalSolve3D_HDG_Tet_AD_btest_OBJECT
Scanning dependencies of target LocalSolve3D_HDG_Tet_AD_btest_build
[ 93%] Linking CXX executable LocalSolve3D_HDG_Tet_AD_btest
[ 93%] Built target LocalSolve3D_HDG_Tet_AD_btest_build
Scanning dependencies of target ElementLocalSolve3D_DGBR2_Tet_AD_btest_build_vera
[ 93%] Checking style of test/system/LocalSolve/ElementLocalSolve3D_DGBR2_Tet_AD_btest.cpp
[ 93%] Built target ElementLocalSolve3D_DGBR2_Tet_AD_btest_build_vera
Scanning dependencies of target ElementLocalSolve3D_DGBR2_Tet_AD_btest_OBJECT
[ 93%] Building CXX object test/system/LocalSolve/CMakeFiles/ElementLocalSolve3D_DGBR2_Tet_AD_btest_OBJECT.dir/ElementLocalSolve3D_DGBR2_Tet_AD_btest.cpp.o
[ 93%] Built target ElementLocalSolve3D_DGBR2_Tet_AD_btest_OBJECT
Scanning dependencies of target ElementLocalSolve3D_DGBR2_Tet_AD_btest_build
[ 93%] Linking CXX executable ElementLocalSolve3D_DGBR2_Tet_AD_btest
[ 93%] Built target ElementLocalSolve3D_DGBR2_Tet_AD_btest_build
Scanning dependencies of target LocalSolve2D_HDG_Triangle_AD_btest_build_vera
[ 93%] Checking style of test/system/LocalSolve/LocalSolve2D_HDG_Triangle_AD_btest.cpp
[ 93%] Built target LocalSolve2D_HDG_Triangle_AD_btest_build_vera
Scanning dependencies of target LocalSolve2D_HDG_Triangle_AD_btest_OBJECT
[ 93%] Building CXX object test/system/LocalSolve/CMakeFiles/LocalSolve2D_HDG_Triangle_AD_btest_OBJECT.dir/LocalSolve2D_HDG_Triangle_AD_btest.cpp.o
[ 93%] Built target LocalSolve2D_HDG_Triangle_AD_btest_OBJECT
Scanning dependencies of target LocalSolve2D_HDG_Triangle_AD_btest_build
[ 93%] Linking CXX executable LocalSolve2D_HDG_Triangle_AD_btest
[ 93%] Built target LocalSolve2D_HDG_Triangle_AD_btest_build
Scanning dependencies of target EdgeLocalSolve3D_Dual_Galerkin_Stabilized_AD_btest_OBJECT
[ 93%] Building CXX object test/system/LocalSolve/CMakeFiles/EdgeLocalSolve3D_Dual_Galerkin_Stabilized_AD_btest_OBJECT.dir/EdgeLocalSolve3D_Dual_Galerkin_Stabilized_AD_btest.cpp.o
[ 93%] Built target EdgeLocalSolve3D_Dual_Galerkin_Stabilized_AD_btest_OBJECT
Scanning dependencies of target EdgeLocalSolve3D_Dual_Galerkin_Stabilized_AD_btest_build_vera
[ 93%] Checking style of test/system/LocalSolve/EdgeLocalSolve3D_Dual_Galerkin_Stabilized_AD_btest.cpp
[ 93%] Built target EdgeLocalSolve3D_Dual_Galerkin_Stabilized_AD_btest_build_vera
Scanning dependencies of target EdgeLocalSolve3D_Dual_Galerkin_Stabilized_AD_btest_build
[ 93%] Linking CXX executable EdgeLocalSolve3D_Dual_Galerkin_Stabilized_AD_btest
[ 93%] Built target EdgeLocalSolve3D_Dual_Galerkin_Stabilized_AD_btest_build
Scanning dependencies of target LocalSolve3D_Split_HDG_Tet_AD_btest_build_vera
[ 93%] Checking style of test/system/LocalSolve/LocalSolve3D_Split_HDG_Tet_AD_btest.cpp
[ 93%] Built target LocalSolve3D_Split_HDG_Tet_AD_btest_build_vera
Scanning dependencies of target LocalSolve3D_Split_HDG_Tet_AD_btest_OBJECT
[ 93%] Building CXX object test/system/LocalSolve/CMakeFiles/LocalSolve3D_Split_HDG_Tet_AD_btest_OBJECT.dir/LocalSolve3D_Split_HDG_Tet_AD_btest.cpp.o
[ 93%] Built target LocalSolve3D_Split_HDG_Tet_AD_btest_OBJECT
Scanning dependencies of target LocalSolve3D_Split_HDG_Tet_AD_btest_build
[ 93%] Linking CXX executable LocalSolve3D_Split_HDG_Tet_AD_btest
[ 93%] Built target LocalSolve3D_Split_HDG_Tet_AD_btest_build
Scanning dependencies of target LocalSolve2D_Split_HDG_Triangle_AD_btest_OBJECT
[ 93%] Building CXX object test/system/LocalSolve/CMakeFiles/LocalSolve2D_Split_HDG_Triangle_AD_btest_OBJECT.dir/LocalSolve2D_Split_HDG_Triangle_AD_btest.cpp.o
[ 93%] Built target LocalSolve2D_Split_HDG_Triangle_AD_btest_OBJECT
Scanning dependencies of target LocalSolve2D_Split_HDG_Triangle_AD_btest_build_vera
[ 93%] Checking style of test/system/LocalSolve/LocalSolve2D_Split_HDG_Triangle_AD_btest.cpp
[ 93%] Built target LocalSolve2D_Split_HDG_Triangle_AD_btest_build_vera
Scanning dependencies of target LocalSolve2D_Split_HDG_Triangle_AD_btest_build
[ 93%] Linking CXX executable LocalSolve2D_Split_HDG_Triangle_AD_btest
[ 93%] Built target LocalSolve2D_Split_HDG_Triangle_AD_btest_build
Scanning dependencies of target ElementDualLocalSolve3D_Galerkin_Stabilized_Triangle_AD_btest_OBJECT
[ 93%] Building CXX object test/system/LocalSolve/CMakeFiles/ElementDualLocalSolve3D_Galerkin_Stabilized_Triangle_AD_btest_OBJECT.dir/ElementDualLocalSolve3D_Galerkin_Stabilized_Triangle_AD_btest.cpp.o
[ 93%] Built target ElementDualLocalSolve3D_Galerkin_Stabilized_Triangle_AD_btest_OBJECT
Scanning dependencies of target ElementDualLocalSolve3D_Galerkin_Stabilized_Triangle_AD_btest_build_vera
[ 93%] Checking style of test/system/LocalSolve/ElementDualLocalSolve3D_Galerkin_Stabilized_Triangle_AD_btest.cpp
[ 93%] Built target ElementDualLocalSolve3D_Galerkin_Stabilized_Triangle_AD_btest_build_vera
Scanning dependencies of target ElementDualLocalSolve3D_Galerkin_Stabilized_Triangle_AD_btest_build
[ 93%] Linking CXX executable ElementDualLocalSolve3D_Galerkin_Stabilized_Triangle_AD_btest
[ 93%] Built target ElementDualLocalSolve3D_Galerkin_Stabilized_Triangle_AD_btest_build
Scanning dependencies of target ElementLocalSolve2D_DGBR2_Triangle_AD_btest_OBJECT
[ 93%] Building CXX object test/system/LocalSolve/CMakeFiles/ElementLocalSolve2D_DGBR2_Triangle_AD_btest_OBJECT.dir/ElementLocalSolve2D_DGBR2_Triangle_AD_btest.cpp.o
[ 93%] Built target ElementLocalSolve2D_DGBR2_Triangle_AD_btest_OBJECT
Scanning dependencies of target ElementLocalSolve2D_DGBR2_Triangle_AD_btest_build_vera
[ 93%] Checking style of test/system/LocalSolve/ElementLocalSolve2D_DGBR2_Triangle_AD_btest.cpp
[ 93%] Built target ElementLocalSolve2D_DGBR2_Triangle_AD_btest_build_vera
Scanning dependencies of target ElementLocalSolve2D_DGBR2_Triangle_AD_btest_build
[ 93%] Linking CXX executable ElementLocalSolve2D_DGBR2_Triangle_AD_btest
[ 93%] Built target ElementLocalSolve2D_DGBR2_Triangle_AD_btest_build
Scanning dependencies of target EdgeLocalSolve2D_Dual_Galerkin_Stabilized_AD_btest_build_vera
[ 93%] Checking style of test/system/LocalSolve/EdgeLocalSolve2D_Dual_Galerkin_Stabilized_AD_btest.cpp
[ 93%] Built target EdgeLocalSolve2D_Dual_Galerkin_Stabilized_AD_btest_build_vera
Scanning dependencies of target EdgeLocalSolve2D_Dual_Galerkin_Stabilized_AD_btest_OBJECT
[ 93%] Building CXX object test/system/LocalSolve/CMakeFiles/EdgeLocalSolve2D_Dual_Galerkin_Stabilized_AD_btest_OBJECT.dir/EdgeLocalSolve2D_Dual_Galerkin_Stabilized_AD_btest.cpp.o
[ 93%] Built target EdgeLocalSolve2D_Dual_Galerkin_Stabilized_AD_btest_OBJECT
Scanning dependencies of target EdgeLocalSolve2D_Dual_Galerkin_Stabilized_AD_btest_build
[ 93%] Linking CXX executable EdgeLocalSolve2D_Dual_Galerkin_Stabilized_AD_btest
[ 93%] Built target EdgeLocalSolve2D_Dual_Galerkin_Stabilized_AD_btest_build
Scanning dependencies of target ElementLocalSolve1D_DGBR2_Triangle_AD_btest_build_vera
[ 93%] Checking style of test/system/LocalSolve/ElementLocalSolve1D_DGBR2_Triangle_AD_btest.cpp
[ 93%] Built target ElementLocalSolve1D_DGBR2_Triangle_AD_btest_build_vera
Scanning dependencies of target ElementLocalSolve1D_DGBR2_Triangle_AD_btest_OBJECT
[ 93%] Building CXX object test/system/LocalSolve/CMakeFiles/ElementLocalSolve1D_DGBR2_Triangle_AD_btest_OBJECT.dir/ElementLocalSolve1D_DGBR2_Triangle_AD_btest.cpp.o
[ 93%] Built target ElementLocalSolve1D_DGBR2_Triangle_AD_btest_OBJECT
Scanning dependencies of target ElementLocalSolve1D_DGBR2_Triangle_AD_btest_build
[ 93%] Linking CXX executable ElementLocalSolve1D_DGBR2_Triangle_AD_btest
[ 93%] Built target ElementLocalSolve1D_DGBR2_Triangle_AD_btest_build
Scanning dependencies of target AlgebraicEquationSet_Local_VMSDBR2_Triangle_AD_btest_build_vera
[ 93%] Checking style of test/system/LocalSolve/AlgebraicEquationSet_Local_VMSDBR2_Triangle_AD_btest.cpp
[ 93%] Built target AlgebraicEquationSet_Local_VMSDBR2_Triangle_AD_btest_build_vera
Scanning dependencies of target AlgebraicEquationSet_Local_VMSDBR2_Triangle_AD_btest_OBJECT
[ 93%] Building CXX object test/system/LocalSolve/CMakeFiles/AlgebraicEquationSet_Local_VMSDBR2_Triangle_AD_btest_OBJECT.dir/AlgebraicEquationSet_Local_VMSDBR2_Triangle_AD_btest.cpp.o
[ 93%] Built target AlgebraicEquationSet_Local_VMSDBR2_Triangle_AD_btest_OBJECT
Scanning dependencies of target AlgebraicEquationSet_Local_VMSDBR2_Triangle_AD_btest_build
[ 93%] Linking CXX executable AlgebraicEquationSet_Local_VMSDBR2_Triangle_AD_btest
[ 93%] Built target AlgebraicEquationSet_Local_VMSDBR2_Triangle_AD_btest_build
Scanning dependencies of target ElementLocalSolve3D_DGAdvective_Tet_AD_btest_OBJECT
[ 93%] Building CXX object test/system/LocalSolve/CMakeFiles/ElementLocalSolve3D_DGAdvective_Tet_AD_btest_OBJECT.dir/ElementLocalSolve3D_DGAdvective_Tet_AD_btest.cpp.o
[ 93%] Built target ElementLocalSolve3D_DGAdvective_Tet_AD_btest_OBJECT
Scanning dependencies of target ElementLocalSolve3D_DGAdvective_Tet_AD_btest_build_vera
[ 93%] Checking style of test/system/LocalSolve/ElementLocalSolve3D_DGAdvective_Tet_AD_btest.cpp
[ 93%] Built target ElementLocalSolve3D_DGAdvective_Tet_AD_btest_build_vera
Scanning dependencies of target ElementLocalSolve3D_DGAdvective_Tet_AD_btest_build
[ 93%] Linking CXX executable ElementLocalSolve3D_DGAdvective_Tet_AD_btest
[ 93%] Built target ElementLocalSolve3D_DGAdvective_Tet_AD_btest_build
Scanning dependencies of target EdgeLocalSolve1D_Dual_Galerkin_Stabilized_Line_AD_btest_build_vera
[ 93%] Checking style of test/system/LocalSolve/EdgeLocalSolve1D_Dual_Galerkin_Stabilized_Line_AD_btest.cpp
[ 93%] Built target EdgeLocalSolve1D_Dual_Galerkin_Stabilized_Line_AD_btest_build_vera
Scanning dependencies of target EdgeLocalSolve1D_Dual_Galerkin_Stabilized_Line_AD_btest_OBJECT
[ 93%] Building CXX object test/system/LocalSolve/CMakeFiles/EdgeLocalSolve1D_Dual_Galerkin_Stabilized_Line_AD_btest_OBJECT.dir/EdgeLocalSolve1D_Dual_Galerkin_Stabilized_Line_AD_btest.cpp.o
[ 93%] Built target EdgeLocalSolve1D_Dual_Galerkin_Stabilized_Line_AD_btest_OBJECT
Scanning dependencies of target EdgeLocalSolve1D_Dual_Galerkin_Stabilized_Line_AD_btest_build
[ 93%] Linking CXX executable EdgeLocalSolve1D_Dual_Galerkin_Stabilized_Line_AD_btest
[ 93%] Built target EdgeLocalSolve1D_Dual_Galerkin_Stabilized_Line_AD_btest_build
Scanning dependencies of target Block_1D_Decoupled_AD_btest_build_vera
[ 93%] Checking style of test/system/BlockSolve/Block_1D_Decoupled_AD_btest.cpp
[ 93%] Built target Block_1D_Decoupled_AD_btest_build_vera
Scanning dependencies of target Block_1D_Decoupled_AD_btest_OBJECT
[ 93%] Building CXX object test/system/BlockSolve/CMakeFiles/Block_1D_Decoupled_AD_btest_OBJECT.dir/Block_1D_Decoupled_AD_btest.cpp.o
[ 93%] Built target Block_1D_Decoupled_AD_btest_OBJECT
Scanning dependencies of target Block_1D_Decoupled_AD_btest_build
[ 93%] Linking CXX executable Block_1D_Decoupled_AD_btest
[ 93%] Built target Block_1D_Decoupled_AD_btest_build
Scanning dependencies of target Block_1D_Decoupled_Burgers_btest_OBJECT
[ 93%] Building CXX object test/system/BlockSolve/CMakeFiles/Block_1D_Decoupled_Burgers_btest_OBJECT.dir/Block_1D_Decoupled_Burgers_btest.cpp.o
[ 93%] Built target Block_1D_Decoupled_Burgers_btest_OBJECT
Scanning dependencies of target Block_1D_Decoupled_Burgers_btest_build_vera
[ 93%] Checking style of test/system/BlockSolve/Block_1D_Decoupled_Burgers_btest.cpp
[ 93%] Built target Block_1D_Decoupled_Burgers_btest_build_vera
Scanning dependencies of target Block_1D_Decoupled_Burgers_btest_build
[ 93%] Linking CXX executable Block_1D_Decoupled_Burgers_btest
[ 93%] Built target Block_1D_Decoupled_Burgers_btest_build
Scanning dependencies of target AnalyticSolve2D_DGAdvective_Triangle_Euler_UniformStream_btest_build_vera
[ 93%] Checking style of test/system/AnalyticSolve/AnalyticSolve2D_DGAdvective_Triangle_Euler_UniformStream_btest.cpp
[ 93%] Built target AnalyticSolve2D_DGAdvective_Triangle_Euler_UniformStream_btest_build_vera
Scanning dependencies of target DGBR2NSLib
[ 96%] Building CXX object src/Discretization/CMakeFiles/DGBR2NSLib.dir/DG/DGBR2_Instantiate/AlgebraicEquationSet_DGBR2_NavierStokes2D_ConservativeConstVisc.cpp.o
[ 96%] Building CXX object src/Discretization/CMakeFiles/DGBR2NSLib.dir/DG/DGBR2_Instantiate/AlgebraicEquationSet_DGBR2_NavierStokes2D_PrimitiveConstVisc.cpp.o
[ 96%] Building CXX object src/Discretization/CMakeFiles/DGBR2NSLib.dir/DG/DGBR2_Instantiate/AlgebraicEquationSet_DGBR2_NavierStokes3D_PrimitiveConstVisc.cpp.o
[ 96%] Building CXX object src/Discretization/CMakeFiles/DGBR2NSLib.dir/DG/DGBR2_Instantiate/AlgebraicEquationSet_DGBR2_NavierStokes3D_PrimitiveSutherland.cpp.o
[ 96%] Building CXX object src/Discretization/CMakeFiles/DGBR2NSLib.dir/DG/DGBR2_Instantiate/AlgebraicEquationSet_DGBR2_NavierStokes3D_SurrogateSutherland.cpp.o
[ 96%] Linking CXX static library libDGBR2NSLib.a
[ 96%] Built target DGBR2NSLib
Scanning dependencies of target AnalyticSolve2D_DGAdvective_Triangle_Euler_UniformStream_btest_OBJECT
[ 96%] Building CXX object test/system/AnalyticSolve/CMakeFiles/AnalyticSolve2D_DGAdvective_Triangle_Euler_UniformStream_btest_OBJECT.dir/AnalyticSolve2D_DGAdvective_Triangle_Euler_UniformStream_btest.cpp.o
[ 96%] Built target AnalyticSolve2D_DGAdvective_Triangle_Euler_UniformStream_btest_OBJECT
Scanning dependencies of target AnalyticSolve2D_DGAdvective_Triangle_Euler_UniformStream_btest_build
[ 96%] Linking CXX executable AnalyticSolve2D_DGAdvective_Triangle_Euler_UniformStream_btest
[ 96%] Built target AnalyticSolve2D_DGAdvective_Triangle_Euler_UniformStream_btest_build
Scanning dependencies of target AnalyticSolve2D_DGBR2_Triangle_NavierStokes_UniformStream_btest_build_vera
[ 96%] Checking style of test/system/AnalyticSolve/AnalyticSolve2D_DGBR2_Triangle_NavierStokes_UniformStream_btest.cpp
[ 96%] Built target AnalyticSolve2D_DGBR2_Triangle_NavierStokes_UniformStream_btest_build_vera
Scanning dependencies of target AnalyticSolve2D_DGBR2_Triangle_NavierStokes_UniformStream_btest_OBJECT
[ 96%] Building CXX object test/system/AnalyticSolve/CMakeFiles/AnalyticSolve2D_DGBR2_Triangle_NavierStokes_UniformStream_btest_OBJECT.dir/AnalyticSolve2D_DGBR2_Triangle_NavierStokes_UniformStream_btest.cpp.o
[ 96%] Built target AnalyticSolve2D_DGBR2_Triangle_NavierStokes_UniformStream_btest_OBJECT
Scanning dependencies of target AnalyticSolve2D_DGBR2_Triangle_NavierStokes_UniformStream_btest_build
[ 96%] Linking CXX executable AnalyticSolve2D_DGBR2_Triangle_NavierStokes_UniformStream_btest
[ 96%] Built target AnalyticSolve2D_DGBR2_Triangle_NavierStokes_UniformStream_btest_build
Scanning dependencies of target AnalyticSolve2D_HDG_Triangle_NavierStokes_btest_build_vera
[ 96%] Checking style of test/system/AnalyticSolve/AnalyticSolve2D_HDG_Triangle_NavierStokes_btest.cpp
[ 96%] Built target AnalyticSolve2D_HDG_Triangle_NavierStokes_btest_build_vera
Scanning dependencies of target AnalyticSolve2D_HDG_Triangle_NavierStokes_btest_OBJECT
[ 96%] Building CXX object test/system/AnalyticSolve/CMakeFiles/AnalyticSolve2D_HDG_Triangle_NavierStokes_btest_OBJECT.dir/AnalyticSolve2D_HDG_Triangle_NavierStokes_btest.cpp.o
[ 96%] Built target AnalyticSolve2D_HDG_Triangle_NavierStokes_btest_OBJECT
Scanning dependencies of target AnalyticSolve2D_HDG_Triangle_NavierStokes_btest_build
[ 96%] Linking CXX executable AnalyticSolve2D_HDG_Triangle_NavierStokes_btest
[ 96%] Built target AnalyticSolve2D_HDG_Triangle_NavierStokes_btest_build
Scanning dependencies of target AnalyticSolve2D_DGAdvective_IBL_StagnationFlow_LamiBL_btest_OBJECT
[ 96%] Building CXX object test/system/AnalyticSolve/CMakeFiles/AnalyticSolve2D_DGAdvective_IBL_StagnationFlow_LamiBL_btest_OBJECT.dir/AnalyticSolve2D_DGAdvective_IBL_StagnationFlow_LamiBL_btest.cpp.o
[ 96%] Built target AnalyticSolve2D_DGAdvective_IBL_StagnationFlow_LamiBL_btest_OBJECT
Scanning dependencies of target AnalyticSolve2D_DGAdvective_IBL_StagnationFlow_LamiBL_btest_build_vera
[ 96%] Checking style of test/system/AnalyticSolve/AnalyticSolve2D_DGAdvective_IBL_StagnationFlow_LamiBL_btest.cpp
[ 96%] Built target AnalyticSolve2D_DGAdvective_IBL_StagnationFlow_LamiBL_btest_build_vera
Scanning dependencies of target AnalyticSolve2D_DGAdvective_IBL_StagnationFlow_LamiBL_btest_build
[ 96%] Linking CXX executable AnalyticSolve2D_DGAdvective_IBL_StagnationFlow_LamiBL_btest
[ 96%] Built target AnalyticSolve2D_DGAdvective_IBL_StagnationFlow_LamiBL_btest_build
Scanning dependencies of target AnalyticSolve2D_DGAdvective_IBL_StagnationFlow_SingleElem_LamiBL_btest_OBJECT
[ 96%] Building CXX object test/system/AnalyticSolve/CMakeFiles/AnalyticSolve2D_DGAdvective_IBL_StagnationFlow_SingleElem_LamiBL_btest_OBJECT.dir/AnalyticSolve2D_DGAdvective_IBL_StagnationFlow_SingleElem_LamiBL_btest.cpp.o
[ 96%] Built target AnalyticSolve2D_DGAdvective_IBL_StagnationFlow_SingleElem_LamiBL_btest_OBJECT
Scanning dependencies of target AnalyticSolve2D_DGAdvective_IBL_StagnationFlow_SingleElem_LamiBL_btest_build_vera
[ 96%] Checking style of test/system/AnalyticSolve/AnalyticSolve2D_DGAdvective_IBL_StagnationFlow_SingleElem_LamiBL_btest.cpp
[ 96%] Built target AnalyticSolve2D_DGAdvective_IBL_StagnationFlow_SingleElem_LamiBL_btest_build_vera
Scanning dependencies of target AnalyticSolve2D_DGAdvective_IBL_StagnationFlow_SingleElem_LamiBL_btest_build
[ 96%] Linking CXX executable AnalyticSolve2D_DGAdvective_IBL_StagnationFlow_SingleElem_LamiBL_btest
[ 96%] Built target AnalyticSolve2D_DGAdvective_IBL_StagnationFlow_SingleElem_LamiBL_btest_build
Scanning dependencies of target AnalyticSolve2D_HDG_Triangle_NavierStokes_UniformStream_btest_OBJECT
[ 96%] Building CXX object test/system/AnalyticSolve/CMakeFiles/AnalyticSolve2D_HDG_Triangle_NavierStokes_UniformStream_btest_OBJECT.dir/AnalyticSolve2D_HDG_Triangle_NavierStokes_UniformStream_btest.cpp.o
[ 96%] Built target AnalyticSolve2D_HDG_Triangle_NavierStokes_UniformStream_btest_OBJECT
Scanning dependencies of target AnalyticSolve2D_HDG_Triangle_NavierStokes_UniformStream_btest_build_vera
[ 96%] Checking style of test/system/AnalyticSolve/AnalyticSolve2D_HDG_Triangle_NavierStokes_UniformStream_btest.cpp
[ 96%] Built target AnalyticSolve2D_HDG_Triangle_NavierStokes_UniformStream_btest_build_vera
Scanning dependencies of target AnalyticSolve2D_HDG_Triangle_NavierStokes_UniformStream_btest_build
[ 96%] Linking CXX executable AnalyticSolve2D_HDG_Triangle_NavierStokes_UniformStream_btest
[ 96%] Built target AnalyticSolve2D_HDG_Triangle_NavierStokes_UniformStream_btest_build
Scanning dependencies of target AnalyticSolve_HDG_AD_btest_build_vera
[ 96%] Checking style of test/system/AnalyticSolve/AnalyticSolve_HDG_AD_btest.cpp
[ 96%] Built target AnalyticSolve_HDG_AD_btest_build_vera
Scanning dependencies of target AnalyticSolve_HDG_AD_btest_OBJECT
[ 96%] Building CXX object test/system/AnalyticSolve/CMakeFiles/AnalyticSolve_HDG_AD_btest_OBJECT.dir/AnalyticSolve_HDG_AD_btest.cpp.o
[ 96%] Built target AnalyticSolve_HDG_AD_btest_OBJECT
Scanning dependencies of target AnalyticSolve_HDG_AD_btest_build
[ 96%] Linking CXX executable AnalyticSolve_HDG_AD_btest
[ 96%] Built target AnalyticSolve_HDG_AD_btest_build
Scanning dependencies of target AnalyticSolve2D_DGBR2_Triangle_NavierStokes_btest_build_vera
[ 96%] Checking style of test/system/AnalyticSolve/AnalyticSolve2D_DGBR2_Triangle_NavierStokes_btest.cpp
[ 96%] Built target AnalyticSolve2D_DGBR2_Triangle_NavierStokes_btest_build_vera
Scanning dependencies of target AnalyticSolve2D_DGBR2_Triangle_NavierStokes_btest_OBJECT
[ 96%] Building CXX object test/system/AnalyticSolve/CMakeFiles/AnalyticSolve2D_DGBR2_Triangle_NavierStokes_btest_OBJECT.dir/AnalyticSolve2D_DGBR2_Triangle_NavierStokes_btest.cpp.o
[ 96%] Built target AnalyticSolve2D_DGBR2_Triangle_NavierStokes_btest_OBJECT
Scanning dependencies of target AnalyticSolve2D_DGBR2_Triangle_NavierStokes_btest_build
[ 96%] Linking CXX executable AnalyticSolve2D_DGBR2_Triangle_NavierStokes_btest
[ 96%] Built target AnalyticSolve2D_DGBR2_Triangle_NavierStokes_btest_build
Scanning dependencies of target PDEEulermitAVDiffusion2D_Consistency_btest_build_vera
[ 96%] Checking style of test/system/CodeConsistency/PDEEulermitAVDiffusion2D_Consistency_btest.cpp
[ 96%] Built target PDEEulermitAVDiffusion2D_Consistency_btest_build_vera
Scanning dependencies of target PDEEulermitAVDiffusion2D_Consistency_btest_OBJECT
[ 96%] Building CXX object test/system/CodeConsistency/CMakeFiles/PDEEulermitAVDiffusion2D_Consistency_btest_OBJECT.dir/PDEEulermitAVDiffusion2D_Consistency_btest.cpp.o
[ 96%] Built target PDEEulermitAVDiffusion2D_Consistency_btest_OBJECT
Scanning dependencies of target PDEEulermitAVDiffusion2D_Consistency_btest_build
[ 96%] Linking CXX executable PDEEulermitAVDiffusion2D_Consistency_btest
[ 96%] Built target PDEEulermitAVDiffusion2D_Consistency_btest_build
Scanning dependencies of target BCEulermitAVSensor2D_Consistency_btest_OBJECT
[ 96%] Building CXX object test/system/CodeConsistency/CMakeFiles/BCEulermitAVSensor2D_Consistency_btest_OBJECT.dir/BCEulermitAVSensor2D_Consistency_btest.cpp.o
[ 96%] Built target BCEulermitAVSensor2D_Consistency_btest_OBJECT
Scanning dependencies of target BCEulermitAVSensor2D_Consistency_btest_build_vera
[ 96%] Checking style of test/system/CodeConsistency/BCEulermitAVSensor2D_Consistency_btest.cpp
[ 96%] Built target BCEulermitAVSensor2D_Consistency_btest_build_vera
Scanning dependencies of target BCEulermitAVSensor2D_Consistency_btest_build
[100%] Linking CXX executable BCEulermitAVSensor2D_Consistency_btest
[100%] Built target BCEulermitAVSensor2D_Consistency_btest_build
Scanning dependencies of target PDEmitAVSensor3D_Consistency_btest_OBJECT
[100%] Building CXX object test/system/CodeConsistency/CMakeFiles/PDEmitAVSensor3D_Consistency_btest_OBJECT.dir/PDEmitAVSensor3D_Consistency_btest.cpp.o
[100%] Built target PDEmitAVSensor3D_Consistency_btest_OBJECT
Scanning dependencies of target PDEmitAVSensor3D_Consistency_btest_build_vera
[100%] Checking style of test/system/CodeConsistency/PDEmitAVSensor3D_Consistency_btest.cpp
[100%] Built target PDEmitAVSensor3D_Consistency_btest_build_vera
Scanning dependencies of target PDEmitAVSensor3D_Consistency_btest_build
[100%] Linking CXX executable PDEmitAVSensor3D_Consistency_btest
[100%] Built target PDEmitAVSensor3D_Consistency_btest_build
Scanning dependencies of target Solve2D_XfoilLikePanelMethod_btest_OBJECT
[100%] Building CXX object test/system/CodeConsistency/CMakeFiles/Solve2D_XfoilLikePanelMethod_btest_OBJECT.dir/Solve2D_XfoilLikePanelMethod_btest.cpp.o
[100%] Built target Solve2D_XfoilLikePanelMethod_btest_OBJECT
Scanning dependencies of target Solve2D_XfoilLikePanelMethod_btest_build_vera
[100%] Checking style of test/system/CodeConsistency/Solve2D_XfoilLikePanelMethod_btest.cpp
[100%] Built target Solve2D_XfoilLikePanelMethod_btest_build_vera
Scanning dependencies of target Solve2D_XfoilLikePanelMethod_btest_build
[100%] Linking CXX executable Solve2D_XfoilLikePanelMethod_btest
[100%] Built target Solve2D_XfoilLikePanelMethod_btest_build
Scanning dependencies of target PDEmitAVSensor3D_Consistency_RANSSA_btest_OBJECT
[100%] Building CXX object test/system/CodeConsistency/CMakeFiles/PDEmitAVSensor3D_Consistency_RANSSA_btest_OBJECT.dir/PDEmitAVSensor3D_Consistency_RANSSA_btest.cpp.o
[100%] Built target PDEmitAVSensor3D_Consistency_RANSSA_btest_OBJECT
Scanning dependencies of target PDEmitAVSensor3D_Consistency_RANSSA_btest_build_vera
[100%] Checking style of test/system/CodeConsistency/PDEmitAVSensor3D_Consistency_RANSSA_btest.cpp
[100%] Built target PDEmitAVSensor3D_Consistency_RANSSA_btest_build_vera
Scanning dependencies of target PDEmitAVSensor3D_Consistency_RANSSA_btest_build
[100%] Linking CXX executable PDEmitAVSensor3D_Consistency_RANSSA_btest
[100%] Built target PDEmitAVSensor3D_Consistency_RANSSA_btest_build
Scanning dependencies of target PDEEulermitAVDiffusion3D_Consistency_btest_build_vera
[100%] Checking style of test/system/CodeConsistency/PDEEulermitAVDiffusion3D_Consistency_btest.cpp
[100%] Built target PDEEulermitAVDiffusion3D_Consistency_btest_build_vera
Scanning dependencies of target PDEEulermitAVDiffusion3D_Consistency_btest_OBJECT
[100%] Building CXX object test/system/CodeConsistency/CMakeFiles/PDEEulermitAVDiffusion3D_Consistency_btest_OBJECT.dir/PDEEulermitAVDiffusion3D_Consistency_btest.cpp.o
[100%] Built target PDEEulermitAVDiffusion3D_Consistency_btest_OBJECT
Scanning dependencies of target PDEEulermitAVDiffusion3D_Consistency_btest_build
[100%] Linking CXX executable PDEEulermitAVDiffusion3D_Consistency_btest
[100%] Built target PDEEulermitAVDiffusion3D_Consistency_btest_build
Scanning dependencies of target Solve2D_Coupled4x4_IBLSplitAmpLag_CorrelationClosure_CapturedTransition_PTC_btest_build_vera
[100%] Checking style of test/system/CodeConsistency/Solve2D_Coupled4x4_IBLSplitAmpLag_CorrelationClosure_CapturedTransition_PTC_btest.cpp
[100%] Built target Solve2D_Coupled4x4_IBLSplitAmpLag_CorrelationClosure_CapturedTransition_PTC_btest_build_vera
Scanning dependencies of target Solve2D_Coupled4x4_IBLSplitAmpLag_CorrelationClosure_CapturedTransition_PTC_btest_OBJECT
[100%] Building CXX object test/system/CodeConsistency/CMakeFiles/Solve2D_Coupled4x4_IBLSplitAmpLag_CorrelationClosure_CapturedTransition_PTC_btest_OBJECT.dir/Solve2D_Coupled4x4_IBLSplitAmpLag_CorrelationClosure_CapturedTransition_PTC_btest.cpp.o
[100%] Built target Solve2D_Coupled4x4_IBLSplitAmpLag_CorrelationClosure_CapturedTransition_PTC_btest_OBJECT
Scanning dependencies of target Solve2D_Coupled4x4_IBLSplitAmpLag_CorrelationClosure_CapturedTransition_PTC_btest_build
[100%] Linking CXX executable Solve2D_Coupled4x4_IBLSplitAmpLag_CorrelationClosure_CapturedTransition_PTC_btest
[100%] Built target Solve2D_Coupled4x4_IBLSplitAmpLag_CorrelationClosure_CapturedTransition_PTC_btest_build
Scanning dependencies of target AlgebraicEquationSet_PTC_VMSD_Triangle_SA_btest_OBJECT
[100%] Building CXX object test/system/CodeConsistency/CMakeFiles/AlgebraicEquationSet_PTC_VMSD_Triangle_SA_btest_OBJECT.dir/AlgebraicEquationSet_PTC_VMSD_Triangle_SA_btest.cpp.o
[100%] Built target AlgebraicEquationSet_PTC_VMSD_Triangle_SA_btest_OBJECT
Scanning dependencies of target AlgebraicEquationSet_PTC_VMSD_Triangle_SA_btest_build_vera
[100%] Checking style of test/system/CodeConsistency/AlgebraicEquationSet_PTC_VMSD_Triangle_SA_btest.cpp
[100%] Built target AlgebraicEquationSet_PTC_VMSD_Triangle_SA_btest_build_vera
Scanning dependencies of target AlgebraicEquationSet_PTC_VMSD_Triangle_SA_btest_build
[100%] Linking CXX executable AlgebraicEquationSet_PTC_VMSD_Triangle_SA_btest
[100%] Built target AlgebraicEquationSet_PTC_VMSD_Triangle_SA_btest_build
Scanning dependencies of target PDEEulermitAVDiffusion3D_RANSSA_Consistency_btest_OBJECT
[100%] Building CXX object test/system/CodeConsistency/CMakeFiles/PDEEulermitAVDiffusion3D_RANSSA_Consistency_btest_OBJECT.dir/PDEEulermitAVDiffusion3D_RANSSA_Consistency_btest.cpp.o
[100%] Built target PDEEulermitAVDiffusion3D_RANSSA_Consistency_btest_OBJECT
Scanning dependencies of target PDEEulermitAVDiffusion3D_RANSSA_Consistency_btest_build_vera
[100%] Checking style of test/system/CodeConsistency/PDEEulermitAVDiffusion3D_RANSSA_Consistency_btest.cpp
[100%] Built target PDEEulermitAVDiffusion3D_RANSSA_Consistency_btest_build_vera
Scanning dependencies of target PDEEulermitAVDiffusion3D_RANSSA_Consistency_btest_build
[100%] Linking CXX executable PDEEulermitAVDiffusion3D_RANSSA_Consistency_btest
[100%] Built target PDEEulermitAVDiffusion3D_RANSSA_Consistency_btest_build
Scanning dependencies of target Solve2D_Coupled4x4_IBLUniField_LamiBL_TurbWake_CorrelationClosure_PTC_btest_build_vera
[100%] Checking style of test/system/CodeConsistency/Solve2D_Coupled4x4_IBLUniField_LamiBL_TurbWake_CorrelationClosure_PTC_btest.cpp
[100%] Built target Solve2D_Coupled4x4_IBLUniField_LamiBL_TurbWake_CorrelationClosure_PTC_btest_build_vera
Scanning dependencies of target Solve2D_Coupled4x4_IBLUniField_LamiBL_TurbWake_CorrelationClosure_PTC_btest_OBJECT
[100%] Building CXX object test/system/CodeConsistency/CMakeFiles/Solve2D_Coupled4x4_IBLUniField_LamiBL_TurbWake_CorrelationClosure_PTC_btest_OBJECT.dir/Solve2D_Coupled4x4_IBLUniField_LamiBL_TurbWake_CorrelationClosure_PTC_btest.cpp.o
[100%] Built target Solve2D_Coupled4x4_IBLUniField_LamiBL_TurbWake_CorrelationClosure_PTC_btest_OBJECT
Scanning dependencies of target Solve2D_Coupled4x4_IBLUniField_LamiBL_TurbWake_CorrelationClosure_PTC_btest_build
[100%] Linking CXX executable Solve2D_Coupled4x4_IBLUniField_LamiBL_TurbWake_CorrelationClosure_PTC_btest
[100%] Built target Solve2D_Coupled4x4_IBLUniField_LamiBL_TurbWake_CorrelationClosure_PTC_btest_build
Scanning dependencies of target PDEmitAVSensor2D_Consistency_btest_OBJECT
[100%] Building CXX object test/system/CodeConsistency/CMakeFiles/PDEmitAVSensor2D_Consistency_btest_OBJECT.dir/PDEmitAVSensor2D_Consistency_btest.cpp.o
[100%] Built target PDEmitAVSensor2D_Consistency_btest_OBJECT
Scanning dependencies of target PDEmitAVSensor2D_Consistency_btest_build_vera
[100%] Checking style of test/system/CodeConsistency/PDEmitAVSensor2D_Consistency_btest.cpp
[100%] Built target PDEmitAVSensor2D_Consistency_btest_build_vera
Scanning dependencies of target PDEmitAVSensor2D_Consistency_btest_build
[100%] Linking CXX executable PDEmitAVSensor2D_Consistency_btest
[100%] Built target PDEmitAVSensor2D_Consistency_btest_build
Scanning dependencies of target Solve2D_Coupled4x4_HDGAdv_IBL_Panel_NACA0004_LamiBL_TurbWake_btest_build_vera
[100%] Checking style of test/system/CodeConsistency/Solve2D_Coupled4x4_HDGAdv_IBL_Panel_NACA0004_LamiBL_TurbWake_btest.cpp
[100%] Built target Solve2D_Coupled4x4_HDGAdv_IBL_Panel_NACA0004_LamiBL_TurbWake_btest_build_vera
Scanning dependencies of target Solve2D_Coupled4x4_HDGAdv_IBL_Panel_NACA0004_LamiBL_TurbWake_btest_OBJECT
[100%] Building CXX object test/system/CodeConsistency/CMakeFiles/Solve2D_Coupled4x4_HDGAdv_IBL_Panel_NACA0004_LamiBL_TurbWake_btest_OBJECT.dir/Solve2D_Coupled4x4_HDGAdv_IBL_Panel_NACA0004_LamiBL_TurbWake_btest.cpp.o
[100%] Built target Solve2D_Coupled4x4_HDGAdv_IBL_Panel_NACA0004_LamiBL_TurbWake_btest_OBJECT
Scanning dependencies of target Solve2D_Coupled4x4_HDGAdv_IBL_Panel_NACA0004_LamiBL_TurbWake_btest_build
[100%] Linking CXX executable Solve2D_Coupled4x4_HDGAdv_IBL_Panel_NACA0004_LamiBL_TurbWake_btest
[100%] Built target Solve2D_Coupled4x4_HDGAdv_IBL_Panel_NACA0004_LamiBL_TurbWake_btest_build
Scanning dependencies of target Solve2D_Coupled4x4_IBL_CorrelationClosure_LamiBL_TurbWake_btest_OBJECT
[100%] Building CXX object test/system/CodeConsistency/CMakeFiles/Solve2D_Coupled4x4_IBL_CorrelationClosure_LamiBL_TurbWake_btest_OBJECT.dir/Solve2D_Coupled4x4_IBL_CorrelationClosure_LamiBL_TurbWake_btest.cpp.o
[100%] Built target Solve2D_Coupled4x4_IBL_CorrelationClosure_LamiBL_TurbWake_btest_OBJECT
Scanning dependencies of target Solve2D_Coupled4x4_IBL_CorrelationClosure_LamiBL_TurbWake_btest_build_vera
[100%] Checking style of test/system/CodeConsistency/Solve2D_Coupled4x4_IBL_CorrelationClosure_LamiBL_TurbWake_btest.cpp
[100%] Built target Solve2D_Coupled4x4_IBL_CorrelationClosure_LamiBL_TurbWake_btest_build_vera
Scanning dependencies of target Solve2D_Coupled4x4_IBL_CorrelationClosure_LamiBL_TurbWake_btest_build
[100%] Linking CXX executable Solve2D_Coupled4x4_IBL_CorrelationClosure_LamiBL_TurbWake_btest
[100%] Built target Solve2D_Coupled4x4_IBL_CorrelationClosure_LamiBL_TurbWake_btest_build
Scanning dependencies of target Solve2D_Uncoupled_HDGAdvectiveIBL_LamiBL_btest_OBJECT
[100%] Building CXX object test/system/CodeConsistency/CMakeFiles/Solve2D_Uncoupled_HDGAdvectiveIBL_LamiBL_btest_OBJECT.dir/Solve2D_Uncoupled_HDGAdvectiveIBL_LamiBL_btest.cpp.o
[100%] Built target Solve2D_Uncoupled_HDGAdvectiveIBL_LamiBL_btest_OBJECT
Scanning dependencies of target Solve2D_Uncoupled_HDGAdvectiveIBL_LamiBL_btest_build_vera
[100%] Checking style of test/system/CodeConsistency/Solve2D_Uncoupled_HDGAdvectiveIBL_LamiBL_btest.cpp
[100%] Built target Solve2D_Uncoupled_HDGAdvectiveIBL_LamiBL_btest_build_vera
Scanning dependencies of target Solve2D_Uncoupled_HDGAdvectiveIBL_LamiBL_btest_build
[100%] Linking CXX executable Solve2D_Uncoupled_HDGAdvectiveIBL_LamiBL_btest
[100%] Built target Solve2D_Uncoupled_HDGAdvectiveIBL_LamiBL_btest_build
Scanning dependencies of target PDEmitAVSensor2D_Consistency_RANSSA_btest_OBJECT
[100%] Building CXX object test/system/CodeConsistency/CMakeFiles/PDEmitAVSensor2D_Consistency_RANSSA_btest_OBJECT.dir/PDEmitAVSensor2D_Consistency_RANSSA_btest.cpp.o
[100%] Built target PDEmitAVSensor2D_Consistency_RANSSA_btest_OBJECT
Scanning dependencies of target PDEmitAVSensor2D_Consistency_RANSSA_btest_build_vera
[100%] Checking style of test/system/CodeConsistency/PDEmitAVSensor2D_Consistency_RANSSA_btest.cpp
[100%] Built target PDEmitAVSensor2D_Consistency_RANSSA_btest_build_vera
Scanning dependencies of target PDEmitAVSensor2D_Consistency_RANSSA_btest_build
[100%] Linking CXX executable PDEmitAVSensor2D_Consistency_RANSSA_btest
[100%] Built target PDEmitAVSensor2D_Consistency_RANSSA_btest_build
Scanning dependencies of target BCEulermitAVSensor2D_Consistency_RANSSA_btest_OBJECT
[100%] Building CXX object test/system/CodeConsistency/CMakeFiles/BCEulermitAVSensor2D_Consistency_RANSSA_btest_OBJECT.dir/BCEulermitAVSensor2D_Consistency_RANSSA_btest.cpp.o
[100%] Built target BCEulermitAVSensor2D_Consistency_RANSSA_btest_OBJECT
Scanning dependencies of target BCEulermitAVSensor2D_Consistency_RANSSA_btest_build_vera
[100%] Checking style of test/system/CodeConsistency/BCEulermitAVSensor2D_Consistency_RANSSA_btest.cpp
[100%] Built target BCEulermitAVSensor2D_Consistency_RANSSA_btest_build_vera
Scanning dependencies of target BCEulermitAVSensor2D_Consistency_RANSSA_btest_build
[100%] Linking CXX executable BCEulermitAVSensor2D_Consistency_RANSSA_btest
[100%] Built target BCEulermitAVSensor2D_Consistency_RANSSA_btest_build
Scanning dependencies of target Solve2D_Coupled4x4_IBL_Panel_NACA0004_FittedTransition_Forced_btest_build_vera
[100%] Checking style of test/system/CodeConsistency/Solve2D_Coupled4x4_IBL_Panel_NACA0004_FittedTransition_Forced_btest.cpp
[100%] Built target Solve2D_Coupled4x4_IBL_Panel_NACA0004_FittedTransition_Forced_btest_build_vera
Scanning dependencies of target Solve2D_Coupled4x4_IBL_Panel_NACA0004_FittedTransition_Forced_btest_OBJECT
[100%] Building CXX object test/system/CodeConsistency/CMakeFiles/Solve2D_Coupled4x4_IBL_Panel_NACA0004_FittedTransition_Forced_btest_OBJECT.dir/Solve2D_Coupled4x4_IBL_Panel_NACA0004_FittedTransition_Forced_btest.cpp.o
[100%] Built target Solve2D_Coupled4x4_IBL_Panel_NACA0004_FittedTransition_Forced_btest_OBJECT
Scanning dependencies of target Solve2D_Coupled4x4_IBL_Panel_NACA0004_FittedTransition_Forced_btest_build
[100%] Linking CXX executable Solve2D_Coupled4x4_IBL_Panel_NACA0004_FittedTransition_Forced_btest
[100%] Built target Solve2D_Coupled4x4_IBL_Panel_NACA0004_FittedTransition_Forced_btest_build
Scanning dependencies of target Solve2D_Coupled4x4_IBL_Panel_NACA0004_FittedTransition_TwoLayerNewton_btest_OBJECT
[100%] Building CXX object test/system/CodeConsistency/CMakeFiles/Solve2D_Coupled4x4_IBL_Panel_NACA0004_FittedTransition_TwoLayerNewton_btest_OBJECT.dir/Solve2D_Coupled4x4_IBL_Panel_NACA0004_FittedTransition_TwoLayerNewton_btest.cpp.o
[100%] Built target Solve2D_Coupled4x4_IBL_Panel_NACA0004_FittedTransition_TwoLayerNewton_btest_OBJECT
Scanning dependencies of target Solve2D_Coupled4x4_IBL_Panel_NACA0004_FittedTransition_TwoLayerNewton_btest_build_vera
[100%] Checking style of test/system/CodeConsistency/Solve2D_Coupled4x4_IBL_Panel_NACA0004_FittedTransition_TwoLayerNewton_btest.cpp
[100%] Built target Solve2D_Coupled4x4_IBL_Panel_NACA0004_FittedTransition_TwoLayerNewton_btest_build_vera
Scanning dependencies of target Solve2D_Coupled4x4_IBL_Panel_NACA0004_FittedTransition_TwoLayerNewton_btest_build
[100%] Linking CXX executable Solve2D_Coupled4x4_IBL_Panel_NACA0004_FittedTransition_TwoLayerNewton_btest
[100%] Built target Solve2D_Coupled4x4_IBL_Panel_NACA0004_FittedTransition_TwoLayerNewton_btest_build
Scanning dependencies of target PDEmitAVSensor1D_Consistency_btest_build_vera
[100%] Checking style of test/system/CodeConsistency/PDEmitAVSensor1D_Consistency_btest.cpp
[100%] Built target PDEmitAVSensor1D_Consistency_btest_build_vera
Scanning dependencies of target PDEmitAVSensor1D_Consistency_btest_OBJECT
[100%] Building CXX object test/system/CodeConsistency/CMakeFiles/PDEmitAVSensor1D_Consistency_btest_OBJECT.dir/PDEmitAVSensor1D_Consistency_btest.cpp.o
[100%] Built target PDEmitAVSensor1D_Consistency_btest_OBJECT
Scanning dependencies of target PDEmitAVSensor1D_Consistency_btest_build
[100%] Linking CXX executable PDEmitAVSensor1D_Consistency_btest
[100%] Built target PDEmitAVSensor1D_Consistency_btest_build
Scanning dependencies of target Solve2D_Coupled4x4_IBLSplitAmpLag_CorrelationClosure_LamiBL_TurbWake_btest_build_vera
[100%] Checking style of test/system/CodeConsistency/Solve2D_Coupled4x4_IBLSplitAmpLag_CorrelationClosure_LamiBL_TurbWake_btest.cpp
[100%] Built target Solve2D_Coupled4x4_IBLSplitAmpLag_CorrelationClosure_LamiBL_TurbWake_btest_build_vera
Scanning dependencies of target Solve2D_Coupled4x4_IBLSplitAmpLag_CorrelationClosure_LamiBL_TurbWake_btest_OBJECT
[100%] Building CXX object test/system/CodeConsistency/CMakeFiles/Solve2D_Coupled4x4_IBLSplitAmpLag_CorrelationClosure_LamiBL_TurbWake_btest_OBJECT.dir/Solve2D_Coupled4x4_IBLSplitAmpLag_CorrelationClosure_LamiBL_TurbWake_btest.cpp.o
[100%] Built target Solve2D_Coupled4x4_IBLSplitAmpLag_CorrelationClosure_LamiBL_TurbWake_btest_OBJECT
Scanning dependencies of target Solve2D_Coupled4x4_IBLSplitAmpLag_CorrelationClosure_LamiBL_TurbWake_btest_build
[100%] Linking CXX executable Solve2D_Coupled4x4_IBLSplitAmpLag_CorrelationClosure_LamiBL_TurbWake_btest
[100%] Built target Solve2D_Coupled4x4_IBLSplitAmpLag_CorrelationClosure_LamiBL_TurbWake_btest_build
Scanning dependencies of target Solve2D_Uncoupled_DGAdvectiveIBL_LamiBL_PTC_btest_OBJECT
[100%] Building CXX object test/system/CodeConsistency/CMakeFiles/Solve2D_Uncoupled_DGAdvectiveIBL_LamiBL_PTC_btest_OBJECT.dir/Solve2D_Uncoupled_DGAdvectiveIBL_LamiBL_PTC_btest.cpp.o
[100%] Built target Solve2D_Uncoupled_DGAdvectiveIBL_LamiBL_PTC_btest_OBJECT
Scanning dependencies of target Solve2D_Uncoupled_DGAdvectiveIBL_LamiBL_PTC_btest_build_vera
[100%] Checking style of test/system/CodeConsistency/Solve2D_Uncoupled_DGAdvectiveIBL_LamiBL_PTC_btest.cpp
[100%] Built target Solve2D_Uncoupled_DGAdvectiveIBL_LamiBL_PTC_btest_build_vera
Scanning dependencies of target Solve2D_Uncoupled_DGAdvectiveIBL_LamiBL_PTC_btest_build
[100%] Linking CXX executable Solve2D_Uncoupled_DGAdvectiveIBL_LamiBL_PTC_btest
[100%] Built target Solve2D_Uncoupled_DGAdvectiveIBL_LamiBL_PTC_btest_build
Scanning dependencies of target PDEEulermitAVDiffusion2D_RANSSA_Consistency_btest_OBJECT
[100%] Building CXX object test/system/CodeConsistency/CMakeFiles/PDEEulermitAVDiffusion2D_RANSSA_Consistency_btest_OBJECT.dir/PDEEulermitAVDiffusion2D_RANSSA_Consistency_btest.cpp.o
[100%] Built target PDEEulermitAVDiffusion2D_RANSSA_Consistency_btest_OBJECT
Scanning dependencies of target PDEEulermitAVDiffusion2D_RANSSA_Consistency_btest_build_vera
[100%] Checking style of test/system/CodeConsistency/PDEEulermitAVDiffusion2D_RANSSA_Consistency_btest.cpp
[100%] Built target PDEEulermitAVDiffusion2D_RANSSA_Consistency_btest_build_vera
Scanning dependencies of target PDEEulermitAVDiffusion2D_RANSSA_Consistency_btest_build
[100%] Linking CXX executable PDEEulermitAVDiffusion2D_RANSSA_Consistency_btest
[100%] Built target PDEEulermitAVDiffusion2D_RANSSA_Consistency_btest_build
Scanning dependencies of target BCEulermitAVSensor3D_Consistency_btest_build_vera
[100%] Checking style of test/system/CodeConsistency/BCEulermitAVSensor3D_Consistency_btest.cpp
[100%] Built target BCEulermitAVSensor3D_Consistency_btest_build_vera
Scanning dependencies of target BCEulermitAVSensor3D_Consistency_btest_OBJECT
[100%] Building CXX object test/system/CodeConsistency/CMakeFiles/BCEulermitAVSensor3D_Consistency_btest_OBJECT.dir/BCEulermitAVSensor3D_Consistency_btest.cpp.o
[100%] Built target BCEulermitAVSensor3D_Consistency_btest_OBJECT
Scanning dependencies of target BCEulermitAVSensor3D_Consistency_btest_build
[100%] Linking CXX executable BCEulermitAVSensor3D_Consistency_btest
[100%] Built target BCEulermitAVSensor3D_Consistency_btest_build
Scanning dependencies of target Solve2D_Coupled4x4_IBL_Panel_NACA0004_LamiBL_TurbWake_btest_OBJECT
[100%] Building CXX object test/system/CodeConsistency/CMakeFiles/Solve2D_Coupled4x4_IBL_Panel_NACA0004_LamiBL_TurbWake_btest_OBJECT.dir/Solve2D_Coupled4x4_IBL_Panel_NACA0004_LamiBL_TurbWake_btest.cpp.o
[100%] Built target Solve2D_Coupled4x4_IBL_Panel_NACA0004_LamiBL_TurbWake_btest_OBJECT
Scanning dependencies of target Solve2D_Coupled4x4_IBL_Panel_NACA0004_LamiBL_TurbWake_btest_build_vera
[100%] Checking style of test/system/CodeConsistency/Solve2D_Coupled4x4_IBL_Panel_NACA0004_LamiBL_TurbWake_btest.cpp
[100%] Built target Solve2D_Coupled4x4_IBL_Panel_NACA0004_LamiBL_TurbWake_btest_build_vera
Scanning dependencies of target Solve2D_Coupled4x4_IBL_Panel_NACA0004_LamiBL_TurbWake_btest_build
[100%] Linking CXX executable Solve2D_Coupled4x4_IBL_Panel_NACA0004_LamiBL_TurbWake_btest
[100%] Built target Solve2D_Coupled4x4_IBL_Panel_NACA0004_LamiBL_TurbWake_btest_build
Scanning dependencies of target BCEulermitAVSensor3D_Consistency_RANSSA_btest_OBJECT
[100%] Building CXX object test/system/CodeConsistency/CMakeFiles/BCEulermitAVSensor3D_Consistency_RANSSA_btest_OBJECT.dir/BCEulermitAVSensor3D_Consistency_RANSSA_btest.cpp.o
[100%] Built target BCEulermitAVSensor3D_Consistency_RANSSA_btest_OBJECT
Scanning dependencies of target BCEulermitAVSensor3D_Consistency_RANSSA_btest_build_vera
[100%] Checking style of test/system/CodeConsistency/BCEulermitAVSensor3D_Consistency_RANSSA_btest.cpp
[100%] Built target BCEulermitAVSensor3D_Consistency_RANSSA_btest_build_vera
Scanning dependencies of target BCEulermitAVSensor3D_Consistency_RANSSA_btest_build
[100%] Linking CXX executable BCEulermitAVSensor3D_Consistency_RANSSA_btest
[100%] Built target BCEulermitAVSensor3D_Consistency_RANSSA_btest_build
Scanning dependencies of target PDEEulermitAVDiffusion1D_Consistency_btest_OBJECT
[100%] Building CXX object test/system/CodeConsistency/CMakeFiles/PDEEulermitAVDiffusion1D_Consistency_btest_OBJECT.dir/PDEEulermitAVDiffusion1D_Consistency_btest.cpp.o
[100%] Built target PDEEulermitAVDiffusion1D_Consistency_btest_OBJECT
Scanning dependencies of target PDEEulermitAVDiffusion1D_Consistency_btest_build_vera
[100%] Checking style of test/system/CodeConsistency/PDEEulermitAVDiffusion1D_Consistency_btest.cpp
[100%] Built target PDEEulermitAVDiffusion1D_Consistency_btest_build_vera
Scanning dependencies of target PDEEulermitAVDiffusion1D_Consistency_btest_build
[100%] Linking CXX executable PDEEulermitAVDiffusion1D_Consistency_btest
[100%] Built target PDEEulermitAVDiffusion1D_Consistency_btest_build
Scanning dependencies of target check_system_build
[100%] Built target check_system_build
Scanning dependencies of target memcheck_system
   Site: reynolds
   Build name: Linux-icpc
Create new tag: 20200414-1353 - Experimental
Test project /jenkins/workspace/SANS_Weekly/builddir/debug_intel/buildnode/reynolds/build/debug_intel
        Start 1700: SolverInterface_Galerkin_Stabilized_btest_memcheck
  1/109 Test #1700: SolverInterface_Galerkin_Stabilized_btest_memcheck ...........................................   Passed   33.38 sec
        Start 1702: SolverInterface_DGAdvective_btest_memcheck
  2/109 Test #1702: SolverInterface_DGAdvective_btest_memcheck ...................................................   Passed   24.63 sec
        Start 1704: SolverInterface_DGBR2_btest_memcheck
  3/109 Test #1704: SolverInterface_DGBR2_btest_memcheck .........................................................   Passed   57.98 sec
        Start 1706: ErrorOrder_2D_CG_Triangle_AD_btest_memcheck
  4/109 Test #1706: ErrorOrder_2D_CG_Triangle_AD_btest_memcheck ..................................................   Passed   15.57 sec
        Start 1708: ErrorOrder_2D_EDG_Triangle_AD_btest_memcheck
  5/109 Test #1708: ErrorOrder_2D_EDG_Triangle_AD_btest_memcheck .................................................   Passed   74.46 sec
        Start 1710: ErrorOrder_3D_DGBR2_Sphere_Triangle_AD_btest_memcheck
  6/109 Test #1710: ErrorOrder_3D_DGBR2_Sphere_Triangle_AD_btest_memcheck ........................................   Passed   28.12 sec
        Start 1712: ErrorOrder_3D_CG_Tet_AD_btest_memcheck
  7/109 Test #1712: ErrorOrder_3D_CG_Tet_AD_btest_memcheck .......................................................   Passed   22.29 sec
        Start 1714: ErrorOrder_4D_DG_Pentatope_btest_memcheck
  8/109 Test #1714: ErrorOrder_4D_DG_Pentatope_btest_memcheck ....................................................   Passed  2696.38 sec
        Start 1716: ErrorEstimateOrder_2D_HDG_Triangle_AD_btest_memcheck
  9/109 Test #1716: ErrorEstimateOrder_2D_HDG_Triangle_AD_btest_memcheck .........................................   Passed  407.54 sec
        Start 1718: ErrorOrder_1D_DGBR2_BuckleyLeverett_ST_btest_memcheck
 10/109 Test #1718: ErrorOrder_1D_DGBR2_BuckleyLeverett_ST_btest_memcheck ........................................   Passed  393.80 sec
        Start 1720: ErrorOrder_1D_HDG_AD_btest_memcheck
 11/109 Test #1720: ErrorOrder_1D_HDG_AD_btest_memcheck ..........................................................   Passed   16.71 sec
        Start 1722: ErrorOrder_1D_HDG_AD_BDF_btest_memcheck
 12/109 Test #1722: ErrorOrder_1D_HDG_AD_BDF_btest_memcheck ......................................................   Passed  285.99 sec
        Start 1724: ErrorOrder_1D_DGBR2_AD_BDF_btest_memcheck
 13/109 Test #1724: ErrorOrder_1D_DGBR2_AD_BDF_btest_memcheck ....................................................   Passed  172.54 sec
        Start 1726: ErrorEstimateOrder_2D_DGAdvective_Triangle_AD_btest_memcheck
 14/109 Test #1726: ErrorEstimateOrder_2D_DGAdvective_Triangle_AD_btest_memcheck .................................   Passed  516.54 sec
        Start 1728: ErrorEstimateOrder_1D_CG_Line_AD_btest_memcheck
 15/109 Test #1728: ErrorEstimateOrder_1D_CG_Line_AD_btest_memcheck ..............................................   Passed   18.24 sec
        Start 1730: Adjoint2D_HDG_Triangle_AD_sansLG_btest_memcheck
 16/109 Test #1730: Adjoint2D_HDG_Triangle_AD_sansLG_btest_memcheck ..............................................   Passed  283.71 sec
        Start 1732: Adjoint1D_DGBR2_BuckleyLeverett_ST_btest_memcheck
 17/109 Test #1732: Adjoint1D_DGBR2_BuckleyLeverett_ST_btest_memcheck ............................................   Passed  167.22 sec
        Start 1734: ErrorOrder_1D_CG_AD_btest_memcheck
 18/109 Test #1734: ErrorOrder_1D_CG_AD_btest_memcheck ...........................................................   Passed   15.17 sec
        Start 1736: ErrorEstimateOrder_3D_CG_Tet_AD_btest_memcheck
 19/109 Test #1736: ErrorEstimateOrder_3D_CG_Tet_AD_btest_memcheck ...............................................   Passed    6.76 sec
        Start 1738: ErrorOrder_1D_DGBR2_TwoPhase_ST_btest_memcheck
 20/109 Test #1738: ErrorOrder_1D_DGBR2_TwoPhase_ST_btest_memcheck ...............................................   Passed  254.19 sec
        Start 1740: Adjoint2D_DGAdvective_Triangle_AD_btest_memcheck
 21/109 Test #1740: Adjoint2D_DGAdvective_Triangle_AD_btest_memcheck .............................................   Passed   28.83 sec
        Start 1742: Solve2D_DGAdvective_LinearRobin_mitLG_sansLG_Consistency_AD_btest_memcheck
 22/109 Test #1742: Solve2D_DGAdvective_LinearRobin_mitLG_sansLG_Consistency_AD_btest_memcheck ...................   Passed   31.09 sec
        Start 1744: ErrorOrder_2D_HDG_Triangle_AD_btest_memcheck
 23/109 Test #1744: ErrorOrder_2D_HDG_Triangle_AD_btest_memcheck .................................................   Passed  100.53 sec
        Start 1746: ErrorOrder_1D_HDGAdvective_Advection_btest_memcheck
 24/109 Test #1746: ErrorOrder_1D_HDGAdvective_Advection_btest_memcheck ..........................................   Passed   14.21 sec
        Start 1748: ErrorOrder_1D_CG_AD_BDF_btest_memcheck
 25/109 Test #1748: ErrorOrder_1D_CG_AD_BDF_btest_memcheck .......................................................   Passed  564.37 sec
        Start 1750: ErrorOrder_3D_CG_Sphere_Triangle_AD_btest_memcheck
 26/109 Test #1750: ErrorOrder_3D_CG_Sphere_Triangle_AD_btest_memcheck ...........................................   Passed   45.06 sec
        Start 1752: ErrorEstimateOrder_1D_DGBR2_Line_AD_btest_memcheck
 27/109 Test #1752: ErrorEstimateOrder_1D_DGBR2_Line_AD_btest_memcheck ...........................................   Passed   21.03 sec
        Start 1754: ErrorOrder_3D_CG_Hex_AD_btest_memcheck
 28/109 Test #1754: ErrorOrder_3D_CG_Hex_AD_btest_memcheck .......................................................   Passed   15.51 sec
        Start 1756: ErrorOrder_1D_HDG_Burgers_btest_memcheck
 29/109 Test #1756: ErrorOrder_1D_HDG_Burgers_btest_memcheck .....................................................   Passed  1052.76 sec
        Start 1758: ErrorEstimateOrder_2D_CG_Nodal_Triangle_AD_btest_memcheck
 30/109 Test #1758: ErrorEstimateOrder_2D_CG_Nodal_Triangle_AD_btest_memcheck ....................................   Passed  515.76 sec
        Start 1760: ErrorOrder_1D_DGBR2_Burgers_btest_memcheck
 31/109 Test #1760: ErrorOrder_1D_DGBR2_Burgers_btest_memcheck ...................................................   Passed  156.12 sec
        Start 1762: ErrorOrder_2D_DGAdvective_Flat_Line_AD_btest_memcheck
 32/109 Test #1762: ErrorOrder_2D_DGAdvective_Flat_Line_AD_btest_memcheck ........................................   Passed   23.37 sec
        Start 1764: ErrorOrder_3D_DGBR2_Tet_AD_btest_memcheck
 33/109 Test #1764: ErrorOrder_3D_DGBR2_Tet_AD_btest_memcheck ....................................................   Passed   27.96 sec
        Start 1766: ErrorOrder_1D_DGBR2_AD_btest_memcheck
 34/109 Test #1766: ErrorOrder_1D_DGBR2_AD_btest_memcheck ........................................................   Passed   22.16 sec
        Start 1768: ErrorOrder_2D_DGAdvective_Annulus_Triangle_btest_memcheck
 35/109 Test #1768: ErrorOrder_2D_DGAdvective_Annulus_Triangle_btest_memcheck ....................................   Passed   22.47 sec
        Start 1770: ErrorEstimateOrder_2D_CG_Triangle_RD_btest_memcheck
 36/109 Test #1770: ErrorEstimateOrder_2D_CG_Triangle_RD_btest_memcheck ..........................................   Passed  181.31 sec
        Start 1772: ErrorOrder_2D_DGAdvective_Circle_Line_AD_btest_memcheck
 37/109 Test #1772: ErrorOrder_2D_DGAdvective_Circle_Line_AD_btest_memcheck ......................................   Passed   14.96 sec
        Start 1774: ErrorOrder_2D_CG_Quad_AD_btest_memcheck
 38/109 Test #1774: ErrorOrder_2D_CG_Quad_AD_btest_memcheck ......................................................   Passed   14.10 sec
        Start 1776: ErrorEstimateOrder_2D_DGBR2_Triangle_AD_btest_memcheck
 39/109 Test #1776: ErrorEstimateOrder_2D_DGBR2_Triangle_AD_btest_memcheck .......................................   Passed  200.87 sec
        Start 1778: ErrorOrder_2D_DGAdvective_Circle_Line_ShallowWater_btest_memcheck
 40/109 Test #1778: ErrorOrder_2D_DGAdvective_Circle_Line_ShallowWater_btest_memcheck ............................   Passed   20.27 sec
        Start 1780: ErrorEstimateOrder_2D_CG_Triangle_AD_btest_memcheck
 41/109 Test #1780: ErrorEstimateOrder_2D_CG_Triangle_AD_btest_memcheck ..........................................   Passed  472.76 sec
        Start 1782: ErrorOrder_2D_DGBR2_Triangle_AD_btest_memcheck
 42/109 Test #1782: ErrorOrder_2D_DGBR2_Triangle_AD_btest_memcheck ...............................................   Passed   34.00 sec
        Start 1784: ErrorOrder_1D_DGAdvective_ShallowWater_btest_memcheck
 43/109 Test #1784: ErrorOrder_1D_DGAdvective_ShallowWater_btest_memcheck ........................................   Passed   19.31 sec
        Start 1786: ErrorOrder_3D_DGBR2_Periodic_Hex_AD_btest_memcheck
 44/109 Test #1786: ErrorOrder_3D_DGBR2_Periodic_Hex_AD_btest_memcheck ...........................................   Passed   19.68 sec
        Start 1788: ErrorOrder_1D_DGBR2_AD_HB_btest_memcheck
 45/109 Test #1788: ErrorOrder_1D_DGBR2_AD_HB_btest_memcheck .....................................................   Passed   34.29 sec
        Start 1790: ErrorOrder_2D_DGAdvective_Annulus_Quad_btest_memcheck
 46/109 Test #1790: ErrorOrder_2D_DGAdvective_Annulus_Quad_btest_memcheck ........................................   Passed   15.91 sec
        Start 1792: ErrorOrder_2D_CGStabilized_RANS_MMS_btest_memcheck
 47/109 Test #1792: ErrorOrder_2D_CGStabilized_RANS_MMS_btest_memcheck ...........................................   Passed   57.77 sec
        Start 1794: Adjoint2D_HDG_Triangle_AD_mitState_btest_memcheck
 48/109 Test #1794: Adjoint2D_HDG_Triangle_AD_mitState_btest_memcheck ............................................   Passed  206.52 sec
        Start 1796: ErrorOrder_2D_DGBR2_RANS_MMS_btest_memcheck
 49/109 Test #1796: ErrorOrder_2D_DGBR2_RANS_MMS_btest_memcheck ..................................................   Passed   68.44 sec
        Start 1798: Adjoint2D_DGBR2_Triangle_AD_btest_memcheck
 50/109 Test #1798: Adjoint2D_DGBR2_Triangle_AD_btest_memcheck ...................................................   Passed   30.15 sec
        Start 1800: Adjoint2D_CG_Triangle_AD_btest_memcheck
 51/109 Test #1800: Adjoint2D_CG_Triangle_AD_btest_memcheck ......................................................   Passed   14.26 sec
        Start 1802: ElementLocalSolve3D_DGBR2_Tet_AD_btest_memcheck
 52/109 Test #1802: ElementLocalSolve3D_DGBR2_Tet_AD_btest_memcheck ..............................................   Passed  254.64 sec
        Start 1804: AlgebraicEquationSet_Local_VMSD_Triangle_AD_btest_memcheck
 53/109 Test #1804: AlgebraicEquationSet_Local_VMSD_Triangle_AD_btest_memcheck ...................................   Passed   19.44 sec
        Start 1806: LocalSolve3D_HDG_Tet_AD_btest_memcheck
 54/109 Test #1806: LocalSolve3D_HDG_Tet_AD_btest_memcheck .......................................................   Passed  816.08 sec
        Start 1808: LocalSolve3D_Split_HDG_Tet_AD_btest_memcheck
 55/109 Test #1808: LocalSolve3D_Split_HDG_Tet_AD_btest_memcheck .................................................   Passed  534.13 sec
        Start 1810: EdgeLocalSolve3D_Dual_Galerkin_Stabilized_AD_btest_memcheck
 56/109 Test #1810: EdgeLocalSolve3D_Dual_Galerkin_Stabilized_AD_btest_memcheck ..................................   Passed  125.57 sec
        Start 1812: EdgeLocalSolve2D_Dual_Galerkin_Stabilized_AR_btest_memcheck
 57/109 Test #1812: EdgeLocalSolve2D_Dual_Galerkin_Stabilized_AR_btest_memcheck ..................................   Passed  189.77 sec
        Start 1814: EdgeLocalSolve2D_Dual_Galerkin_Stabilized_Euler_btest_memcheck
 58/109 Test #1814: EdgeLocalSolve2D_Dual_Galerkin_Stabilized_Euler_btest_memcheck ...............................   Passed   21.64 sec
        Start 1816: LocalSolve2D_Split_HDG_Triangle_AD_btest_memcheck
 59/109 Test #1816: LocalSolve2D_Split_HDG_Triangle_AD_btest_memcheck ............................................   Passed   72.81 sec
        Start 1818: LocalSolve1D_Split_DGBR2_AD_btest_memcheck
 60/109 Test #1818: LocalSolve1D_Split_DGBR2_AD_btest_memcheck ...................................................   Passed   17.15 sec
        Start 1820: LocalSolve1D_HDG_AD_btest_memcheck
 61/109 Test #1820: LocalSolve1D_HDG_AD_btest_memcheck ...........................................................   Passed   18.25 sec
        Start 1822: AlgebraicEquationSet_Local_VMSDBR2_Triangle_AD_btest_memcheck
 62/109 Test #1822: AlgebraicEquationSet_Local_VMSDBR2_Triangle_AD_btest_memcheck ................................   Passed   18.85 sec
        Start 1824: LocalSolve2D_HDG_Triangle_AD_btest_memcheck
 63/109 Test #1824: LocalSolve2D_HDG_Triangle_AD_btest_memcheck ..................................................   Passed   67.54 sec
        Start 1826: ElementLocalSolve1D_DGBR2_Triangle_AD_btest_memcheck
 64/109 Test #1826: ElementLocalSolve1D_DGBR2_Triangle_AD_btest_memcheck .........................................   Passed   20.45 sec
        Start 1828: LocalSolve1D_Split_HDG_AD_btest_memcheck
 65/109 Test #1828: LocalSolve1D_Split_HDG_AD_btest_memcheck .....................................................   Passed   18.05 sec
        Start 1830: LocalSolve2D_Split_DGBR2_Triangle_AD_AV_btest_memcheck
 66/109 Test #1830: LocalSolve2D_Split_DGBR2_Triangle_AD_AV_btest_memcheck .......................................   Passed  293.02 sec
        Start 1832: ElementLocalSolve3D_DGAdvective_Tet_AD_btest_memcheck
 67/109 Test #1832: ElementLocalSolve3D_DGAdvective_Tet_AD_btest_memcheck ........................................   Passed  108.24 sec
        Start 1834: EdgeLocalSolve1D_Dual_Galerkin_Stabilized_Line_AD_btest_memcheck
 68/109 Test #1834: EdgeLocalSolve1D_Dual_Galerkin_Stabilized_Line_AD_btest_memcheck .............................   Passed   19.06 sec
        Start 1836: ElementDualLocalSolve3D_Galerkin_Stabilized_Triangle_AD_btest_memcheck
 69/109 Test #1836: ElementDualLocalSolve3D_Galerkin_Stabilized_Triangle_AD_btest_memcheck .......................   Passed  422.83 sec
        Start 1838: EdgeLocalSolve2D_Dual_Galerkin_Stabilized_AD_btest_memcheck
 70/109 Test #1838: EdgeLocalSolve2D_Dual_Galerkin_Stabilized_AD_btest_memcheck ..................................   Passed  222.74 sec
        Start 1840: ElementLocalSolve2D_DGBR2_Triangle_AD_btest_memcheck
 71/109 Test #1840: ElementLocalSolve2D_DGBR2_Triangle_AD_btest_memcheck .........................................   Passed  216.91 sec
        Start 1842: ElementDualLocalSolve2D_Galerkin_Stabilized_Triangle_AD_btest_memcheck
 72/109 Test #1842: ElementDualLocalSolve2D_Galerkin_Stabilized_Triangle_AD_btest_memcheck .......................   Passed  151.54 sec
        Start 1844: Block_1D_Decoupled_Burgers_btest_memcheck
 73/109 Test #1844: Block_1D_Decoupled_Burgers_btest_memcheck ....................................................   Passed  647.96 sec
        Start 1846: Block_1D_Decoupled_AD_btest_memcheck
 74/109 Test #1846: Block_1D_Decoupled_AD_btest_memcheck .........................................................   Passed   11.02 sec
        Start 1848: AnalyticSolve2D_HDG_Triangle_NavierStokes_UniformStream_btest_memcheck
 75/109 Test #1848: AnalyticSolve2D_HDG_Triangle_NavierStokes_UniformStream_btest_memcheck .......................   Passed   22.61 sec
        Start 1850: AnalyticSolve2D_DGAdvective_IBL_StagnationFlow_SingleElem_LamiBL_btest_memcheck
 76/109 Test #1850: AnalyticSolve2D_DGAdvective_IBL_StagnationFlow_SingleElem_LamiBL_btest_memcheck ..............   Passed   30.09 sec
        Start 1852: AnalyticSolve2D_HDG_Triangle_NavierStokes_btest_memcheck
 77/109 Test #1852: AnalyticSolve2D_HDG_Triangle_NavierStokes_btest_memcheck .....................................   Passed  513.94 sec
        Start 1854: AnalyticSolve2D_DGBR2_Triangle_NavierStokes_UniformStream_btest_memcheck
 78/109 Test #1854: AnalyticSolve2D_DGBR2_Triangle_NavierStokes_UniformStream_btest_memcheck .....................   Passed   64.95 sec
        Start 1856: AnalyticSolve2D_DGAdvective_Triangle_Euler_UniformStream_btest_memcheck
 79/109 Test #1856: AnalyticSolve2D_DGAdvective_Triangle_Euler_UniformStream_btest_memcheck ......................   Passed  108.33 sec
        Start 1858: AnalyticSolve2D_DGAdvective_IBL_StagnationFlow_LamiBL_btest_memcheck
 80/109 Test #1858: AnalyticSolve2D_DGAdvective_IBL_StagnationFlow_LamiBL_btest_memcheck .........................   Passed   63.58 sec
        Start 1860: AnalyticSolve_HDG_AD_btest_memcheck
 81/109 Test #1860: AnalyticSolve_HDG_AD_btest_memcheck ..........................................................   Passed   35.28 sec
        Start 1862: AnalyticSolve2D_DGBR2_Triangle_NavierStokes_btest_memcheck
 82/109 Test #1862: AnalyticSolve2D_DGBR2_Triangle_NavierStokes_btest_memcheck ...................................   Passed  127.17 sec
        Start 1864: Solve2D_Coupled4x4_HDGAdv_IBL_Panel_NACA0004_LamiBL_TurbWake_btest_memcheck
 83/109 Test #1864: Solve2D_Coupled4x4_HDGAdv_IBL_Panel_NACA0004_LamiBL_TurbWake_btest_memcheck ..................   Passed  1488.76 sec
        Start 1866: Solve2D_Coupled4x4_IBL_Panel_NACA0004_LamiBL_TurbWake_btest_memcheck
 84/109 Test #1866: Solve2D_Coupled4x4_IBL_Panel_NACA0004_LamiBL_TurbWake_btest_memcheck .........................***Timeout 3600.05 sec

        Start 1868: Solve2D_Coupled4x4_IBLUniField_LamiBL_TurbWake_CorrelationClosure_PTC_btest_memcheck
 85/109 Test #1868: Solve2D_Coupled4x4_IBLUniField_LamiBL_TurbWake_CorrelationClosure_PTC_btest_memcheck .........   Passed  922.11 sec
        Start 1870: PDEmitAVSensor2D_Consistency_RANSSA_btest_memcheck
 86/109 Test #1870: PDEmitAVSensor2D_Consistency_RANSSA_btest_memcheck ...........................................   Passed    9.16 sec
        Start 1872: Solve2D_Uncoupled_HDGAdvectiveIBL_LamiBL_btest_memcheck
 87/109 Test #1872: Solve2D_Uncoupled_HDGAdvectiveIBL_LamiBL_btest_memcheck ......................................   Passed  310.36 sec
        Start 1874: AlgebraicEquationSet_PTC_VMSD_Triangle_SA_btest_memcheck
 88/109 Test #1874: AlgebraicEquationSet_PTC_VMSD_Triangle_SA_btest_memcheck .....................................   Passed    8.10 sec
        Start 1876: PDEmitAVSensor1D_Consistency_btest_memcheck
 89/109 Test #1876: PDEmitAVSensor1D_Consistency_btest_memcheck ..................................................   Passed    9.97 sec
        Start 1878: PDEEulermitAVDiffusion3D_RANSSA_Consistency_btest_memcheck
 90/109 Test #1878: PDEEulermitAVDiffusion3D_RANSSA_Consistency_btest_memcheck ...................................   Passed    7.96 sec
        Start 1880: Solve2D_Coupled4x4_IBLSplitAmpLag_CorrelationClosure_CapturedTransition_PTC_btest_memcheck
 91/109 Test #1880: Solve2D_Coupled4x4_IBLSplitAmpLag_CorrelationClosure_CapturedTransition_PTC_btest_memcheck ...   Passed  677.01 sec
        Start 1882: PDEEulermitAVDiffusion3D_Consistency_btest_memcheck
 92/109 Test #1882: PDEEulermitAVDiffusion3D_Consistency_btest_memcheck ..........................................   Passed   10.18 sec
        Start 1884: Solve2D_Coupled4x4_IBL_Panel_NACA0004_FittedTransition_Forced_btest_memcheck
 93/109 Test #1884: Solve2D_Coupled4x4_IBL_Panel_NACA0004_FittedTransition_Forced_btest_memcheck .................   Passed  3184.39 sec
        Start 1886: Solve2D_Coupled4x4_IBL_Panel_NACA0004_FittedTransition_TwoLayerNewton_btest_memcheck
 94/109 Test #1886: Solve2D_Coupled4x4_IBL_Panel_NACA0004_FittedTransition_TwoLayerNewton_btest_memcheck .........   Passed  2226.61 sec
        Start 1888: Solve2D_Coupled4x4_IBLSplitAmpLag_CorrelationClosure_LamiBL_TurbWake_btest_memcheck
 95/109 Test #1888: Solve2D_Coupled4x4_IBLSplitAmpLag_CorrelationClosure_LamiBL_TurbWake_btest_memcheck ..........   Passed  1132.17 sec
        Start 1890: PDEEulermitAVDiffusion1D_Consistency_btest_memcheck
 96/109 Test #1890: PDEEulermitAVDiffusion1D_Consistency_btest_memcheck ..........................................   Passed    6.13 sec
        Start 1892: PDEEulermitAVDiffusion2D_RANSSA_Consistency_btest_memcheck
 97/109 Test #1892: PDEEulermitAVDiffusion2D_RANSSA_Consistency_btest_memcheck ...................................   Passed    8.54 sec
        Start 1894: BCEulermitAVSensor2D_Consistency_RANSSA_btest_memcheck
 98/109 Test #1894: BCEulermitAVSensor2D_Consistency_RANSSA_btest_memcheck .......................................   Passed    8.47 sec
        Start 1896: BCEulermitAVSensor3D_Consistency_btest_memcheck
 99/109 Test #1896: BCEulermitAVSensor3D_Consistency_btest_memcheck ..............................................   Passed    6.92 sec
        Start 1898: BCEulermitAVSensor3D_Consistency_RANSSA_btest_memcheck
100/109 Test #1898: BCEulermitAVSensor3D_Consistency_RANSSA_btest_memcheck .......................................   Passed   10.32 sec
        Start 1900: Solve2D_Uncoupled_DGAdvectiveIBLUniField_CorrelationClosure_LamiBL_btest_memcheck
101/109 Test #1900: Solve2D_Uncoupled_DGAdvectiveIBLUniField_CorrelationClosure_LamiBL_btest_memcheck ............   Passed   76.11 sec
        Start 1902: PDEmitAVSensor2D_Consistency_btest_memcheck
102/109 Test #1902: PDEmitAVSensor2D_Consistency_btest_memcheck ..................................................   Passed   14.26 sec
        Start 1904: PDEmitAVSensor3D_Consistency_RANSSA_btest_memcheck
103/109 Test #1904: PDEmitAVSensor3D_Consistency_RANSSA_btest_memcheck ...........................................   Passed    9.00 sec
        Start 1906: Solve2D_XfoilLikePanelMethod_btest_memcheck
104/109 Test #1906: Solve2D_XfoilLikePanelMethod_btest_memcheck ..................................................   Passed  589.51 sec
        Start 1908: PDEmitAVSensor3D_Consistency_btest_memcheck
105/109 Test #1908: PDEmitAVSensor3D_Consistency_btest_memcheck ..................................................   Passed   11.24 sec
        Start 1910: Solve2D_Uncoupled_DGAdvectiveIBL_LamiBL_PTC_btest_memcheck
106/109 Test #1910: Solve2D_Uncoupled_DGAdvectiveIBL_LamiBL_PTC_btest_memcheck ...................................   Passed  1178.89 sec
        Start 1912: BCEulermitAVSensor2D_Consistency_btest_memcheck
107/109 Test #1912: BCEulermitAVSensor2D_Consistency_btest_memcheck ..............................................   Passed   10.70 sec
        Start 1914: Solve2D_Coupled4x4_IBL_CorrelationClosure_LamiBL_TurbWake_btest_memcheck
108/109 Test #1914: Solve2D_Coupled4x4_IBL_CorrelationClosure_LamiBL_TurbWake_btest_memcheck .....................   Passed  961.74 sec
        Start 1916: PDEEulermitAVDiffusion2D_Consistency_btest_memcheck
109/109 Test #1916: PDEEulermitAVDiffusion2D_Consistency_btest_memcheck ..........................................   Passed    7.20 sec

99% tests passed, 1 tests failed out of 109

Label Time Summary:
SANSMemCheck_system    = 31276.53 sec (109 tests)

Total Test time (real) = 31276.79 sec

The following tests FAILED:
	1866 - Solve2D_Coupled4x4_IBL_Panel_NACA0004_LamiBL_TurbWake_btest_memcheck (Timeout)
Errors while running CTest
test/system/CMakeFiles/memcheck_system.dir/build.make:57: recipe for target 'test/system/CMakeFiles/memcheck_system' failed
make[3]: *** [test/system/CMakeFiles/memcheck_system] Error 8
CMakeFiles/Makefile2:174926: recipe for target 'test/system/CMakeFiles/memcheck_system.dir/all' failed
make[2]: *** [test/system/CMakeFiles/memcheck_system.dir/all] Error 2
CMakeFiles/Makefile2:174933: recipe for target 'test/system/CMakeFiles/memcheck_system.dir/rule' failed
make[1]: *** [test/system/CMakeFiles/memcheck_system.dir/rule] Error 2
Makefile:61468: recipe for target 'memcheck_system' failed
make: *** [memcheck_system] Error 2

real	614m50.649s
user	587m37.160s
sys	42m27.416s
+ status=1
++ find /jenkins/workspace/SANS_Weekly/builddir/debug_intel/buildnode/reynolds/build/debug_intel -name Test.xml
+ mv /jenkins/workspace/SANS_Weekly/builddir/debug_intel/buildnode/reynolds/build/debug_intel/Testing/20200414-1353/Test.xml /jenkins/workspace/SANS_Weekly/builddir/debug_intel/buildnode/reynolds/build/Test_system_memcheck.xml
+ '[' 1 -eq 1 ']'
+ exit 1
Build step 'Execute shell' marked build as failure
[GNU C Compiler (gcc)Clang (LLVM based)Intel Compiler (C, Fortran)Vera++] Skipping execution of recorder since overall result is 'FAILURE'
[Valgrind] Files to copy:
[Valgrind] build/debug_intel/test/valgrind.10610.memcheck.xml
[Valgrind] build/debug_intel/test/valgrind.10645.memcheck.xml
[Valgrind] build/debug_intel/test/valgrind.10778.memcheck.xml
[Valgrind] build/debug_intel/test/valgrind.10843.memcheck.xml
[Valgrind] build/debug_intel/test/valgrind.10885.memcheck.xml
[Valgrind] build/debug_intel/test/valgrind.11416.memcheck.xml
[Valgrind] build/debug_intel/test/valgrind.11523.memcheck.xml
[Valgrind] build/debug_intel/test/valgrind.11534.memcheck.xml
[Valgrind] build/debug_intel/test/valgrind.11537.memcheck.xml
[Valgrind] build/debug_intel/test/valgrind.11674.memcheck.xml
[Valgrind] build/debug_intel/test/valgrind.12942.memcheck.xml
[Valgrind] build/debug_intel/test/valgrind.13394.memcheck.xml
[Valgrind] build/debug_intel/test/valgrind.13426.memcheck.xml
[Valgrind] build/debug_intel/test/valgrind.13512.memcheck.xml
[Valgrind] build/debug_intel/test/valgrind.14141.memcheck.xml
[Valgrind] build/debug_intel/test/valgrind.14439.memcheck.xml
[Valgrind] build/debug_intel/test/valgrind.15009.memcheck.xml
[Valgrind] build/debug_intel/test/valgrind.15016.memcheck.xml
[Valgrind] build/debug_intel/test/valgrind.1573.memcheck.xml
[Valgrind] build/debug_intel/test/valgrind.17014.memcheck.xml
[Valgrind] build/debug_intel/test/valgrind.18260.memcheck.xml
[Valgrind] build/debug_intel/test/valgrind.18424.memcheck.xml
[Valgrind] build/debug_intel/test/valgrind.18480.memcheck.xml
[Valgrind] build/debug_intel/test/valgrind.18888.memcheck.xml
[Valgrind] build/debug_intel/test/valgrind.18929.memcheck.xml
[Valgrind] build/debug_intel/test/valgrind.18983.memcheck.xml
[Valgrind] build/debug_intel/test/valgrind.19286.memcheck.xml
[Valgrind] build/debug_intel/test/valgrind.19367.memcheck.xml
[Valgrind] build/debug_intel/test/valgrind.19449.memcheck.xml
[Valgrind] build/debug_intel/test/valgrind.20372.memcheck.xml
[Valgrind] build/debug_intel/test/valgrind.20422.memcheck.xml
[Valgrind] build/debug_intel/test/valgrind.20770.memcheck.xml
[Valgrind] build/debug_intel/test/valgrind.20985.memcheck.xml
[Valgrind] build/debug_intel/test/valgrind.21089.memcheck.xml
[Valgrind] build/debug_intel/test/valgrind.21294.memcheck.xml
[Valgrind] build/debug_intel/test/valgrind.2168.memcheck.xml
[Valgrind] build/debug_intel/test/valgrind.22302.memcheck.xml
[Valgrind] build/debug_intel/test/valgrind.22334.memcheck.xml
[Valgrind] build/debug_intel/test/valgrind.22459.memcheck.xml
[Valgrind] build/debug_intel/test/valgrind.23261.memcheck.xml
[Valgrind] build/debug_intel/test/valgrind.23468.memcheck.xml
[Valgrind] build/debug_intel/test/valgrind.23685.memcheck.xml
[Valgrind] build/debug_intel/test/valgrind.24021.memcheck.xml
[Valgrind] build/debug_intel/test/valgrind.24160.memcheck.xml
[Valgrind] build/debug_intel/test/valgrind.24997.memcheck.xml
[Valgrind] build/debug_intel/test/valgrind.25525.memcheck.xml
[Valgrind] build/debug_intel/test/valgrind.27411.memcheck.xml
[Valgrind] build/debug_intel/test/valgrind.28206.memcheck.xml
[Valgrind] build/debug_intel/test/valgrind.28625.memcheck.xml
[Valgrind] build/debug_intel/test/valgrind.28916.memcheck.xml
[Valgrind] build/debug_intel/test/valgrind.29034.memcheck.xml
[Valgrind] build/debug_intel/test/valgrind.29056.memcheck.xml
[Valgrind] build/debug_intel/test/valgrind.29304.memcheck.xml
[Valgrind] build/debug_intel/test/valgrind.29307.memcheck.xml
[Valgrind] build/debug_intel/test/valgrind.29363.memcheck.xml
[Valgrind] build/debug_intel/test/valgrind.2949.memcheck.xml
[Valgrind] build/debug_intel/test/valgrind.29515.memcheck.xml
[Valgrind] build/debug_intel/test/valgrind.29588.memcheck.xml
[Valgrind] build/debug_intel/test/valgrind.29612.memcheck.xml
[Valgrind] build/debug_intel/test/valgrind.29800.memcheck.xml
[Valgrind] build/debug_intel/test/valgrind.31290.memcheck.xml
[Valgrind] build/debug_intel/test/valgrind.32384.memcheck.xml
[Valgrind] build/debug_intel/test/valgrind.3269.memcheck.xml
[Valgrind] build/debug_intel/test/valgrind.33253.memcheck.xml
[Valgrind] build/debug_intel/test/valgrind.33509.memcheck.xml
[Valgrind] build/debug_intel/test/valgrind.33725.memcheck.xml
[Valgrind] build/debug_intel/test/valgrind.33767.memcheck.xml
[Valgrind] build/debug_intel/test/valgrind.33942.memcheck.xml
[Valgrind] build/debug_intel/test/valgrind.34215.memcheck.xml
[Valgrind] build/debug_intel/test/valgrind.3483.memcheck.xml
[Valgrind] build/debug_intel/test/valgrind.34978.memcheck.xml
[Valgrind] build/debug_intel/test/valgrind.35320.memcheck.xml
[Valgrind] build/debug_intel/test/valgrind.35615.memcheck.xml
[Valgrind] build/debug_intel/test/valgrind.35791.memcheck.xml
[Valgrind] build/debug_intel/test/valgrind.35934.memcheck.xml
[Valgrind] build/debug_intel/test/valgrind.3603.memcheck.xml
[Valgrind] build/debug_intel/test/valgrind.36136.memcheck.xml
[Valgrind] build/debug_intel/test/valgrind.36567.memcheck.xml
[Valgrind] build/debug_intel/test/valgrind.37481.memcheck.xml
[Valgrind] build/debug_intel/test/valgrind.38176.memcheck.xml
[Valgrind] build/debug_intel/test/valgrind.38677.memcheck.xml
[Valgrind] build/debug_intel/test/valgrind.38851.memcheck.xml
[Valgrind] build/debug_intel/test/valgrind.39666.memcheck.xml
[Valgrind] build/debug_intel/test/valgrind.40808.memcheck.xml
[Valgrind] build/debug_intel/test/valgrind.4094.memcheck.xml
[Valgrind] build/debug_intel/test/valgrind.454.memcheck.xml
[Valgrind] build/debug_intel/test/valgrind.4586.memcheck.xml
[Valgrind] build/debug_intel/test/valgrind.4788.memcheck.xml
[Valgrind] build/debug_intel/test/valgrind.486.memcheck.xml
[Valgrind] build/debug_intel/test/valgrind.5453.memcheck.xml
[Valgrind] build/debug_intel/test/valgrind.5478.memcheck.xml
[Valgrind] build/debug_intel/test/valgrind.5549.memcheck.xml
[Valgrind] build/debug_intel/test/valgrind.570.memcheck.xml
[Valgrind] build/debug_intel/test/valgrind.6295.memcheck.xml
[Valgrind] build/debug_intel/test/valgrind.6363.memcheck.xml
[Valgrind] build/debug_intel/test/valgrind.7461.memcheck.xml
[Valgrind] build/debug_intel/test/valgrind.7483.memcheck.xml
[Valgrind] build/debug_intel/test/valgrind.7506.memcheck.xml
[Valgrind] build/debug_intel/test/valgrind.8150.memcheck.xml
[Valgrind] build/debug_intel/test/valgrind.8221.memcheck.xml
[Valgrind] build/debug_intel/test/valgrind.8582.memcheck.xml
[Valgrind] build/debug_intel/test/valgrind.8616.memcheck.xml
[Valgrind] build/debug_intel/test/valgrind.8707.memcheck.xml
[Valgrind] build/debug_intel/test/valgrind.8744.memcheck.xml
[Valgrind] build/debug_intel/test/valgrind.8791.memcheck.xml
[Valgrind] build/debug_intel/test/valgrind.8842.memcheck.xml
[Valgrind] build/debug_intel/test/valgrind.9378.memcheck.xml
[Valgrind] build/debug_intel/test/valgrind.9448.memcheck.xml
[Valgrind] build/debug_intel/test/valgrind.9480.memcheck.xml
[Valgrind] Copying build/debug_intel/test/valgrind.10610.memcheck.xml to /var/lib/jenkins/jobs/SANS_Weekly/configurations/axis-builddir/debug_intel/axis-buildnode/reynolds/builds/258/valgrind-plugin/valgrind-results/build/debug_intel/test/valgrind.10610.memcheck.xml
[Valgrind] Copying build/debug_intel/test/valgrind.10645.memcheck.xml to /var/lib/jenkins/jobs/SANS_Weekly/configurations/axis-builddir/debug_intel/axis-buildnode/reynolds/builds/258/valgrind-plugin/valgrind-results/build/debug_intel/test/valgrind.10645.memcheck.xml
[Valgrind] Copying build/debug_intel/test/valgrind.10778.memcheck.xml to /var/lib/jenkins/jobs/SANS_Weekly/configurations/axis-builddir/debug_intel/axis-buildnode/reynolds/builds/258/valgrind-plugin/valgrind-results/build/debug_intel/test/valgrind.10778.memcheck.xml
[Valgrind] Copying build/debug_intel/test/valgrind.10843.memcheck.xml to /var/lib/jenkins/jobs/SANS_Weekly/configurations/axis-builddir/debug_intel/axis-buildnode/reynolds/builds/258/valgrind-plugin/valgrind-results/build/debug_intel/test/valgrind.10843.memcheck.xml
[Valgrind] Copying build/debug_intel/test/valgrind.10885.memcheck.xml to /var/lib/jenkins/jobs/SANS_Weekly/configurations/axis-builddir/debug_intel/axis-buildnode/reynolds/builds/258/valgrind-plugin/valgrind-results/build/debug_intel/test/valgrind.10885.memcheck.xml
[Valgrind] Copying build/debug_intel/test/valgrind.11416.memcheck.xml to /var/lib/jenkins/jobs/SANS_Weekly/configurations/axis-builddir/debug_intel/axis-buildnode/reynolds/builds/258/valgrind-plugin/valgrind-results/build/debug_intel/test/valgrind.11416.memcheck.xml
[Valgrind] Copying build/debug_intel/test/valgrind.11523.memcheck.xml to /var/lib/jenkins/jobs/SANS_Weekly/configurations/axis-builddir/debug_intel/axis-buildnode/reynolds/builds/258/valgrind-plugin/valgrind-results/build/debug_intel/test/valgrind.11523.memcheck.xml
[Valgrind] Copying build/debug_intel/test/valgrind.11534.memcheck.xml to /var/lib/jenkins/jobs/SANS_Weekly/configurations/axis-builddir/debug_intel/axis-buildnode/reynolds/builds/258/valgrind-plugin/valgrind-results/build/debug_intel/test/valgrind.11534.memcheck.xml
[Valgrind] Copying build/debug_intel/test/valgrind.11537.memcheck.xml to /var/lib/jenkins/jobs/SANS_Weekly/configurations/axis-builddir/debug_intel/axis-buildnode/reynolds/builds/258/valgrind-plugin/valgrind-results/build/debug_intel/test/valgrind.11537.memcheck.xml
[Valgrind] Copying build/debug_intel/test/valgrind.11674.memcheck.xml to /var/lib/jenkins/jobs/SANS_Weekly/configurations/axis-builddir/debug_intel/axis-buildnode/reynolds/builds/258/valgrind-plugin/valgrind-results/build/debug_intel/test/valgrind.11674.memcheck.xml
[Valgrind] Copying build/debug_intel/test/valgrind.12942.memcheck.xml to /var/lib/jenkins/jobs/SANS_Weekly/configurations/axis-builddir/debug_intel/axis-buildnode/reynolds/builds/258/valgrind-plugin/valgrind-results/build/debug_intel/test/valgrind.12942.memcheck.xml
[Valgrind] Copying build/debug_intel/test/valgrind.13394.memcheck.xml to /var/lib/jenkins/jobs/SANS_Weekly/configurations/axis-builddir/debug_intel/axis-buildnode/reynolds/builds/258/valgrind-plugin/valgrind-results/build/debug_intel/test/valgrind.13394.memcheck.xml
[Valgrind] Copying build/debug_intel/test/valgrind.13426.memcheck.xml to /var/lib/jenkins/jobs/SANS_Weekly/configurations/axis-builddir/debug_intel/axis-buildnode/reynolds/builds/258/valgrind-plugin/valgrind-results/build/debug_intel/test/valgrind.13426.memcheck.xml
[Valgrind] Copying build/debug_intel/test/valgrind.13512.memcheck.xml to /var/lib/jenkins/jobs/SANS_Weekly/configurations/axis-builddir/debug_intel/axis-buildnode/reynolds/builds/258/valgrind-plugin/valgrind-results/build/debug_intel/test/valgrind.13512.memcheck.xml
[Valgrind] Copying build/debug_intel/test/valgrind.14141.memcheck.xml to /var/lib/jenkins/jobs/SANS_Weekly/configurations/axis-builddir/debug_intel/axis-buildnode/reynolds/builds/258/valgrind-plugin/valgrind-results/build/debug_intel/test/valgrind.14141.memcheck.xml
[Valgrind] Copying build/debug_intel/test/valgrind.14439.memcheck.xml to /var/lib/jenkins/jobs/SANS_Weekly/configurations/axis-builddir/debug_intel/axis-buildnode/reynolds/builds/258/valgrind-plugin/valgrind-results/build/debug_intel/test/valgrind.14439.memcheck.xml
[Valgrind] Copying build/debug_intel/test/valgrind.15009.memcheck.xml to /var/lib/jenkins/jobs/SANS_Weekly/configurations/axis-builddir/debug_intel/axis-buildnode/reynolds/builds/258/valgrind-plugin/valgrind-results/build/debug_intel/test/valgrind.15009.memcheck.xml
[Valgrind] Copying build/debug_intel/test/valgrind.15016.memcheck.xml to /var/lib/jenkins/jobs/SANS_Weekly/configurations/axis-builddir/debug_intel/axis-buildnode/reynolds/builds/258/valgrind-plugin/valgrind-results/build/debug_intel/test/valgrind.15016.memcheck.xml
[Valgrind] Copying build/debug_intel/test/valgrind.1573.memcheck.xml to /var/lib/jenkins/jobs/SANS_Weekly/configurations/axis-builddir/debug_intel/axis-buildnode/reynolds/builds/258/valgrind-plugin/valgrind-results/build/debug_intel/test/valgrind.1573.memcheck.xml
[Valgrind] Copying build/debug_intel/test/valgrind.17014.memcheck.xml to /var/lib/jenkins/jobs/SANS_Weekly/configurations/axis-builddir/debug_intel/axis-buildnode/reynolds/builds/258/valgrind-plugin/valgrind-results/build/debug_intel/test/valgrind.17014.memcheck.xml
[Valgrind] Copying build/debug_intel/test/valgrind.18260.memcheck.xml to /var/lib/jenkins/jobs/SANS_Weekly/configurations/axis-builddir/debug_intel/axis-buildnode/reynolds/builds/258/valgrind-plugin/valgrind-results/build/debug_intel/test/valgrind.18260.memcheck.xml
[Valgrind] Copying build/debug_intel/test/valgrind.18424.memcheck.xml to /var/lib/jenkins/jobs/SANS_Weekly/configurations/axis-builddir/debug_intel/axis-buildnode/reynolds/builds/258/valgrind-plugin/valgrind-results/build/debug_intel/test/valgrind.18424.memcheck.xml
[Valgrind] Copying build/debug_intel/test/valgrind.18480.memcheck.xml to /var/lib/jenkins/jobs/SANS_Weekly/configurations/axis-builddir/debug_intel/axis-buildnode/reynolds/builds/258/valgrind-plugin/valgrind-results/build/debug_intel/test/valgrind.18480.memcheck.xml
[Valgrind] Copying build/debug_intel/test/valgrind.18888.memcheck.xml to /var/lib/jenkins/jobs/SANS_Weekly/configurations/axis-builddir/debug_intel/axis-buildnode/reynolds/builds/258/valgrind-plugin/valgrind-results/build/debug_intel/test/valgrind.18888.memcheck.xml
[Valgrind] Copying build/debug_intel/test/valgrind.18929.memcheck.xml to /var/lib/jenkins/jobs/SANS_Weekly/configurations/axis-builddir/debug_intel/axis-buildnode/reynolds/builds/258/valgrind-plugin/valgrind-results/build/debug_intel/test/valgrind.18929.memcheck.xml
[Valgrind] Copying build/debug_intel/test/valgrind.18983.memcheck.xml to /var/lib/jenkins/jobs/SANS_Weekly/configurations/axis-builddir/debug_intel/axis-buildnode/reynolds/builds/258/valgrind-plugin/valgrind-results/build/debug_intel/test/valgrind.18983.memcheck.xml
[Valgrind] Copying build/debug_intel/test/valgrind.19286.memcheck.xml to /var/lib/jenkins/jobs/SANS_Weekly/configurations/axis-builddir/debug_intel/axis-buildnode/reynolds/builds/258/valgrind-plugin/valgrind-results/build/debug_intel/test/valgrind.19286.memcheck.xml
[Valgrind] Copying build/debug_intel/test/valgrind.19367.memcheck.xml to /var/lib/jenkins/jobs/SANS_Weekly/configurations/axis-builddir/debug_intel/axis-buildnode/reynolds/builds/258/valgrind-plugin/valgrind-results/build/debug_intel/test/valgrind.19367.memcheck.xml
[Valgrind] Copying build/debug_intel/test/valgrind.19449.memcheck.xml to /var/lib/jenkins/jobs/SANS_Weekly/configurations/axis-builddir/debug_intel/axis-buildnode/reynolds/builds/258/valgrind-plugin/valgrind-results/build/debug_intel/test/valgrind.19449.memcheck.xml
[Valgrind] Copying build/debug_intel/test/valgrind.20372.memcheck.xml to /var/lib/jenkins/jobs/SANS_Weekly/configurations/axis-builddir/debug_intel/axis-buildnode/reynolds/builds/258/valgrind-plugin/valgrind-results/build/debug_intel/test/valgrind.20372.memcheck.xml
[Valgrind] Copying build/debug_intel/test/valgrind.20422.memcheck.xml to /var/lib/jenkins/jobs/SANS_Weekly/configurations/axis-builddir/debug_intel/axis-buildnode/reynolds/builds/258/valgrind-plugin/valgrind-results/build/debug_intel/test/valgrind.20422.memcheck.xml
[Valgrind] Copying build/debug_intel/test/valgrind.20770.memcheck.xml to /var/lib/jenkins/jobs/SANS_Weekly/configurations/axis-builddir/debug_intel/axis-buildnode/reynolds/builds/258/valgrind-plugin/valgrind-results/build/debug_intel/test/valgrind.20770.memcheck.xml
[Valgrind] Copying build/debug_intel/test/valgrind.20985.memcheck.xml to /var/lib/jenkins/jobs/SANS_Weekly/configurations/axis-builddir/debug_intel/axis-buildnode/reynolds/builds/258/valgrind-plugin/valgrind-results/build/debug_intel/test/valgrind.20985.memcheck.xml
[Valgrind] Copying build/debug_intel/test/valgrind.21089.memcheck.xml to /var/lib/jenkins/jobs/SANS_Weekly/configurations/axis-builddir/debug_intel/axis-buildnode/reynolds/builds/258/valgrind-plugin/valgrind-results/build/debug_intel/test/valgrind.21089.memcheck.xml
[Valgrind] Copying build/debug_intel/test/valgrind.21294.memcheck.xml to /var/lib/jenkins/jobs/SANS_Weekly/configurations/axis-builddir/debug_intel/axis-buildnode/reynolds/builds/258/valgrind-plugin/valgrind-results/build/debug_intel/test/valgrind.21294.memcheck.xml
[Valgrind] Copying build/debug_intel/test/valgrind.2168.memcheck.xml to /var/lib/jenkins/jobs/SANS_Weekly/configurations/axis-builddir/debug_intel/axis-buildnode/reynolds/builds/258/valgrind-plugin/valgrind-results/build/debug_intel/test/valgrind.2168.memcheck.xml
[Valgrind] Copying build/debug_intel/test/valgrind.22302.memcheck.xml to /var/lib/jenkins/jobs/SANS_Weekly/configurations/axis-builddir/debug_intel/axis-buildnode/reynolds/builds/258/valgrind-plugin/valgrind-results/build/debug_intel/test/valgrind.22302.memcheck.xml
[Valgrind] Copying build/debug_intel/test/valgrind.22334.memcheck.xml to /var/lib/jenkins/jobs/SANS_Weekly/configurations/axis-builddir/debug_intel/axis-buildnode/reynolds/builds/258/valgrind-plugin/valgrind-results/build/debug_intel/test/valgrind.22334.memcheck.xml
[Valgrind] Copying build/debug_intel/test/valgrind.22459.memcheck.xml to /var/lib/jenkins/jobs/SANS_Weekly/configurations/axis-builddir/debug_intel/axis-buildnode/reynolds/builds/258/valgrind-plugin/valgrind-results/build/debug_intel/test/valgrind.22459.memcheck.xml
[Valgrind] Copying build/debug_intel/test/valgrind.23261.memcheck.xml to /var/lib/jenkins/jobs/SANS_Weekly/configurations/axis-builddir/debug_intel/axis-buildnode/reynolds/builds/258/valgrind-plugin/valgrind-results/build/debug_intel/test/valgrind.23261.memcheck.xml
[Valgrind] Copying build/debug_intel/test/valgrind.23468.memcheck.xml to /var/lib/jenkins/jobs/SANS_Weekly/configurations/axis-builddir/debug_intel/axis-buildnode/reynolds/builds/258/valgrind-plugin/valgrind-results/build/debug_intel/test/valgrind.23468.memcheck.xml
[Valgrind] Copying build/debug_intel/test/valgrind.23685.memcheck.xml to /var/lib/jenkins/jobs/SANS_Weekly/configurations/axis-builddir/debug_intel/axis-buildnode/reynolds/builds/258/valgrind-plugin/valgrind-results/build/debug_intel/test/valgrind.23685.memcheck.xml
[Valgrind] Copying build/debug_intel/test/valgrind.24021.memcheck.xml to /var/lib/jenkins/jobs/SANS_Weekly/configurations/axis-builddir/debug_intel/axis-buildnode/reynolds/builds/258/valgrind-plugin/valgrind-results/build/debug_intel/test/valgrind.24021.memcheck.xml
[Valgrind] Copying build/debug_intel/test/valgrind.24160.memcheck.xml to /var/lib/jenkins/jobs/SANS_Weekly/configurations/axis-builddir/debug_intel/axis-buildnode/reynolds/builds/258/valgrind-plugin/valgrind-results/build/debug_intel/test/valgrind.24160.memcheck.xml
[Valgrind] Copying build/debug_intel/test/valgrind.24997.memcheck.xml to /var/lib/jenkins/jobs/SANS_Weekly/configurations/axis-builddir/debug_intel/axis-buildnode/reynolds/builds/258/valgrind-plugin/valgrind-results/build/debug_intel/test/valgrind.24997.memcheck.xml
[Valgrind] Copying build/debug_intel/test/valgrind.25525.memcheck.xml to /var/lib/jenkins/jobs/SANS_Weekly/configurations/axis-builddir/debug_intel/axis-buildnode/reynolds/builds/258/valgrind-plugin/valgrind-results/build/debug_intel/test/valgrind.25525.memcheck.xml
[Valgrind] Copying build/debug_intel/test/valgrind.27411.memcheck.xml to /var/lib/jenkins/jobs/SANS_Weekly/configurations/axis-builddir/debug_intel/axis-buildnode/reynolds/builds/258/valgrind-plugin/valgrind-results/build/debug_intel/test/valgrind.27411.memcheck.xml
[Valgrind] Copying build/debug_intel/test/valgrind.28206.memcheck.xml to /var/lib/jenkins/jobs/SANS_Weekly/configurations/axis-builddir/debug_intel/axis-buildnode/reynolds/builds/258/valgrind-plugin/valgrind-results/build/debug_intel/test/valgrind.28206.memcheck.xml
[Valgrind] Copying build/debug_intel/test/valgrind.28625.memcheck.xml to /var/lib/jenkins/jobs/SANS_Weekly/configurations/axis-builddir/debug_intel/axis-buildnode/reynolds/builds/258/valgrind-plugin/valgrind-results/build/debug_intel/test/valgrind.28625.memcheck.xml
[Valgrind] Copying build/debug_intel/test/valgrind.28916.memcheck.xml to /var/lib/jenkins/jobs/SANS_Weekly/configurations/axis-builddir/debug_intel/axis-buildnode/reynolds/builds/258/valgrind-plugin/valgrind-results/build/debug_intel/test/valgrind.28916.memcheck.xml
[Valgrind] Copying build/debug_intel/test/valgrind.29034.memcheck.xml to /var/lib/jenkins/jobs/SANS_Weekly/configurations/axis-builddir/debug_intel/axis-buildnode/reynolds/builds/258/valgrind-plugin/valgrind-results/build/debug_intel/test/valgrind.29034.memcheck.xml
[Valgrind] Copying build/debug_intel/test/valgrind.29056.memcheck.xml to /var/lib/jenkins/jobs/SANS_Weekly/configurations/axis-builddir/debug_intel/axis-buildnode/reynolds/builds/258/valgrind-plugin/valgrind-results/build/debug_intel/test/valgrind.29056.memcheck.xml
[Valgrind] Copying build/debug_intel/test/valgrind.29304.memcheck.xml to /var/lib/jenkins/jobs/SANS_Weekly/configurations/axis-builddir/debug_intel/axis-buildnode/reynolds/builds/258/valgrind-plugin/valgrind-results/build/debug_intel/test/valgrind.29304.memcheck.xml
[Valgrind] Copying build/debug_intel/test/valgrind.29307.memcheck.xml to /var/lib/jenkins/jobs/SANS_Weekly/configurations/axis-builddir/debug_intel/axis-buildnode/reynolds/builds/258/valgrind-plugin/valgrind-results/build/debug_intel/test/valgrind.29307.memcheck.xml
[Valgrind] Copying build/debug_intel/test/valgrind.29363.memcheck.xml to /var/lib/jenkins/jobs/SANS_Weekly/configurations/axis-builddir/debug_intel/axis-buildnode/reynolds/builds/258/valgrind-plugin/valgrind-results/build/debug_intel/test/valgrind.29363.memcheck.xml
[Valgrind] Copying build/debug_intel/test/valgrind.2949.memcheck.xml to /var/lib/jenkins/jobs/SANS_Weekly/configurations/axis-builddir/debug_intel/axis-buildnode/reynolds/builds/258/valgrind-plugin/valgrind-results/build/debug_intel/test/valgrind.2949.memcheck.xml
[Valgrind] Copying build/debug_intel/test/valgrind.29515.memcheck.xml to /var/lib/jenkins/jobs/SANS_Weekly/configurations/axis-builddir/debug_intel/axis-buildnode/reynolds/builds/258/valgrind-plugin/valgrind-results/build/debug_intel/test/valgrind.29515.memcheck.xml
[Valgrind] Copying build/debug_intel/test/valgrind.29588.memcheck.xml to /var/lib/jenkins/jobs/SANS_Weekly/configurations/axis-builddir/debug_intel/axis-buildnode/reynolds/builds/258/valgrind-plugin/valgrind-results/build/debug_intel/test/valgrind.29588.memcheck.xml
[Valgrind] Copying build/debug_intel/test/valgrind.29612.memcheck.xml to /var/lib/jenkins/jobs/SANS_Weekly/configurations/axis-builddir/debug_intel/axis-buildnode/reynolds/builds/258/valgrind-plugin/valgrind-results/build/debug_intel/test/valgrind.29612.memcheck.xml
[Valgrind] Copying build/debug_intel/test/valgrind.29800.memcheck.xml to /var/lib/jenkins/jobs/SANS_Weekly/configurations/axis-builddir/debug_intel/axis-buildnode/reynolds/builds/258/valgrind-plugin/valgrind-results/build/debug_intel/test/valgrind.29800.memcheck.xml
[Valgrind] Copying build/debug_intel/test/valgrind.31290.memcheck.xml to /var/lib/jenkins/jobs/SANS_Weekly/configurations/axis-builddir/debug_intel/axis-buildnode/reynolds/builds/258/valgrind-plugin/valgrind-results/build/debug_intel/test/valgrind.31290.memcheck.xml
[Valgrind] Copying build/debug_intel/test/valgrind.32384.memcheck.xml to /var/lib/jenkins/jobs/SANS_Weekly/configurations/axis-builddir/debug_intel/axis-buildnode/reynolds/builds/258/valgrind-plugin/valgrind-results/build/debug_intel/test/valgrind.32384.memcheck.xml
[Valgrind] Copying build/debug_intel/test/valgrind.3269.memcheck.xml to /var/lib/jenkins/jobs/SANS_Weekly/configurations/axis-builddir/debug_intel/axis-buildnode/reynolds/builds/258/valgrind-plugin/valgrind-results/build/debug_intel/test/valgrind.3269.memcheck.xml
[Valgrind] Copying build/debug_intel/test/valgrind.33253.memcheck.xml to /var/lib/jenkins/jobs/SANS_Weekly/configurations/axis-builddir/debug_intel/axis-buildnode/reynolds/builds/258/valgrind-plugin/valgrind-results/build/debug_intel/test/valgrind.33253.memcheck.xml
[Valgrind] Copying build/debug_intel/test/valgrind.33509.memcheck.xml to /var/lib/jenkins/jobs/SANS_Weekly/configurations/axis-builddir/debug_intel/axis-buildnode/reynolds/builds/258/valgrind-plugin/valgrind-results/build/debug_intel/test/valgrind.33509.memcheck.xml
[Valgrind] Copying build/debug_intel/test/valgrind.33725.memcheck.xml to /var/lib/jenkins/jobs/SANS_Weekly/configurations/axis-builddir/debug_intel/axis-buildnode/reynolds/builds/258/valgrind-plugin/valgrind-results/build/debug_intel/test/valgrind.33725.memcheck.xml
[Valgrind] Copying build/debug_intel/test/valgrind.33767.memcheck.xml to /var/lib/jenkins/jobs/SANS_Weekly/configurations/axis-builddir/debug_intel/axis-buildnode/reynolds/builds/258/valgrind-plugin/valgrind-results/build/debug_intel/test/valgrind.33767.memcheck.xml
[Valgrind] Copying build/debug_intel/test/valgrind.33942.memcheck.xml to /var/lib/jenkins/jobs/SANS_Weekly/configurations/axis-builddir/debug_intel/axis-buildnode/reynolds/builds/258/valgrind-plugin/valgrind-results/build/debug_intel/test/valgrind.33942.memcheck.xml
[Valgrind] Copying build/debug_intel/test/valgrind.34215.memcheck.xml to /var/lib/jenkins/jobs/SANS_Weekly/configurations/axis-builddir/debug_intel/axis-buildnode/reynolds/builds/258/valgrind-plugin/valgrind-results/build/debug_intel/test/valgrind.34215.memcheck.xml
[Valgrind] Copying build/debug_intel/test/valgrind.3483.memcheck.xml to /var/lib/jenkins/jobs/SANS_Weekly/configurations/axis-builddir/debug_intel/axis-buildnode/reynolds/builds/258/valgrind-plugin/valgrind-results/build/debug_intel/test/valgrind.3483.memcheck.xml
[Valgrind] Copying build/debug_intel/test/valgrind.34978.memcheck.xml to /var/lib/jenkins/jobs/SANS_Weekly/configurations/axis-builddir/debug_intel/axis-buildnode/reynolds/builds/258/valgrind-plugin/valgrind-results/build/debug_intel/test/valgrind.34978.memcheck.xml
[Valgrind] Copying build/debug_intel/test/valgrind.35320.memcheck.xml to /var/lib/jenkins/jobs/SANS_Weekly/configurations/axis-builddir/debug_intel/axis-buildnode/reynolds/builds/258/valgrind-plugin/valgrind-results/build/debug_intel/test/valgrind.35320.memcheck.xml
[Valgrind] Copying build/debug_intel/test/valgrind.35615.memcheck.xml to /var/lib/jenkins/jobs/SANS_Weekly/configurations/axis-builddir/debug_intel/axis-buildnode/reynolds/builds/258/valgrind-plugin/valgrind-results/build/debug_intel/test/valgrind.35615.memcheck.xml
[Valgrind] Copying build/debug_intel/test/valgrind.35791.memcheck.xml to /var/lib/jenkins/jobs/SANS_Weekly/configurations/axis-builddir/debug_intel/axis-buildnode/reynolds/builds/258/valgrind-plugin/valgrind-results/build/debug_intel/test/valgrind.35791.memcheck.xml
[Valgrind] Copying build/debug_intel/test/valgrind.35934.memcheck.xml to /var/lib/jenkins/jobs/SANS_Weekly/configurations/axis-builddir/debug_intel/axis-buildnode/reynolds/builds/258/valgrind-plugin/valgrind-results/build/debug_intel/test/valgrind.35934.memcheck.xml
[Valgrind] Copying build/debug_intel/test/valgrind.3603.memcheck.xml to /var/lib/jenkins/jobs/SANS_Weekly/configurations/axis-builddir/debug_intel/axis-buildnode/reynolds/builds/258/valgrind-plugin/valgrind-results/build/debug_intel/test/valgrind.3603.memcheck.xml
[Valgrind] Copying build/debug_intel/test/valgrind.36136.memcheck.xml to /var/lib/jenkins/jobs/SANS_Weekly/configurations/axis-builddir/debug_intel/axis-buildnode/reynolds/builds/258/valgrind-plugin/valgrind-results/build/debug_intel/test/valgrind.36136.memcheck.xml
[Valgrind] Copying build/debug_intel/test/valgrind.36567.memcheck.xml to /var/lib/jenkins/jobs/SANS_Weekly/configurations/axis-builddir/debug_intel/axis-buildnode/reynolds/builds/258/valgrind-plugin/valgrind-results/build/debug_intel/test/valgrind.36567.memcheck.xml
[Valgrind] Copying build/debug_intel/test/valgrind.37481.memcheck.xml to /var/lib/jenkins/jobs/SANS_Weekly/configurations/axis-builddir/debug_intel/axis-buildnode/reynolds/builds/258/valgrind-plugin/valgrind-results/build/debug_intel/test/valgrind.37481.memcheck.xml
[Valgrind] Copying build/debug_intel/test/valgrind.38176.memcheck.xml to /var/lib/jenkins/jobs/SANS_Weekly/configurations/axis-builddir/debug_intel/axis-buildnode/reynolds/builds/258/valgrind-plugin/valgrind-results/build/debug_intel/test/valgrind.38176.memcheck.xml
[Valgrind] Copying build/debug_intel/test/valgrind.38677.memcheck.xml to /var/lib/jenkins/jobs/SANS_Weekly/configurations/axis-builddir/debug_intel/axis-buildnode/reynolds/builds/258/valgrind-plugin/valgrind-results/build/debug_intel/test/valgrind.38677.memcheck.xml
[Valgrind] Copying build/debug_intel/test/valgrind.38851.memcheck.xml to /var/lib/jenkins/jobs/SANS_Weekly/configurations/axis-builddir/debug_intel/axis-buildnode/reynolds/builds/258/valgrind-plugin/valgrind-results/build/debug_intel/test/valgrind.38851.memcheck.xml
[Valgrind] Copying build/debug_intel/test/valgrind.39666.memcheck.xml to /var/lib/jenkins/jobs/SANS_Weekly/configurations/axis-builddir/debug_intel/axis-buildnode/reynolds/builds/258/valgrind-plugin/valgrind-results/build/debug_intel/test/valgrind.39666.memcheck.xml
[Valgrind] Copying build/debug_intel/test/valgrind.40808.memcheck.xml to /var/lib/jenkins/jobs/SANS_Weekly/configurations/axis-builddir/debug_intel/axis-buildnode/reynolds/builds/258/valgrind-plugin/valgrind-results/build/debug_intel/test/valgrind.40808.memcheck.xml
[Valgrind] Copying build/debug_intel/test/valgrind.4094.memcheck.xml to /var/lib/jenkins/jobs/SANS_Weekly/configurations/axis-builddir/debug_intel/axis-buildnode/reynolds/builds/258/valgrind-plugin/valgrind-results/build/debug_intel/test/valgrind.4094.memcheck.xml
[Valgrind] Copying build/debug_intel/test/valgrind.454.memcheck.xml to /var/lib/jenkins/jobs/SANS_Weekly/configurations/axis-builddir/debug_intel/axis-buildnode/reynolds/builds/258/valgrind-plugin/valgrind-results/build/debug_intel/test/valgrind.454.memcheck.xml
[Valgrind] Copying build/debug_intel/test/valgrind.4586.memcheck.xml to /var/lib/jenkins/jobs/SANS_Weekly/configurations/axis-builddir/debug_intel/axis-buildnode/reynolds/builds/258/valgrind-plugin/valgrind-results/build/debug_intel/test/valgrind.4586.memcheck.xml
[Valgrind] Copying build/debug_intel/test/valgrind.4788.memcheck.xml to /var/lib/jenkins/jobs/SANS_Weekly/configurations/axis-builddir/debug_intel/axis-buildnode/reynolds/builds/258/valgrind-plugin/valgrind-results/build/debug_intel/test/valgrind.4788.memcheck.xml
[Valgrind] Copying build/debug_intel/test/valgrind.486.memcheck.xml to /var/lib/jenkins/jobs/SANS_Weekly/configurations/axis-builddir/debug_intel/axis-buildnode/reynolds/builds/258/valgrind-plugin/valgrind-results/build/debug_intel/test/valgrind.486.memcheck.xml
[Valgrind] Copying build/debug_intel/test/valgrind.5453.memcheck.xml to /var/lib/jenkins/jobs/SANS_Weekly/configurations/axis-builddir/debug_intel/axis-buildnode/reynolds/builds/258/valgrind-plugin/valgrind-results/build/debug_intel/test/valgrind.5453.memcheck.xml
[Valgrind] Copying build/debug_intel/test/valgrind.5478.memcheck.xml to /var/lib/jenkins/jobs/SANS_Weekly/configurations/axis-builddir/debug_intel/axis-buildnode/reynolds/builds/258/valgrind-plugin/valgrind-results/build/debug_intel/test/valgrind.5478.memcheck.xml
[Valgrind] Copying build/debug_intel/test/valgrind.5549.memcheck.xml to /var/lib/jenkins/jobs/SANS_Weekly/configurations/axis-builddir/debug_intel/axis-buildnode/reynolds/builds/258/valgrind-plugin/valgrind-results/build/debug_intel/test/valgrind.5549.memcheck.xml
[Valgrind] Copying build/debug_intel/test/valgrind.570.memcheck.xml to /var/lib/jenkins/jobs/SANS_Weekly/configurations/axis-builddir/debug_intel/axis-buildnode/reynolds/builds/258/valgrind-plugin/valgrind-results/build/debug_intel/test/valgrind.570.memcheck.xml
[Valgrind] Copying build/debug_intel/test/valgrind.6295.memcheck.xml to /var/lib/jenkins/jobs/SANS_Weekly/configurations/axis-builddir/debug_intel/axis-buildnode/reynolds/builds/258/valgrind-plugin/valgrind-results/build/debug_intel/test/valgrind.6295.memcheck.xml
[Valgrind] Copying build/debug_intel/test/valgrind.6363.memcheck.xml to /var/lib/jenkins/jobs/SANS_Weekly/configurations/axis-builddir/debug_intel/axis-buildnode/reynolds/builds/258/valgrind-plugin/valgrind-results/build/debug_intel/test/valgrind.6363.memcheck.xml
[Valgrind] Copying build/debug_intel/test/valgrind.7461.memcheck.xml to /var/lib/jenkins/jobs/SANS_Weekly/configurations/axis-builddir/debug_intel/axis-buildnode/reynolds/builds/258/valgrind-plugin/valgrind-results/build/debug_intel/test/valgrind.7461.memcheck.xml
[Valgrind] Copying build/debug_intel/test/valgrind.7483.memcheck.xml to /var/lib/jenkins/jobs/SANS_Weekly/configurations/axis-builddir/debug_intel/axis-buildnode/reynolds/builds/258/valgrind-plugin/valgrind-results/build/debug_intel/test/valgrind.7483.memcheck.xml
[Valgrind] Copying build/debug_intel/test/valgrind.7506.memcheck.xml to /var/lib/jenkins/jobs/SANS_Weekly/configurations/axis-builddir/debug_intel/axis-buildnode/reynolds/builds/258/valgrind-plugin/valgrind-results/build/debug_intel/test/valgrind.7506.memcheck.xml
[Valgrind] Copying build/debug_intel/test/valgrind.8150.memcheck.xml to /var/lib/jenkins/jobs/SANS_Weekly/configurations/axis-builddir/debug_intel/axis-buildnode/reynolds/builds/258/valgrind-plugin/valgrind-results/build/debug_intel/test/valgrind.8150.memcheck.xml
[Valgrind] Copying build/debug_intel/test/valgrind.8221.memcheck.xml to /var/lib/jenkins/jobs/SANS_Weekly/configurations/axis-builddir/debug_intel/axis-buildnode/reynolds/builds/258/valgrind-plugin/valgrind-results/build/debug_intel/test/valgrind.8221.memcheck.xml
[Valgrind] Copying build/debug_intel/test/valgrind.8582.memcheck.xml to /var/lib/jenkins/jobs/SANS_Weekly/configurations/axis-builddir/debug_intel/axis-buildnode/reynolds/builds/258/valgrind-plugin/valgrind-results/build/debug_intel/test/valgrind.8582.memcheck.xml
[Valgrind] Copying build/debug_intel/test/valgrind.8616.memcheck.xml to /var/lib/jenkins/jobs/SANS_Weekly/configurations/axis-builddir/debug_intel/axis-buildnode/reynolds/builds/258/valgrind-plugin/valgrind-results/build/debug_intel/test/valgrind.8616.memcheck.xml
[Valgrind] Copying build/debug_intel/test/valgrind.8707.memcheck.xml to /var/lib/jenkins/jobs/SANS_Weekly/configurations/axis-builddir/debug_intel/axis-buildnode/reynolds/builds/258/valgrind-plugin/valgrind-results/build/debug_intel/test/valgrind.8707.memcheck.xml
[Valgrind] Copying build/debug_intel/test/valgrind.8744.memcheck.xml to /var/lib/jenkins/jobs/SANS_Weekly/configurations/axis-builddir/debug_intel/axis-buildnode/reynolds/builds/258/valgrind-plugin/valgrind-results/build/debug_intel/test/valgrind.8744.memcheck.xml
[Valgrind] Copying build/debug_intel/test/valgrind.8791.memcheck.xml to /var/lib/jenkins/jobs/SANS_Weekly/configurations/axis-builddir/debug_intel/axis-buildnode/reynolds/builds/258/valgrind-plugin/valgrind-results/build/debug_intel/test/valgrind.8791.memcheck.xml
[Valgrind] Copying build/debug_intel/test/valgrind.8842.memcheck.xml to /var/lib/jenkins/jobs/SANS_Weekly/configurations/axis-builddir/debug_intel/axis-buildnode/reynolds/builds/258/valgrind-plugin/valgrind-results/build/debug_intel/test/valgrind.8842.memcheck.xml
[Valgrind] Copying build/debug_intel/test/valgrind.9378.memcheck.xml to /var/lib/jenkins/jobs/SANS_Weekly/configurations/axis-builddir/debug_intel/axis-buildnode/reynolds/builds/258/valgrind-plugin/valgrind-results/build/debug_intel/test/valgrind.9378.memcheck.xml
[Valgrind] Copying build/debug_intel/test/valgrind.9448.memcheck.xml to /var/lib/jenkins/jobs/SANS_Weekly/configurations/axis-builddir/debug_intel/axis-buildnode/reynolds/builds/258/valgrind-plugin/valgrind-results/build/debug_intel/test/valgrind.9448.memcheck.xml
[Valgrind] Copying build/debug_intel/test/valgrind.9480.memcheck.xml to /var/lib/jenkins/jobs/SANS_Weekly/configurations/axis-builddir/debug_intel/axis-buildnode/reynolds/builds/258/valgrind-plugin/valgrind-results/build/debug_intel/test/valgrind.9480.memcheck.xml
[Valgrind] Analysing valgrind results
[Valgrind] workspacePath: /jenkins/workspace/SANS_Weekly/builddir/debug_intel/buildnode/reynolds/
[Valgrind] Ending the valgrind analysis.
INFO: Starting to record.
INFO: Processing CTest-Version 3.x (default)
INFO: [CTest-Version 3.x (default)] - 1 test report file(s) were found with the pattern 'build/Test*.xml' relative to '/jenkins/workspace/SANS_Weekly/builddir/debug_intel/buildnode/reynolds' for the testing framework 'CTest-Version 3.x (default)'.
INFO: Check 'Failed Tests' threshold.
INFO: The total number of tests for the threshold 'Failed Tests' exceeds the specified "failure threshold" value.
INFO: Setting the build status to FAILURE
INFO: Stopping recording.
[PostBuildScript] - [INFO] Executing post build scripts.
[PostBuildScript] - [INFO] Build does not have any of the results []. Did not execute build step #0.
[WS-CLEANUP] Deleting project workspace...
[WS-CLEANUP] Deferred wipeout is used...
[WS-CLEANUP] done
Finished: FAILURE