Console Output

Skipping 338 KB.. Full Log
[ 89%] Checking style of test/system/Asymptotic/ErrorOrder_2D_CGStabilized_RANS_MMS_btest.cpp
[ 89%] Built target ErrorOrder_2D_CGStabilized_RANS_MMS_btest_build_vera
Scanning dependencies of target ErrorOrder_2D_CGStabilized_RANS_MMS_btest_build
[ 89%] Linking CXX executable ErrorOrder_2D_CGStabilized_RANS_MMS_btest
[ 89%] Built target ErrorOrder_2D_CGStabilized_RANS_MMS_btest_build
Scanning dependencies of target ErrorOrder_2D_DGAdvective_Annulus_Quad_btest_OBJECT
[ 89%] Building CXX object test/system/Asymptotic/CMakeFiles/ErrorOrder_2D_DGAdvective_Annulus_Quad_btest_OBJECT.dir/ErrorOrder_2D_DGAdvective_Annulus_Quad_btest.cpp.o
[ 89%] Built target ErrorOrder_2D_DGAdvective_Annulus_Quad_btest_OBJECT
Scanning dependencies of target ErrorOrder_2D_DGAdvective_Annulus_Quad_btest_build_vera
[ 89%] Checking style of test/system/Asymptotic/ErrorOrder_2D_DGAdvective_Annulus_Quad_btest.cpp
[ 89%] Built target ErrorOrder_2D_DGAdvective_Annulus_Quad_btest_build_vera
Scanning dependencies of target ErrorOrder_2D_DGAdvective_Annulus_Quad_btest_build
[ 89%] Linking CXX executable ErrorOrder_2D_DGAdvective_Annulus_Quad_btest
[ 89%] Built target ErrorOrder_2D_DGAdvective_Annulus_Quad_btest_build
Scanning dependencies of target ErrorOrder_1D_DGBR2_AD_HB_btest_build_vera
[ 89%] Checking style of test/system/Asymptotic/ErrorOrder_1D_DGBR2_AD_HB_btest.cpp
[ 89%] Built target ErrorOrder_1D_DGBR2_AD_HB_btest_build_vera
Scanning dependencies of target ErrorOrder_1D_DGBR2_AD_HB_btest_OBJECT
[ 89%] Building CXX object test/system/Asymptotic/CMakeFiles/ErrorOrder_1D_DGBR2_AD_HB_btest_OBJECT.dir/ErrorOrder_1D_DGBR2_AD_HB_btest.cpp.o
[ 89%] Built target ErrorOrder_1D_DGBR2_AD_HB_btest_OBJECT
Scanning dependencies of target ErrorOrder_1D_DGBR2_AD_HB_btest_build
[ 89%] Linking CXX executable ErrorOrder_1D_DGBR2_AD_HB_btest
[ 89%] Built target ErrorOrder_1D_DGBR2_AD_HB_btest_build
Scanning dependencies of target ErrorOrder_3D_DGBR2_Periodic_Hex_AD_btest_build_vera
[ 89%] Checking style of test/system/Asymptotic/ErrorOrder_3D_DGBR2_Periodic_Hex_AD_btest.cpp
[ 89%] Built target ErrorOrder_3D_DGBR2_Periodic_Hex_AD_btest_build_vera
Scanning dependencies of target ErrorOrder_3D_DGBR2_Periodic_Hex_AD_btest_OBJECT
[ 89%] Building CXX object test/system/Asymptotic/CMakeFiles/ErrorOrder_3D_DGBR2_Periodic_Hex_AD_btest_OBJECT.dir/ErrorOrder_3D_DGBR2_Periodic_Hex_AD_btest.cpp.o
[ 89%] Built target ErrorOrder_3D_DGBR2_Periodic_Hex_AD_btest_OBJECT
Scanning dependencies of target ErrorOrder_3D_DGBR2_Periodic_Hex_AD_btest_build
[ 89%] Linking CXX executable ErrorOrder_3D_DGBR2_Periodic_Hex_AD_btest
[ 89%] Built target ErrorOrder_3D_DGBR2_Periodic_Hex_AD_btest_build
Scanning dependencies of target Adjoint2D_DGBR2_Triangle_AD_btest_build_vera
[ 89%] Checking style of test/system/Asymptotic/Adjoint2D_DGBR2_Triangle_AD_btest.cpp
[ 89%] Built target Adjoint2D_DGBR2_Triangle_AD_btest_build_vera
Scanning dependencies of target Adjoint2D_DGBR2_Triangle_AD_btest_OBJECT
[ 89%] Building CXX object test/system/Asymptotic/CMakeFiles/Adjoint2D_DGBR2_Triangle_AD_btest_OBJECT.dir/Adjoint2D_DGBR2_Triangle_AD_btest.cpp.o
[ 89%] Built target Adjoint2D_DGBR2_Triangle_AD_btest_OBJECT
Scanning dependencies of target Adjoint2D_DGBR2_Triangle_AD_btest_build
[ 89%] Linking CXX executable Adjoint2D_DGBR2_Triangle_AD_btest
[ 89%] Built target Adjoint2D_DGBR2_Triangle_AD_btest_build
Scanning dependencies of target ErrorEstimateOrder_3D_CG_Tet_AD_btest_build_vera
[ 89%] Checking style of test/system/Asymptotic/ErrorEstimateOrder_3D_CG_Tet_AD_btest.cpp
[ 89%] Built target ErrorEstimateOrder_3D_CG_Tet_AD_btest_build_vera
Scanning dependencies of target ErrorEstimateOrder_3D_CG_Tet_AD_btest_OBJECT
[ 89%] Building CXX object test/system/Asymptotic/CMakeFiles/ErrorEstimateOrder_3D_CG_Tet_AD_btest_OBJECT.dir/ErrorEstimateOrder_3D_CG_Tet_AD_btest.cpp.o
[ 89%] Built target ErrorEstimateOrder_3D_CG_Tet_AD_btest_OBJECT
Scanning dependencies of target ErrorEstimateOrder_3D_CG_Tet_AD_btest_build
[ 89%] Linking CXX executable ErrorEstimateOrder_3D_CG_Tet_AD_btest
[ 89%] Built target ErrorEstimateOrder_3D_CG_Tet_AD_btest_build
Scanning dependencies of target ErrorOrder_1D_CG_AD_btest_build_vera
[ 89%] Checking style of test/system/Asymptotic/ErrorOrder_1D_CG_AD_btest.cpp
[ 89%] Built target ErrorOrder_1D_CG_AD_btest_build_vera
Scanning dependencies of target ErrorOrder_1D_CG_AD_btest_OBJECT
[ 91%] Building CXX object test/system/Asymptotic/CMakeFiles/ErrorOrder_1D_CG_AD_btest_OBJECT.dir/ErrorOrder_1D_CG_AD_btest.cpp.o
[ 91%] Built target ErrorOrder_1D_CG_AD_btest_OBJECT
Scanning dependencies of target ErrorOrder_1D_CG_AD_btest_build
[ 91%] Linking CXX executable ErrorOrder_1D_CG_AD_btest
[ 91%] Built target ErrorOrder_1D_CG_AD_btest_build
Scanning dependencies of target Adjoint2D_CG_Triangle_AD_btest_build_vera
[ 91%] Checking style of test/system/Asymptotic/Adjoint2D_CG_Triangle_AD_btest.cpp
[ 91%] Built target Adjoint2D_CG_Triangle_AD_btest_build_vera
Scanning dependencies of target Adjoint2D_CG_Triangle_AD_btest_OBJECT
[ 91%] Building CXX object test/system/Asymptotic/CMakeFiles/Adjoint2D_CG_Triangle_AD_btest_OBJECT.dir/Adjoint2D_CG_Triangle_AD_btest.cpp.o
[ 91%] Built target Adjoint2D_CG_Triangle_AD_btest_OBJECT
Scanning dependencies of target Adjoint2D_CG_Triangle_AD_btest_build
[ 91%] Linking CXX executable Adjoint2D_CG_Triangle_AD_btest
[ 91%] Built target Adjoint2D_CG_Triangle_AD_btest_build
Scanning dependencies of target ErrorOrder_2D_DGBR2_Triangle_AD_btest_OBJECT
[ 91%] Building CXX object test/system/Asymptotic/CMakeFiles/ErrorOrder_2D_DGBR2_Triangle_AD_btest_OBJECT.dir/ErrorOrder_2D_DGBR2_Triangle_AD_btest.cpp.o
[ 91%] Built target ErrorOrder_2D_DGBR2_Triangle_AD_btest_OBJECT
Scanning dependencies of target ErrorOrder_2D_DGBR2_Triangle_AD_btest_build_vera
[ 91%] Checking style of test/system/Asymptotic/ErrorOrder_2D_DGBR2_Triangle_AD_btest.cpp
[ 91%] Built target ErrorOrder_2D_DGBR2_Triangle_AD_btest_build_vera
Scanning dependencies of target ErrorOrder_2D_DGBR2_Triangle_AD_btest_build
[ 91%] Linking CXX executable ErrorOrder_2D_DGBR2_Triangle_AD_btest
[ 91%] Built target ErrorOrder_2D_DGBR2_Triangle_AD_btest_build
Scanning dependencies of target ErrorOrder_2D_DGBR2_RANS_MMS_btest_OBJECT
[ 91%] Building CXX object test/system/Asymptotic/CMakeFiles/ErrorOrder_2D_DGBR2_RANS_MMS_btest_OBJECT.dir/ErrorOrder_2D_DGBR2_RANS_MMS_btest.cpp.o
[ 91%] Built target ErrorOrder_2D_DGBR2_RANS_MMS_btest_OBJECT
Scanning dependencies of target ErrorOrder_2D_DGBR2_RANS_MMS_btest_build_vera
[ 91%] Checking style of test/system/Asymptotic/ErrorOrder_2D_DGBR2_RANS_MMS_btest.cpp
[ 91%] Built target ErrorOrder_2D_DGBR2_RANS_MMS_btest_build_vera
Scanning dependencies of target ErrorOrder_2D_DGBR2_RANS_MMS_btest_build
[ 91%] Linking CXX executable ErrorOrder_2D_DGBR2_RANS_MMS_btest
[ 91%] Built target ErrorOrder_2D_DGBR2_RANS_MMS_btest_build
Scanning dependencies of target Adjoint2D_HDG_Triangle_AD_sansLG_btest_build_vera
[ 91%] Checking style of test/system/Asymptotic/Adjoint2D_HDG_Triangle_AD_sansLG_btest.cpp
[ 91%] Built target Adjoint2D_HDG_Triangle_AD_sansLG_btest_build_vera
Scanning dependencies of target Adjoint2D_HDG_Triangle_AD_sansLG_btest_OBJECT
[ 91%] Building CXX object test/system/Asymptotic/CMakeFiles/Adjoint2D_HDG_Triangle_AD_sansLG_btest_OBJECT.dir/Adjoint2D_HDG_Triangle_AD_sansLG_btest.cpp.o
[ 91%] Built target Adjoint2D_HDG_Triangle_AD_sansLG_btest_OBJECT
Scanning dependencies of target Adjoint2D_HDG_Triangle_AD_sansLG_btest_build
[ 91%] Linking CXX executable Adjoint2D_HDG_Triangle_AD_sansLG_btest
[ 91%] Built target Adjoint2D_HDG_Triangle_AD_sansLG_btest_build
Scanning dependencies of target ErrorEstimateOrder_2D_DGAdvective_Triangle_AD_btest_OBJECT
[ 91%] Building CXX object test/system/Asymptotic/CMakeFiles/ErrorEstimateOrder_2D_DGAdvective_Triangle_AD_btest_OBJECT.dir/ErrorEstimateOrder_2D_DGAdvective_Triangle_AD_btest.cpp.o
[ 91%] Built target ErrorEstimateOrder_2D_DGAdvective_Triangle_AD_btest_OBJECT
Scanning dependencies of target ErrorEstimateOrder_2D_DGAdvective_Triangle_AD_btest_build_vera
[ 91%] Checking style of test/system/Asymptotic/ErrorEstimateOrder_2D_DGAdvective_Triangle_AD_btest.cpp
[ 91%] Built target ErrorEstimateOrder_2D_DGAdvective_Triangle_AD_btest_build_vera
Scanning dependencies of target ErrorEstimateOrder_2D_DGAdvective_Triangle_AD_btest_build
[ 91%] Linking CXX executable ErrorEstimateOrder_2D_DGAdvective_Triangle_AD_btest
[ 91%] Built target ErrorEstimateOrder_2D_DGAdvective_Triangle_AD_btest_build
Scanning dependencies of target ErrorOrder_3D_DGBR2_Tet_AD_btest_OBJECT
[ 91%] Building CXX object test/system/Asymptotic/CMakeFiles/ErrorOrder_3D_DGBR2_Tet_AD_btest_OBJECT.dir/ErrorOrder_3D_DGBR2_Tet_AD_btest.cpp.o
[ 91%] Built target ErrorOrder_3D_DGBR2_Tet_AD_btest_OBJECT
Scanning dependencies of target ErrorOrder_3D_DGBR2_Tet_AD_btest_build_vera
[ 91%] Checking style of test/system/Asymptotic/ErrorOrder_3D_DGBR2_Tet_AD_btest.cpp
[ 91%] Built target ErrorOrder_3D_DGBR2_Tet_AD_btest_build_vera
Scanning dependencies of target ErrorOrder_3D_DGBR2_Tet_AD_btest_build
[ 91%] Linking CXX executable ErrorOrder_3D_DGBR2_Tet_AD_btest
[ 91%] Built target ErrorOrder_3D_DGBR2_Tet_AD_btest_build
Scanning dependencies of target ErrorOrder_3D_CG_Tet_AD_btest_build_vera
[ 94%] Checking style of test/system/Asymptotic/ErrorOrder_3D_CG_Tet_AD_btest.cpp
[ 94%] Built target ErrorOrder_3D_CG_Tet_AD_btest_build_vera
Scanning dependencies of target ErrorOrder_3D_CG_Tet_AD_btest_OBJECT
[ 94%] Building CXX object test/system/Asymptotic/CMakeFiles/ErrorOrder_3D_CG_Tet_AD_btest_OBJECT.dir/ErrorOrder_3D_CG_Tet_AD_btest.cpp.o
[ 94%] Built target ErrorOrder_3D_CG_Tet_AD_btest_OBJECT
Scanning dependencies of target ErrorOrder_3D_CG_Tet_AD_btest_build
[ 94%] Linking CXX executable ErrorOrder_3D_CG_Tet_AD_btest
[ 94%] Built target ErrorOrder_3D_CG_Tet_AD_btest_build
Scanning dependencies of target ErrorOrder_3D_DGBR2_Sphere_Triangle_AD_btest_build_vera
[ 94%] Checking style of test/system/Asymptotic/ErrorOrder_3D_DGBR2_Sphere_Triangle_AD_btest.cpp
[ 94%] Built target ErrorOrder_3D_DGBR2_Sphere_Triangle_AD_btest_build_vera
Scanning dependencies of target ErrorOrder_3D_DGBR2_Sphere_Triangle_AD_btest_OBJECT
[ 94%] Building CXX object test/system/Asymptotic/CMakeFiles/ErrorOrder_3D_DGBR2_Sphere_Triangle_AD_btest_OBJECT.dir/ErrorOrder_3D_DGBR2_Sphere_Triangle_AD_btest.cpp.o
[ 94%] Built target ErrorOrder_3D_DGBR2_Sphere_Triangle_AD_btest_OBJECT
Scanning dependencies of target ErrorOrder_3D_DGBR2_Sphere_Triangle_AD_btest_build
[ 94%] Linking CXX executable ErrorOrder_3D_DGBR2_Sphere_Triangle_AD_btest
[ 94%] Built target ErrorOrder_3D_DGBR2_Sphere_Triangle_AD_btest_build
Scanning dependencies of target ErrorOrder_1D_DGBR2_Burgers_btest_build_vera
[ 94%] Checking style of test/system/Asymptotic/ErrorOrder_1D_DGBR2_Burgers_btest.cpp
[ 94%] Built target ErrorOrder_1D_DGBR2_Burgers_btest_build_vera
Scanning dependencies of target ErrorOrder_1D_DGBR2_Burgers_btest_OBJECT
[ 94%] Building CXX object test/system/Asymptotic/CMakeFiles/ErrorOrder_1D_DGBR2_Burgers_btest_OBJECT.dir/ErrorOrder_1D_DGBR2_Burgers_btest.cpp.o
[ 94%] Built target ErrorOrder_1D_DGBR2_Burgers_btest_OBJECT
Scanning dependencies of target ErrorOrder_1D_DGBR2_Burgers_btest_build
[ 94%] Linking CXX executable ErrorOrder_1D_DGBR2_Burgers_btest
[ 94%] Built target ErrorOrder_1D_DGBR2_Burgers_btest_build
Scanning dependencies of target Solve2D_DGAdvective_LinearRobin_mitLG_sansLG_Consistency_AD_btest_build_vera
[ 94%] Checking style of test/system/Asymptotic/Solve2D_DGAdvective_LinearRobin_mitLG_sansLG_Consistency_AD_btest.cpp
[ 94%] Built target Solve2D_DGAdvective_LinearRobin_mitLG_sansLG_Consistency_AD_btest_build_vera
Scanning dependencies of target Solve2D_DGAdvective_LinearRobin_mitLG_sansLG_Consistency_AD_btest_OBJECT
[ 94%] Building CXX object test/system/Asymptotic/CMakeFiles/Solve2D_DGAdvective_LinearRobin_mitLG_sansLG_Consistency_AD_btest_OBJECT.dir/Solve2D_DGAdvective_LinearRobin_mitLG_sansLG_Consistency_AD_btest.cpp.o
[ 94%] Built target Solve2D_DGAdvective_LinearRobin_mitLG_sansLG_Consistency_AD_btest_OBJECT
Scanning dependencies of target Solve2D_DGAdvective_LinearRobin_mitLG_sansLG_Consistency_AD_btest_build
[ 94%] Linking CXX executable Solve2D_DGAdvective_LinearRobin_mitLG_sansLG_Consistency_AD_btest
[ 94%] Built target Solve2D_DGAdvective_LinearRobin_mitLG_sansLG_Consistency_AD_btest_build
Scanning dependencies of target Adjoint2D_DGAdvective_Triangle_AD_btest_build_vera
[ 94%] Checking style of test/system/Asymptotic/Adjoint2D_DGAdvective_Triangle_AD_btest.cpp
[ 94%] Built target Adjoint2D_DGAdvective_Triangle_AD_btest_build_vera
Scanning dependencies of target Adjoint2D_DGAdvective_Triangle_AD_btest_OBJECT
[ 94%] Building CXX object test/system/Asymptotic/CMakeFiles/Adjoint2D_DGAdvective_Triangle_AD_btest_OBJECT.dir/Adjoint2D_DGAdvective_Triangle_AD_btest.cpp.o
[ 94%] Built target Adjoint2D_DGAdvective_Triangle_AD_btest_OBJECT
Scanning dependencies of target Adjoint2D_DGAdvective_Triangle_AD_btest_build
[ 94%] Linking CXX executable Adjoint2D_DGAdvective_Triangle_AD_btest
[ 94%] Built target Adjoint2D_DGAdvective_Triangle_AD_btest_build
Scanning dependencies of target ErrorOrder_4D_DG_Pentatope_btest_OBJECT
[ 94%] Building CXX object test/system/Asymptotic/CMakeFiles/ErrorOrder_4D_DG_Pentatope_btest_OBJECT.dir/ErrorOrder_4D_DG_Pentatope_btest.cpp.o
[ 94%] Built target ErrorOrder_4D_DG_Pentatope_btest_OBJECT
Scanning dependencies of target ErrorOrder_4D_DG_Pentatope_btest_build_vera
[ 94%] Checking style of test/system/Asymptotic/ErrorOrder_4D_DG_Pentatope_btest.cpp
[ 94%] Built target ErrorOrder_4D_DG_Pentatope_btest_build_vera
Scanning dependencies of target ErrorOrder_4D_DG_Pentatope_btest_build
[ 94%] Linking CXX executable ErrorOrder_4D_DG_Pentatope_btest
[ 94%] Built target ErrorOrder_4D_DG_Pentatope_btest_build
Scanning dependencies of target ErrorOrder_2D_EDG_Triangle_AD_btest_OBJECT
[ 94%] Building CXX object test/system/Asymptotic/CMakeFiles/ErrorOrder_2D_EDG_Triangle_AD_btest_OBJECT.dir/ErrorOrder_2D_EDG_Triangle_AD_btest.cpp.o
[ 94%] Built target ErrorOrder_2D_EDG_Triangle_AD_btest_OBJECT
Scanning dependencies of target ErrorOrder_2D_EDG_Triangle_AD_btest_build_vera
[ 94%] Checking style of test/system/Asymptotic/ErrorOrder_2D_EDG_Triangle_AD_btest.cpp
[ 94%] Built target ErrorOrder_2D_EDG_Triangle_AD_btest_build_vera
Scanning dependencies of target ErrorOrder_2D_EDG_Triangle_AD_btest_build
[ 94%] Linking CXX executable ErrorOrder_2D_EDG_Triangle_AD_btest
[ 94%] Built target ErrorOrder_2D_EDG_Triangle_AD_btest_build
Scanning dependencies of target ErrorEstimateOrder_1D_CG_Line_AD_btest_OBJECT
[ 94%] Building CXX object test/system/Asymptotic/CMakeFiles/ErrorEstimateOrder_1D_CG_Line_AD_btest_OBJECT.dir/ErrorEstimateOrder_1D_CG_Line_AD_btest.cpp.o
[ 94%] Built target ErrorEstimateOrder_1D_CG_Line_AD_btest_OBJECT
Scanning dependencies of target ErrorEstimateOrder_1D_CG_Line_AD_btest_build_vera
[ 94%] Checking style of test/system/Asymptotic/ErrorEstimateOrder_1D_CG_Line_AD_btest.cpp
[ 94%] Built target ErrorEstimateOrder_1D_CG_Line_AD_btest_build_vera
Scanning dependencies of target ErrorEstimateOrder_1D_CG_Line_AD_btest_build
[ 94%] Linking CXX executable ErrorEstimateOrder_1D_CG_Line_AD_btest
[ 94%] Built target ErrorEstimateOrder_1D_CG_Line_AD_btest_build
Scanning dependencies of target ErrorEstimateOrder_2D_HDG_Triangle_AD_btest_build_vera
[ 94%] Checking style of test/system/Asymptotic/ErrorEstimateOrder_2D_HDG_Triangle_AD_btest.cpp
[ 94%] Built target ErrorEstimateOrder_2D_HDG_Triangle_AD_btest_build_vera
Scanning dependencies of target ErrorEstimateOrder_2D_HDG_Triangle_AD_btest_OBJECT
[ 94%] Building CXX object test/system/Asymptotic/CMakeFiles/ErrorEstimateOrder_2D_HDG_Triangle_AD_btest_OBJECT.dir/ErrorEstimateOrder_2D_HDG_Triangle_AD_btest.cpp.o
[ 94%] Built target ErrorEstimateOrder_2D_HDG_Triangle_AD_btest_OBJECT
Scanning dependencies of target ErrorEstimateOrder_2D_HDG_Triangle_AD_btest_build
[ 94%] Linking CXX executable ErrorEstimateOrder_2D_HDG_Triangle_AD_btest
[ 94%] Built target ErrorEstimateOrder_2D_HDG_Triangle_AD_btest_build
Scanning dependencies of target ErrorOrder_1D_HDG_Burgers_btest_OBJECT
[ 94%] Building CXX object test/system/Asymptotic/CMakeFiles/ErrorOrder_1D_HDG_Burgers_btest_OBJECT.dir/ErrorOrder_1D_HDG_Burgers_btest.cpp.o
[ 94%] Built target ErrorOrder_1D_HDG_Burgers_btest_OBJECT
Scanning dependencies of target ErrorOrder_1D_HDG_Burgers_btest_build_vera
[ 94%] Checking style of test/system/Asymptotic/ErrorOrder_1D_HDG_Burgers_btest.cpp
[ 94%] Built target ErrorOrder_1D_HDG_Burgers_btest_build_vera
Scanning dependencies of target ErrorOrder_1D_HDG_Burgers_btest_build
[ 94%] Linking CXX executable ErrorOrder_1D_HDG_Burgers_btest
[ 94%] Built target ErrorOrder_1D_HDG_Burgers_btest_build
Scanning dependencies of target ErrorOrder_1D_DGBR2_TwoPhase_ST_btest_build_vera
[ 94%] Checking style of test/system/Asymptotic/ErrorOrder_1D_DGBR2_TwoPhase_ST_btest.cpp
[ 94%] Built target ErrorOrder_1D_DGBR2_TwoPhase_ST_btest_build_vera
Scanning dependencies of target ErrorOrder_1D_DGBR2_TwoPhase_ST_btest_OBJECT
[ 94%] Building CXX object test/system/Asymptotic/CMakeFiles/ErrorOrder_1D_DGBR2_TwoPhase_ST_btest_OBJECT.dir/ErrorOrder_1D_DGBR2_TwoPhase_ST_btest.cpp.o
[ 94%] Built target ErrorOrder_1D_DGBR2_TwoPhase_ST_btest_OBJECT
Scanning dependencies of target ErrorOrder_1D_DGBR2_TwoPhase_ST_btest_build
[ 94%] Linking CXX executable ErrorOrder_1D_DGBR2_TwoPhase_ST_btest
[ 94%] Built target ErrorOrder_1D_DGBR2_TwoPhase_ST_btest_build
Scanning dependencies of target Adjoint1D_DGBR2_BuckleyLeverett_ST_btest_build_vera
[ 94%] Checking style of test/system/Asymptotic/Adjoint1D_DGBR2_BuckleyLeverett_ST_btest.cpp
[ 94%] Built target Adjoint1D_DGBR2_BuckleyLeverett_ST_btest_build_vera
Scanning dependencies of target Adjoint1D_DGBR2_BuckleyLeverett_ST_btest_OBJECT
[ 94%] Building CXX object test/system/Asymptotic/CMakeFiles/Adjoint1D_DGBR2_BuckleyLeverett_ST_btest_OBJECT.dir/Adjoint1D_DGBR2_BuckleyLeverett_ST_btest.cpp.o
[ 94%] Built target Adjoint1D_DGBR2_BuckleyLeverett_ST_btest_OBJECT
Scanning dependencies of target Adjoint1D_DGBR2_BuckleyLeverett_ST_btest_build
[ 94%] Linking CXX executable Adjoint1D_DGBR2_BuckleyLeverett_ST_btest
[ 94%] Built target Adjoint1D_DGBR2_BuckleyLeverett_ST_btest_build
Scanning dependencies of target ErrorOrder_3D_CG_Sphere_Triangle_AD_btest_build_vera
[ 94%] Checking style of test/system/Asymptotic/ErrorOrder_3D_CG_Sphere_Triangle_AD_btest.cpp
[ 94%] Built target ErrorOrder_3D_CG_Sphere_Triangle_AD_btest_build_vera
Scanning dependencies of target ErrorOrder_3D_CG_Sphere_Triangle_AD_btest_OBJECT
[ 94%] Building CXX object test/system/Asymptotic/CMakeFiles/ErrorOrder_3D_CG_Sphere_Triangle_AD_btest_OBJECT.dir/ErrorOrder_3D_CG_Sphere_Triangle_AD_btest.cpp.o
[ 94%] Built target ErrorOrder_3D_CG_Sphere_Triangle_AD_btest_OBJECT
Scanning dependencies of target ErrorOrder_3D_CG_Sphere_Triangle_AD_btest_build
[ 94%] Linking CXX executable ErrorOrder_3D_CG_Sphere_Triangle_AD_btest
[ 94%] Built target ErrorOrder_3D_CG_Sphere_Triangle_AD_btest_build
Scanning dependencies of target ErrorOrder_1D_HDG_AD_btest_build_vera
[ 94%] Checking style of test/system/Asymptotic/ErrorOrder_1D_HDG_AD_btest.cpp
[ 94%] Built target ErrorOrder_1D_HDG_AD_btest_build_vera
Scanning dependencies of target ErrorOrder_1D_HDG_AD_btest_OBJECT
[ 94%] Building CXX object test/system/Asymptotic/CMakeFiles/ErrorOrder_1D_HDG_AD_btest_OBJECT.dir/ErrorOrder_1D_HDG_AD_btest.cpp.o
[ 94%] Built target ErrorOrder_1D_HDG_AD_btest_OBJECT
Scanning dependencies of target ErrorOrder_1D_HDG_AD_btest_build
[ 94%] Linking CXX executable ErrorOrder_1D_HDG_AD_btest
[ 94%] Built target ErrorOrder_1D_HDG_AD_btest_build
Scanning dependencies of target ErrorOrder_1D_HDG_AD_BDF_btest_build_vera
[ 94%] Checking style of test/system/Asymptotic/ErrorOrder_1D_HDG_AD_BDF_btest.cpp
[ 94%] Built target ErrorOrder_1D_HDG_AD_BDF_btest_build_vera
Scanning dependencies of target ErrorOrder_1D_HDG_AD_BDF_btest_OBJECT
[ 94%] Building CXX object test/system/Asymptotic/CMakeFiles/ErrorOrder_1D_HDG_AD_BDF_btest_OBJECT.dir/ErrorOrder_1D_HDG_AD_BDF_btest.cpp.o
[ 94%] Built target ErrorOrder_1D_HDG_AD_BDF_btest_OBJECT
Scanning dependencies of target ErrorOrder_1D_HDG_AD_BDF_btest_build
[ 94%] Linking CXX executable ErrorOrder_1D_HDG_AD_BDF_btest
[ 94%] Built target ErrorOrder_1D_HDG_AD_BDF_btest_build
Scanning dependencies of target ErrorOrder_1D_DGBR2_AD_BDF_btest_build_vera
[ 94%] Checking style of test/system/Asymptotic/ErrorOrder_1D_DGBR2_AD_BDF_btest.cpp
[ 94%] Built target ErrorOrder_1D_DGBR2_AD_BDF_btest_build_vera
Scanning dependencies of target ErrorOrder_1D_DGBR2_AD_BDF_btest_OBJECT
[ 94%] Building CXX object test/system/Asymptotic/CMakeFiles/ErrorOrder_1D_DGBR2_AD_BDF_btest_OBJECT.dir/ErrorOrder_1D_DGBR2_AD_BDF_btest.cpp.o
[ 94%] Built target ErrorOrder_1D_DGBR2_AD_BDF_btest_OBJECT
Scanning dependencies of target ErrorOrder_1D_DGBR2_AD_BDF_btest_build
[ 94%] Linking CXX executable ErrorOrder_1D_DGBR2_AD_BDF_btest
[ 94%] Built target ErrorOrder_1D_DGBR2_AD_BDF_btest_build
Scanning dependencies of target ErrorOrder_1D_HDGAdvective_Advection_btest_build_vera
[ 94%] Checking style of test/system/Asymptotic/ErrorOrder_1D_HDGAdvective_Advection_btest.cpp
[ 94%] Built target ErrorOrder_1D_HDGAdvective_Advection_btest_build_vera
Scanning dependencies of target ErrorOrder_1D_HDGAdvective_Advection_btest_OBJECT
[ 94%] Building CXX object test/system/Asymptotic/CMakeFiles/ErrorOrder_1D_HDGAdvective_Advection_btest_OBJECT.dir/ErrorOrder_1D_HDGAdvective_Advection_btest.cpp.o
[ 94%] Built target ErrorOrder_1D_HDGAdvective_Advection_btest_OBJECT
Scanning dependencies of target ErrorOrder_1D_HDGAdvective_Advection_btest_build
[ 94%] Linking CXX executable ErrorOrder_1D_HDGAdvective_Advection_btest
[ 94%] Built target ErrorOrder_1D_HDGAdvective_Advection_btest_build
Scanning dependencies of target ErrorEstimateOrder_2D_CG_Triangle_AD_btest_OBJECT
[ 94%] Building CXX object test/system/Asymptotic/CMakeFiles/ErrorEstimateOrder_2D_CG_Triangle_AD_btest_OBJECT.dir/ErrorEstimateOrder_2D_CG_Triangle_AD_btest.cpp.o
[ 94%] Built target ErrorEstimateOrder_2D_CG_Triangle_AD_btest_OBJECT
Scanning dependencies of target ErrorEstimateOrder_2D_CG_Triangle_AD_btest_build_vera
[ 94%] Checking style of test/system/Asymptotic/ErrorEstimateOrder_2D_CG_Triangle_AD_btest.cpp
[ 94%] Built target ErrorEstimateOrder_2D_CG_Triangle_AD_btest_build_vera
Scanning dependencies of target ErrorEstimateOrder_2D_CG_Triangle_AD_btest_build
[ 94%] Linking CXX executable ErrorEstimateOrder_2D_CG_Triangle_AD_btest
[ 94%] Built target ErrorEstimateOrder_2D_CG_Triangle_AD_btest_build
Scanning dependencies of target ErrorOrder_1D_CG_AD_BDF_btest_OBJECT
[ 94%] Building CXX object test/system/Asymptotic/CMakeFiles/ErrorOrder_1D_CG_AD_BDF_btest_OBJECT.dir/ErrorOrder_1D_CG_AD_BDF_btest.cpp.o
[ 94%] Built target ErrorOrder_1D_CG_AD_BDF_btest_OBJECT
Scanning dependencies of target ErrorOrder_1D_CG_AD_BDF_btest_build_vera
[ 94%] Checking style of test/system/Asymptotic/ErrorOrder_1D_CG_AD_BDF_btest.cpp
[ 94%] Built target ErrorOrder_1D_CG_AD_BDF_btest_build_vera
Scanning dependencies of target ErrorOrder_1D_CG_AD_BDF_btest_build
[ 94%] Linking CXX executable ErrorOrder_1D_CG_AD_BDF_btest
[ 94%] Built target ErrorOrder_1D_CG_AD_BDF_btest_build
Scanning dependencies of target ErrorEstimateOrder_1D_DGBR2_Line_AD_btest_build_vera
[ 94%] Checking style of test/system/Asymptotic/ErrorEstimateOrder_1D_DGBR2_Line_AD_btest.cpp
[ 94%] Built target ErrorEstimateOrder_1D_DGBR2_Line_AD_btest_build_vera
Scanning dependencies of target ErrorEstimateOrder_1D_DGBR2_Line_AD_btest_OBJECT
[ 94%] Building CXX object test/system/Asymptotic/CMakeFiles/ErrorEstimateOrder_1D_DGBR2_Line_AD_btest_OBJECT.dir/ErrorEstimateOrder_1D_DGBR2_Line_AD_btest.cpp.o
[ 94%] Built target ErrorEstimateOrder_1D_DGBR2_Line_AD_btest_OBJECT
Scanning dependencies of target ErrorEstimateOrder_1D_DGBR2_Line_AD_btest_build
[ 94%] Linking CXX executable ErrorEstimateOrder_1D_DGBR2_Line_AD_btest
[ 94%] Built target ErrorEstimateOrder_1D_DGBR2_Line_AD_btest_build
Scanning dependencies of target ErrorOrder_3D_CG_Hex_AD_btest_OBJECT
[ 94%] Building CXX object test/system/Asymptotic/CMakeFiles/ErrorOrder_3D_CG_Hex_AD_btest_OBJECT.dir/ErrorOrder_3D_CG_Hex_AD_btest.cpp.o
[ 94%] Built target ErrorOrder_3D_CG_Hex_AD_btest_OBJECT
Scanning dependencies of target ErrorOrder_3D_CG_Hex_AD_btest_build_vera
[ 94%] Checking style of test/system/Asymptotic/ErrorOrder_3D_CG_Hex_AD_btest.cpp
[ 94%] Built target ErrorOrder_3D_CG_Hex_AD_btest_build_vera
Scanning dependencies of target ErrorOrder_3D_CG_Hex_AD_btest_build
[ 94%] Linking CXX executable ErrorOrder_3D_CG_Hex_AD_btest
[ 94%] Built target ErrorOrder_3D_CG_Hex_AD_btest_build
Scanning dependencies of target ErrorEstimateOrder_2D_CG_Nodal_Triangle_AD_btest_OBJECT
[ 94%] Building CXX object test/system/Asymptotic/CMakeFiles/ErrorEstimateOrder_2D_CG_Nodal_Triangle_AD_btest_OBJECT.dir/ErrorEstimateOrder_2D_CG_Nodal_Triangle_AD_btest.cpp.o
[ 94%] Built target ErrorEstimateOrder_2D_CG_Nodal_Triangle_AD_btest_OBJECT
Scanning dependencies of target ErrorEstimateOrder_2D_CG_Nodal_Triangle_AD_btest_build_vera
[ 94%] Checking style of test/system/Asymptotic/ErrorEstimateOrder_2D_CG_Nodal_Triangle_AD_btest.cpp
[ 94%] Built target ErrorEstimateOrder_2D_CG_Nodal_Triangle_AD_btest_build_vera
Scanning dependencies of target ErrorEstimateOrder_2D_CG_Nodal_Triangle_AD_btest_build
[ 94%] Linking CXX executable ErrorEstimateOrder_2D_CG_Nodal_Triangle_AD_btest
[ 94%] Built target ErrorEstimateOrder_2D_CG_Nodal_Triangle_AD_btest_build
Scanning dependencies of target ErrorOrder_2D_DGAdvective_Flat_Line_AD_btest_OBJECT
[ 94%] Building CXX object test/system/Asymptotic/CMakeFiles/ErrorOrder_2D_DGAdvective_Flat_Line_AD_btest_OBJECT.dir/ErrorOrder_2D_DGAdvective_Flat_Line_AD_btest.cpp.o
[ 94%] Built target ErrorOrder_2D_DGAdvective_Flat_Line_AD_btest_OBJECT
Scanning dependencies of target ErrorOrder_2D_DGAdvective_Flat_Line_AD_btest_build_vera
[ 94%] Checking style of test/system/Asymptotic/ErrorOrder_2D_DGAdvective_Flat_Line_AD_btest.cpp
[ 94%] Built target ErrorOrder_2D_DGAdvective_Flat_Line_AD_btest_build_vera
Scanning dependencies of target ErrorOrder_2D_DGAdvective_Flat_Line_AD_btest_build
[ 94%] Linking CXX executable ErrorOrder_2D_DGAdvective_Flat_Line_AD_btest
[ 94%] Built target ErrorOrder_2D_DGAdvective_Flat_Line_AD_btest_build
Scanning dependencies of target ErrorOrder_1D_DGBR2_AD_btest_OBJECT
[ 94%] Building CXX object test/system/Asymptotic/CMakeFiles/ErrorOrder_1D_DGBR2_AD_btest_OBJECT.dir/ErrorOrder_1D_DGBR2_AD_btest.cpp.o
[ 94%] Built target ErrorOrder_1D_DGBR2_AD_btest_OBJECT
Scanning dependencies of target ErrorOrder_1D_DGBR2_AD_btest_build_vera
[ 94%] Checking style of test/system/Asymptotic/ErrorOrder_1D_DGBR2_AD_btest.cpp
[ 94%] Built target ErrorOrder_1D_DGBR2_AD_btest_build_vera
Scanning dependencies of target ErrorOrder_1D_DGBR2_AD_btest_build
[ 94%] Linking CXX executable ErrorOrder_1D_DGBR2_AD_btest
[ 94%] Built target ErrorOrder_1D_DGBR2_AD_btest_build
Scanning dependencies of target ErrorOrder_2D_HDG_Triangle_AD_btest_build_vera
[ 94%] Checking style of test/system/Asymptotic/ErrorOrder_2D_HDG_Triangle_AD_btest.cpp
[ 94%] Built target ErrorOrder_2D_HDG_Triangle_AD_btest_build_vera
Scanning dependencies of target ErrorOrder_2D_HDG_Triangle_AD_btest_OBJECT
[ 94%] Building CXX object test/system/Asymptotic/CMakeFiles/ErrorOrder_2D_HDG_Triangle_AD_btest_OBJECT.dir/ErrorOrder_2D_HDG_Triangle_AD_btest.cpp.o
[ 94%] Built target ErrorOrder_2D_HDG_Triangle_AD_btest_OBJECT
Scanning dependencies of target ErrorOrder_2D_HDG_Triangle_AD_btest_build
[ 94%] Linking CXX executable ErrorOrder_2D_HDG_Triangle_AD_btest
[ 94%] Built target ErrorOrder_2D_HDG_Triangle_AD_btest_build
Scanning dependencies of target ErrorOrder_2D_DGAdvective_Annulus_Triangle_btest_OBJECT
[ 94%] Building CXX object test/system/Asymptotic/CMakeFiles/ErrorOrder_2D_DGAdvective_Annulus_Triangle_btest_OBJECT.dir/ErrorOrder_2D_DGAdvective_Annulus_Triangle_btest.cpp.o
[ 94%] Built target ErrorOrder_2D_DGAdvective_Annulus_Triangle_btest_OBJECT
Scanning dependencies of target ErrorOrder_2D_DGAdvective_Annulus_Triangle_btest_build_vera
[ 94%] Checking style of test/system/Asymptotic/ErrorOrder_2D_DGAdvective_Annulus_Triangle_btest.cpp
[ 94%] Built target ErrorOrder_2D_DGAdvective_Annulus_Triangle_btest_build_vera
Scanning dependencies of target ErrorOrder_2D_DGAdvective_Annulus_Triangle_btest_build
[ 94%] Linking CXX executable ErrorOrder_2D_DGAdvective_Annulus_Triangle_btest
[ 94%] Built target ErrorOrder_2D_DGAdvective_Annulus_Triangle_btest_build
Scanning dependencies of target ErrorOrder_2D_DGAdvective_Circle_Line_AD_btest_OBJECT
[ 94%] Building CXX object test/system/Asymptotic/CMakeFiles/ErrorOrder_2D_DGAdvective_Circle_Line_AD_btest_OBJECT.dir/ErrorOrder_2D_DGAdvective_Circle_Line_AD_btest.cpp.o
[ 94%] Built target ErrorOrder_2D_DGAdvective_Circle_Line_AD_btest_OBJECT
Scanning dependencies of target ErrorOrder_2D_DGAdvective_Circle_Line_AD_btest_build_vera
[ 94%] Checking style of test/system/Asymptotic/ErrorOrder_2D_DGAdvective_Circle_Line_AD_btest.cpp
[ 94%] Built target ErrorOrder_2D_DGAdvective_Circle_Line_AD_btest_build_vera
Scanning dependencies of target ErrorOrder_2D_DGAdvective_Circle_Line_AD_btest_build
[ 94%] Linking CXX executable ErrorOrder_2D_DGAdvective_Circle_Line_AD_btest
[ 94%] Built target ErrorOrder_2D_DGAdvective_Circle_Line_AD_btest_build
Scanning dependencies of target ErrorEstimateOrder_2D_CG_Triangle_RD_btest_OBJECT
[ 94%] Building CXX object test/system/Asymptotic/CMakeFiles/ErrorEstimateOrder_2D_CG_Triangle_RD_btest_OBJECT.dir/ErrorEstimateOrder_2D_CG_Triangle_RD_btest.cpp.o
[ 94%] Built target ErrorEstimateOrder_2D_CG_Triangle_RD_btest_OBJECT
Scanning dependencies of target ErrorEstimateOrder_2D_CG_Triangle_RD_btest_build_vera
[ 94%] Checking style of test/system/Asymptotic/ErrorEstimateOrder_2D_CG_Triangle_RD_btest.cpp
[ 94%] Built target ErrorEstimateOrder_2D_CG_Triangle_RD_btest_build_vera
Scanning dependencies of target ErrorEstimateOrder_2D_CG_Triangle_RD_btest_build
[ 94%] Linking CXX executable ErrorEstimateOrder_2D_CG_Triangle_RD_btest
[ 94%] Built target ErrorEstimateOrder_2D_CG_Triangle_RD_btest_build
Scanning dependencies of target ErrorOrder_2D_CG_Triangle_AD_btest_OBJECT
[ 94%] Building CXX object test/system/Asymptotic/CMakeFiles/ErrorOrder_2D_CG_Triangle_AD_btest_OBJECT.dir/ErrorOrder_2D_CG_Triangle_AD_btest.cpp.o
[ 94%] Built target ErrorOrder_2D_CG_Triangle_AD_btest_OBJECT
Scanning dependencies of target ErrorOrder_2D_CG_Triangle_AD_btest_build_vera
[ 94%] Checking style of test/system/Asymptotic/ErrorOrder_2D_CG_Triangle_AD_btest.cpp
[ 94%] Built target ErrorOrder_2D_CG_Triangle_AD_btest_build_vera
Scanning dependencies of target ErrorOrder_2D_CG_Triangle_AD_btest_build
[ 94%] Linking CXX executable ErrorOrder_2D_CG_Triangle_AD_btest
[ 94%] Built target ErrorOrder_2D_CG_Triangle_AD_btest_build
Scanning dependencies of target ErrorOrder_1D_DGBR2_BuckleyLeverett_ST_btest_build_vera
[ 94%] Checking style of test/system/Asymptotic/ErrorOrder_1D_DGBR2_BuckleyLeverett_ST_btest.cpp
[ 94%] Built target ErrorOrder_1D_DGBR2_BuckleyLeverett_ST_btest_build_vera
Scanning dependencies of target ErrorOrder_1D_DGBR2_BuckleyLeverett_ST_btest_OBJECT
[ 94%] Building CXX object test/system/Asymptotic/CMakeFiles/ErrorOrder_1D_DGBR2_BuckleyLeverett_ST_btest_OBJECT.dir/ErrorOrder_1D_DGBR2_BuckleyLeverett_ST_btest.cpp.o
[ 94%] Built target ErrorOrder_1D_DGBR2_BuckleyLeverett_ST_btest_OBJECT
Scanning dependencies of target ErrorOrder_1D_DGBR2_BuckleyLeverett_ST_btest_build
[ 94%] Linking CXX executable ErrorOrder_1D_DGBR2_BuckleyLeverett_ST_btest
[ 94%] Built target ErrorOrder_1D_DGBR2_BuckleyLeverett_ST_btest_build
Scanning dependencies of target ErrorOrder_2D_CG_Quad_AD_btest_build_vera
[ 94%] Checking style of test/system/Asymptotic/ErrorOrder_2D_CG_Quad_AD_btest.cpp
[ 94%] Built target ErrorOrder_2D_CG_Quad_AD_btest_build_vera
Scanning dependencies of target ErrorOrder_2D_CG_Quad_AD_btest_OBJECT
[ 94%] Building CXX object test/system/Asymptotic/CMakeFiles/ErrorOrder_2D_CG_Quad_AD_btest_OBJECT.dir/ErrorOrder_2D_CG_Quad_AD_btest.cpp.o
[ 94%] Built target ErrorOrder_2D_CG_Quad_AD_btest_OBJECT
Scanning dependencies of target ErrorOrder_2D_CG_Quad_AD_btest_build
[ 94%] Linking CXX executable ErrorOrder_2D_CG_Quad_AD_btest
[ 94%] Built target ErrorOrder_2D_CG_Quad_AD_btest_build
Scanning dependencies of target ErrorEstimateOrder_2D_DGBR2_Triangle_AD_btest_OBJECT
[ 94%] Building CXX object test/system/Asymptotic/CMakeFiles/ErrorEstimateOrder_2D_DGBR2_Triangle_AD_btest_OBJECT.dir/ErrorEstimateOrder_2D_DGBR2_Triangle_AD_btest.cpp.o
[ 94%] Built target ErrorEstimateOrder_2D_DGBR2_Triangle_AD_btest_OBJECT
Scanning dependencies of target ErrorEstimateOrder_2D_DGBR2_Triangle_AD_btest_build_vera
[ 94%] Checking style of test/system/Asymptotic/ErrorEstimateOrder_2D_DGBR2_Triangle_AD_btest.cpp
[ 94%] Built target ErrorEstimateOrder_2D_DGBR2_Triangle_AD_btest_build_vera
Scanning dependencies of target ErrorEstimateOrder_2D_DGBR2_Triangle_AD_btest_build
[ 94%] Linking CXX executable ErrorEstimateOrder_2D_DGBR2_Triangle_AD_btest
[ 94%] Built target ErrorEstimateOrder_2D_DGBR2_Triangle_AD_btest_build
Scanning dependencies of target ErrorOrder_2D_DGAdvective_Circle_Line_ShallowWater_btest_build_vera
[ 94%] Checking style of test/system/Asymptotic/ErrorOrder_2D_DGAdvective_Circle_Line_ShallowWater_btest.cpp
[ 94%] Built target ErrorOrder_2D_DGAdvective_Circle_Line_ShallowWater_btest_build_vera
Scanning dependencies of target ErrorOrder_2D_DGAdvective_Circle_Line_ShallowWater_btest_OBJECT
[ 94%] Building CXX object test/system/Asymptotic/CMakeFiles/ErrorOrder_2D_DGAdvective_Circle_Line_ShallowWater_btest_OBJECT.dir/ErrorOrder_2D_DGAdvective_Circle_Line_ShallowWater_btest.cpp.o
[ 94%] Built target ErrorOrder_2D_DGAdvective_Circle_Line_ShallowWater_btest_OBJECT
Scanning dependencies of target ErrorOrder_2D_DGAdvective_Circle_Line_ShallowWater_btest_build
[ 94%] Linking CXX executable ErrorOrder_2D_DGAdvective_Circle_Line_ShallowWater_btest
[ 94%] Built target ErrorOrder_2D_DGAdvective_Circle_Line_ShallowWater_btest_build
Scanning dependencies of target ErrorOrder_1D_DGAdvective_ShallowWater_btest_OBJECT
[ 94%] Building CXX object test/system/Asymptotic/CMakeFiles/ErrorOrder_1D_DGAdvective_ShallowWater_btest_OBJECT.dir/ErrorOrder_1D_DGAdvective_ShallowWater_btest.cpp.o
[ 94%] Built target ErrorOrder_1D_DGAdvective_ShallowWater_btest_OBJECT
Scanning dependencies of target ErrorOrder_1D_DGAdvective_ShallowWater_btest_build_vera
[ 94%] Checking style of test/system/Asymptotic/ErrorOrder_1D_DGAdvective_ShallowWater_btest.cpp
[ 94%] Built target ErrorOrder_1D_DGAdvective_ShallowWater_btest_build_vera
Scanning dependencies of target ErrorOrder_1D_DGAdvective_ShallowWater_btest_build
[ 94%] Linking CXX executable ErrorOrder_1D_DGAdvective_ShallowWater_btest
[ 94%] Built target ErrorOrder_1D_DGAdvective_ShallowWater_btest_build
Scanning dependencies of target LocalSolve1D_HDG_AD_btest_build_vera
[ 94%] Checking style of test/system/LocalSolve/LocalSolve1D_HDG_AD_btest.cpp
[ 94%] Built target LocalSolve1D_HDG_AD_btest_build_vera
Scanning dependencies of target BlockLib
[ 94%] Building CXX object src/Discretization/CMakeFiles/BlockLib.dir/Block/AlgebraicEquationSet_Block2x2_Real_Real.cpp.o
[ 94%] Building CXX object src/Discretization/CMakeFiles/BlockLib.dir/Block/AlgebraicEquationSet_Block2x2_VecS3_Real.cpp.o
[ 94%] Building CXX object src/Discretization/CMakeFiles/BlockLib.dir/Block/AlgebraicEquationSet_Block2x2_VecS4_Real.cpp.o
[ 94%] Linking CXX static library libBlockLib.a
[ 94%] Built target BlockLib
Scanning dependencies of target BlockLinAlgLib_vera
[ 94%] Checking style of src/LinearAlgebra/BlockLinAlg/MatrixBlock_3x3.h
[ 94%] Checking style of src/LinearAlgebra/BlockLinAlg/MatrixBlock_2x2.h
[ 94%] Checking style of src/LinearAlgebra/BlockLinAlg/MatrixBlock_2x2_InverseLU.h
[ 94%] Checking style of src/LinearAlgebra/BlockLinAlg/MatrixBlock_2x2_Inverse.h
[ 94%] Checking style of src/LinearAlgebra/BlockLinAlg/BlockLinAlg_Type.h
[ 94%] Checking style of src/LinearAlgebra/BlockLinAlg/MatrixBlock_2x2_Decompose_LU.h
[ 94%] Checking style of src/LinearAlgebra/BlockLinAlg/VectorBlock_4.h
[ 94%] Checking style of src/LinearAlgebra/BlockLinAlg/MatrixBlock_2x2_Transpose.h
[ 94%] Checking style of src/LinearAlgebra/BlockLinAlg/MatrixBlock_2x2_InverseLUP.h
[ 94%] Checking style of src/LinearAlgebra/BlockLinAlg/MatrixBlock_4x4.h
[ 94%] Checking style of src/LinearAlgebra/BlockLinAlg/BlockLinAlg_Add.h
[ 94%] Checking style of src/LinearAlgebra/BlockLinAlg/BlockLinAlg_Mul.h
[ 94%] Checking style of src/LinearAlgebra/BlockLinAlg/MatrixBlock_2x2_Decompose_LUP.h
[ 94%] Checking style of src/LinearAlgebra/BlockLinAlg/VectorBlock_3.h
[ 94%] Checking style of src/LinearAlgebra/BlockLinAlg/VectorBlock_2.h
[ 94%] Checking style of src/LinearAlgebra/BlockLinAlg/MatrixBlock_2x2_InverseLUP.cpp
[ 94%] Checking style of src/LinearAlgebra/BlockLinAlg/MatrixBlock_2x2_Decompose_LUP.cpp
[ 94%] Checking style of src/LinearAlgebra/BlockLinAlg/MatrixBlock_2x2_Decompose_LU.cpp
[ 94%] Checking style of src/LinearAlgebra/BlockLinAlg/MatrixBlock_2x2_InverseLU.cpp
[ 94%] Built target BlockLinAlgLib_vera
Scanning dependencies of target BlockLinAlgLib
[ 94%] Building CXX object src/LinearAlgebra/BlockLinAlg/CMakeFiles/BlockLinAlgLib.dir/MatrixBlock_2x2_Decompose_LU.cpp.o
[ 94%] Building CXX object src/LinearAlgebra/BlockLinAlg/CMakeFiles/BlockLinAlgLib.dir/MatrixBlock_2x2_Decompose_LUP.cpp.o
[ 94%] Building CXX object src/LinearAlgebra/BlockLinAlg/CMakeFiles/BlockLinAlgLib.dir/MatrixBlock_2x2_InverseLU.cpp.o
[ 94%] Building CXX object src/LinearAlgebra/BlockLinAlg/CMakeFiles/BlockLinAlgLib.dir/MatrixBlock_2x2_InverseLUP.cpp.o
[ 94%] Linking CXX static library libBlockLinAlgLib.a
[ 94%] Built target BlockLinAlgLib
Scanning dependencies of target pdeSensorLib_vera
[ 97%] Checking style of src/pde/Sensor/Sensor_ViscousFlux1D.h
[ 97%] Checking style of src/pde/Sensor/Source1D_JumpSensor.h
[ 97%] Checking style of src/pde/Sensor/BCSensorParameter2D.h
[ 97%] Checking style of src/pde/Sensor/Sensor_Source1D.h
[ 97%] Checking style of src/pde/Sensor/Source2D_JumpSensor.h
[ 97%] Checking style of src/pde/Sensor/Sensor_Source2D.h
[ 97%] Checking style of src/pde/Sensor/PDESensorParameter2D.h
[ 97%] Checking style of src/pde/Sensor/Sensor_AdvectiveFlux2D.h
[ 97%] Checking style of src/pde/Sensor/Sensor_ViscousFlux2D.h
[ 97%] Checking style of src/pde/Sensor/BCSensorParameter1D.h
[ 97%] Checking style of src/pde/Sensor/SensorParameter_Traits.h
[ 97%] Checking style of src/pde/Sensor/PDESensorParameter1D.h
[ 97%] Checking style of src/pde/Sensor/Sensor_AdvectiveFlux1D.h
[ 97%] Checking style of src/pde/Sensor/Sensor_ViscousFlux1D.cpp
[ 97%] Checking style of src/pde/Sensor/Sensor_ViscousFlux2D.cpp
[ 97%] Checking style of src/pde/Sensor/Sensor_AdvectiveFlux1D.cpp
[ 97%] Checking style of src/pde/Sensor/PDESensorParameter1D.cpp
[ 97%] Checking style of src/pde/Sensor/Sensor_AdvectiveFlux2D.cpp
[ 97%] Checking style of src/pde/Sensor/BCSensorParameter2D.cpp
[ 97%] Checking style of src/pde/Sensor/BCSensorParameter1D.cpp
[ 97%] Checking style of src/pde/Sensor/PDESensorParameter2D.cpp
[ 97%] Built target pdeSensorLib_vera
Scanning dependencies of target pdeSensorLib
[ 97%] Building CXX object src/pde/Sensor/CMakeFiles/pdeSensorLib.dir/BCSensorParameter1D.cpp.o
[ 97%] Building CXX object src/pde/Sensor/CMakeFiles/pdeSensorLib.dir/BCSensorParameter2D.cpp.o
[ 97%] Building CXX object src/pde/Sensor/CMakeFiles/pdeSensorLib.dir/PDESensorParameter1D.cpp.o
[ 97%] Building CXX object src/pde/Sensor/CMakeFiles/pdeSensorLib.dir/PDESensorParameter2D.cpp.o
[ 97%] Building CXX object src/pde/Sensor/CMakeFiles/pdeSensorLib.dir/Sensor_AdvectiveFlux1D.cpp.o
[ 97%] Building CXX object src/pde/Sensor/CMakeFiles/pdeSensorLib.dir/Sensor_AdvectiveFlux2D.cpp.o
[ 97%] Building CXX object src/pde/Sensor/CMakeFiles/pdeSensorLib.dir/Sensor_ViscousFlux1D.cpp.o
[ 97%] Building CXX object src/pde/Sensor/CMakeFiles/pdeSensorLib.dir/Sensor_ViscousFlux2D.cpp.o
[ 97%] Linking CXX static library libpdeSensorLib.a
[ 97%] Built target pdeSensorLib
Scanning dependencies of target LocalSolve1D_HDG_AD_btest_OBJECT
[ 97%] Building CXX object test/system/LocalSolve/CMakeFiles/LocalSolve1D_HDG_AD_btest_OBJECT.dir/LocalSolve1D_HDG_AD_btest.cpp.o
[ 97%] Built target LocalSolve1D_HDG_AD_btest_OBJECT
Scanning dependencies of target LocalSolve1D_HDG_AD_btest_build
[ 97%] Linking CXX executable LocalSolve1D_HDG_AD_btest
[ 97%] Built target LocalSolve1D_HDG_AD_btest_build
Scanning dependencies of target LocalSolve1D_Split_HDG_AD_btest_build_vera
[ 97%] Checking style of test/system/LocalSolve/LocalSolve1D_Split_HDG_AD_btest.cpp
[ 97%] Built target LocalSolve1D_Split_HDG_AD_btest_build_vera
Scanning dependencies of target LocalSolve1D_Split_HDG_AD_btest_OBJECT
[ 97%] Building CXX object test/system/LocalSolve/CMakeFiles/LocalSolve1D_Split_HDG_AD_btest_OBJECT.dir/LocalSolve1D_Split_HDG_AD_btest.cpp.o
[ 97%] Built target LocalSolve1D_Split_HDG_AD_btest_OBJECT
Scanning dependencies of target LocalSolve1D_Split_HDG_AD_btest_build
[ 97%] Linking CXX executable LocalSolve1D_Split_HDG_AD_btest
[ 97%] Built target LocalSolve1D_Split_HDG_AD_btest_build
Scanning dependencies of target LocalSolve2D_Split_DGBR2_Triangle_AD_AV_btest_build_vera
[ 97%] Checking style of test/system/LocalSolve/LocalSolve2D_Split_DGBR2_Triangle_AD_AV_btest.cpp
[ 97%] Built target LocalSolve2D_Split_DGBR2_Triangle_AD_AV_btest_build_vera
Scanning dependencies of target LocalSolve2D_Split_DGBR2_Triangle_AD_AV_btest_OBJECT
[ 97%] Building CXX object test/system/LocalSolve/CMakeFiles/LocalSolve2D_Split_DGBR2_Triangle_AD_AV_btest_OBJECT.dir/LocalSolve2D_Split_DGBR2_Triangle_AD_AV_btest.cpp.o
[ 97%] Built target LocalSolve2D_Split_DGBR2_Triangle_AD_AV_btest_OBJECT
Scanning dependencies of target LocalSolve2D_Split_DGBR2_Triangle_AD_AV_btest_build
[ 97%] Linking CXX executable LocalSolve2D_Split_DGBR2_Triangle_AD_AV_btest
[ 97%] Built target LocalSolve2D_Split_DGBR2_Triangle_AD_AV_btest_build
Scanning dependencies of target LocalSolve1D_Split_DGBR2_AD_btest_build_vera
[ 97%] Checking style of test/system/LocalSolve/LocalSolve1D_Split_DGBR2_AD_btest.cpp
[ 97%] Built target LocalSolve1D_Split_DGBR2_AD_btest_build_vera
Scanning dependencies of target LocalSolve1D_Split_DGBR2_AD_btest_OBJECT
[ 97%] Building CXX object test/system/LocalSolve/CMakeFiles/LocalSolve1D_Split_DGBR2_AD_btest_OBJECT.dir/LocalSolve1D_Split_DGBR2_AD_btest.cpp.o
[ 97%] Built target LocalSolve1D_Split_DGBR2_AD_btest_OBJECT
Scanning dependencies of target LocalSolve1D_Split_DGBR2_AD_btest_build
[ 97%] Linking CXX executable LocalSolve1D_Split_DGBR2_AD_btest
[ 97%] Built target LocalSolve1D_Split_DGBR2_AD_btest_build
Scanning dependencies of target EdgeLocalSolve2D_Dual_Galerkin_Stabilized_Euler_btest_build_vera
[ 97%] Checking style of test/system/LocalSolve/EdgeLocalSolve2D_Dual_Galerkin_Stabilized_Euler_btest.cpp
[ 97%] Built target EdgeLocalSolve2D_Dual_Galerkin_Stabilized_Euler_btest_build_vera
Scanning dependencies of target EdgeLocalSolve2D_Dual_Galerkin_Stabilized_Euler_btest_OBJECT
[ 97%] Building CXX object test/system/LocalSolve/CMakeFiles/EdgeLocalSolve2D_Dual_Galerkin_Stabilized_Euler_btest_OBJECT.dir/EdgeLocalSolve2D_Dual_Galerkin_Stabilized_Euler_btest.cpp.o
[ 97%] Built target EdgeLocalSolve2D_Dual_Galerkin_Stabilized_Euler_btest_OBJECT
Scanning dependencies of target EdgeLocalSolve2D_Dual_Galerkin_Stabilized_Euler_btest_build
[ 97%] Linking CXX executable EdgeLocalSolve2D_Dual_Galerkin_Stabilized_Euler_btest
[ 97%] Built target EdgeLocalSolve2D_Dual_Galerkin_Stabilized_Euler_btest_build
Scanning dependencies of target ElementDualLocalSolve2D_Galerkin_Stabilized_Triangle_AD_btest_build_vera
[ 97%] Checking style of test/system/LocalSolve/ElementDualLocalSolve2D_Galerkin_Stabilized_Triangle_AD_btest.cpp
[ 97%] Built target ElementDualLocalSolve2D_Galerkin_Stabilized_Triangle_AD_btest_build_vera
Scanning dependencies of target ElementDualLocalSolve2D_Galerkin_Stabilized_Triangle_AD_btest_OBJECT
[ 97%] Building CXX object test/system/LocalSolve/CMakeFiles/ElementDualLocalSolve2D_Galerkin_Stabilized_Triangle_AD_btest_OBJECT.dir/ElementDualLocalSolve2D_Galerkin_Stabilized_Triangle_AD_btest.cpp.o
[ 97%] Built target ElementDualLocalSolve2D_Galerkin_Stabilized_Triangle_AD_btest_OBJECT
Scanning dependencies of target ElementDualLocalSolve2D_Galerkin_Stabilized_Triangle_AD_btest_build
[ 97%] Linking CXX executable ElementDualLocalSolve2D_Galerkin_Stabilized_Triangle_AD_btest
[ 97%] Built target ElementDualLocalSolve2D_Galerkin_Stabilized_Triangle_AD_btest_build
Scanning dependencies of target EdgeLocalSolve2D_Dual_Galerkin_Stabilized_AR_btest_OBJECT
[ 97%] Building CXX object test/system/LocalSolve/CMakeFiles/EdgeLocalSolve2D_Dual_Galerkin_Stabilized_AR_btest_OBJECT.dir/EdgeLocalSolve2D_Dual_Galerkin_Stabilized_AR_btest.cpp.o
[ 97%] Built target EdgeLocalSolve2D_Dual_Galerkin_Stabilized_AR_btest_OBJECT
Scanning dependencies of target EdgeLocalSolve2D_Dual_Galerkin_Stabilized_AR_btest_build_vera
[ 97%] Checking style of test/system/LocalSolve/EdgeLocalSolve2D_Dual_Galerkin_Stabilized_AR_btest.cpp
[ 97%] Built target EdgeLocalSolve2D_Dual_Galerkin_Stabilized_AR_btest_build_vera
Scanning dependencies of target EdgeLocalSolve2D_Dual_Galerkin_Stabilized_AR_btest_build
[ 97%] Linking CXX executable EdgeLocalSolve2D_Dual_Galerkin_Stabilized_AR_btest
[ 97%] Built target EdgeLocalSolve2D_Dual_Galerkin_Stabilized_AR_btest_build
Scanning dependencies of target AlgebraicEquationSet_Local_VMSD_Triangle_AD_btest_OBJECT
[ 97%] Building CXX object test/system/LocalSolve/CMakeFiles/AlgebraicEquationSet_Local_VMSD_Triangle_AD_btest_OBJECT.dir/AlgebraicEquationSet_Local_VMSD_Triangle_AD_btest.cpp.o
[ 97%] Built target AlgebraicEquationSet_Local_VMSD_Triangle_AD_btest_OBJECT
Scanning dependencies of target AlgebraicEquationSet_Local_VMSD_Triangle_AD_btest_build_vera
[ 97%] Checking style of test/system/LocalSolve/AlgebraicEquationSet_Local_VMSD_Triangle_AD_btest.cpp
[ 97%] Built target AlgebraicEquationSet_Local_VMSD_Triangle_AD_btest_build_vera
Scanning dependencies of target AlgebraicEquationSet_Local_VMSD_Triangle_AD_btest_build
[ 97%] Linking CXX executable AlgebraicEquationSet_Local_VMSD_Triangle_AD_btest
[ 97%] Built target AlgebraicEquationSet_Local_VMSD_Triangle_AD_btest_build
Scanning dependencies of target LocalSolve3D_HDG_Tet_AD_btest_build_vera
[ 97%] Checking style of test/system/LocalSolve/LocalSolve3D_HDG_Tet_AD_btest.cpp
[ 97%] Built target LocalSolve3D_HDG_Tet_AD_btest_build_vera
Scanning dependencies of target LocalSolve3D_HDG_Tet_AD_btest_OBJECT
[ 97%] Building CXX object test/system/LocalSolve/CMakeFiles/LocalSolve3D_HDG_Tet_AD_btest_OBJECT.dir/LocalSolve3D_HDG_Tet_AD_btest.cpp.o
[ 97%] Built target LocalSolve3D_HDG_Tet_AD_btest_OBJECT
Scanning dependencies of target LocalSolve3D_HDG_Tet_AD_btest_build
[ 97%] Linking CXX executable LocalSolve3D_HDG_Tet_AD_btest
[ 97%] Built target LocalSolve3D_HDG_Tet_AD_btest_build
Scanning dependencies of target ElementLocalSolve3D_DGBR2_Tet_AD_btest_build_vera
[ 97%] Checking style of test/system/LocalSolve/ElementLocalSolve3D_DGBR2_Tet_AD_btest.cpp
[ 97%] Built target ElementLocalSolve3D_DGBR2_Tet_AD_btest_build_vera
Scanning dependencies of target ElementLocalSolve3D_DGBR2_Tet_AD_btest_OBJECT
[ 97%] Building CXX object test/system/LocalSolve/CMakeFiles/ElementLocalSolve3D_DGBR2_Tet_AD_btest_OBJECT.dir/ElementLocalSolve3D_DGBR2_Tet_AD_btest.cpp.o
[ 97%] Built target ElementLocalSolve3D_DGBR2_Tet_AD_btest_OBJECT
Scanning dependencies of target ElementLocalSolve3D_DGBR2_Tet_AD_btest_build
[ 97%] Linking CXX executable ElementLocalSolve3D_DGBR2_Tet_AD_btest
[ 97%] Built target ElementLocalSolve3D_DGBR2_Tet_AD_btest_build
Scanning dependencies of target LocalSolve2D_HDG_Triangle_AD_btest_build_vera
[ 97%] Checking style of test/system/LocalSolve/LocalSolve2D_HDG_Triangle_AD_btest.cpp
[ 97%] Built target LocalSolve2D_HDG_Triangle_AD_btest_build_vera
Scanning dependencies of target LocalSolve2D_HDG_Triangle_AD_btest_OBJECT
[ 97%] Building CXX object test/system/LocalSolve/CMakeFiles/LocalSolve2D_HDG_Triangle_AD_btest_OBJECT.dir/LocalSolve2D_HDG_Triangle_AD_btest.cpp.o
[ 97%] Built target LocalSolve2D_HDG_Triangle_AD_btest_OBJECT
Scanning dependencies of target LocalSolve2D_HDG_Triangle_AD_btest_build
[ 97%] Linking CXX executable LocalSolve2D_HDG_Triangle_AD_btest
[ 97%] Built target LocalSolve2D_HDG_Triangle_AD_btest_build
Scanning dependencies of target EdgeLocalSolve3D_Dual_Galerkin_Stabilized_AD_btest_OBJECT
[ 97%] Building CXX object test/system/LocalSolve/CMakeFiles/EdgeLocalSolve3D_Dual_Galerkin_Stabilized_AD_btest_OBJECT.dir/EdgeLocalSolve3D_Dual_Galerkin_Stabilized_AD_btest.cpp.o
[ 97%] Built target EdgeLocalSolve3D_Dual_Galerkin_Stabilized_AD_btest_OBJECT
Scanning dependencies of target EdgeLocalSolve3D_Dual_Galerkin_Stabilized_AD_btest_build_vera
[ 97%] Checking style of test/system/LocalSolve/EdgeLocalSolve3D_Dual_Galerkin_Stabilized_AD_btest.cpp
[ 97%] Built target EdgeLocalSolve3D_Dual_Galerkin_Stabilized_AD_btest_build_vera
Scanning dependencies of target EdgeLocalSolve3D_Dual_Galerkin_Stabilized_AD_btest_build
[ 97%] Linking CXX executable EdgeLocalSolve3D_Dual_Galerkin_Stabilized_AD_btest
[ 97%] Built target EdgeLocalSolve3D_Dual_Galerkin_Stabilized_AD_btest_build
Scanning dependencies of target LocalSolve3D_Split_HDG_Tet_AD_btest_build_vera
[ 97%] Checking style of test/system/LocalSolve/LocalSolve3D_Split_HDG_Tet_AD_btest.cpp
[ 97%] Built target LocalSolve3D_Split_HDG_Tet_AD_btest_build_vera
Scanning dependencies of target LocalSolve3D_Split_HDG_Tet_AD_btest_OBJECT
[ 97%] Building CXX object test/system/LocalSolve/CMakeFiles/LocalSolve3D_Split_HDG_Tet_AD_btest_OBJECT.dir/LocalSolve3D_Split_HDG_Tet_AD_btest.cpp.o
[ 97%] Built target LocalSolve3D_Split_HDG_Tet_AD_btest_OBJECT
Scanning dependencies of target LocalSolve3D_Split_HDG_Tet_AD_btest_build
[ 97%] Linking CXX executable LocalSolve3D_Split_HDG_Tet_AD_btest
[ 97%] Built target LocalSolve3D_Split_HDG_Tet_AD_btest_build
Scanning dependencies of target LocalSolve2D_Split_HDG_Triangle_AD_btest_OBJECT
[ 97%] Building CXX object test/system/LocalSolve/CMakeFiles/LocalSolve2D_Split_HDG_Triangle_AD_btest_OBJECT.dir/LocalSolve2D_Split_HDG_Triangle_AD_btest.cpp.o
[ 97%] Built target LocalSolve2D_Split_HDG_Triangle_AD_btest_OBJECT
Scanning dependencies of target LocalSolve2D_Split_HDG_Triangle_AD_btest_build_vera
[ 97%] Checking style of test/system/LocalSolve/LocalSolve2D_Split_HDG_Triangle_AD_btest.cpp
[ 97%] Built target LocalSolve2D_Split_HDG_Triangle_AD_btest_build_vera
Scanning dependencies of target LocalSolve2D_Split_HDG_Triangle_AD_btest_build
[ 97%] Linking CXX executable LocalSolve2D_Split_HDG_Triangle_AD_btest
[ 97%] Built target LocalSolve2D_Split_HDG_Triangle_AD_btest_build
Scanning dependencies of target ElementDualLocalSolve3D_Galerkin_Stabilized_Triangle_AD_btest_OBJECT
[ 97%] Building CXX object test/system/LocalSolve/CMakeFiles/ElementDualLocalSolve3D_Galerkin_Stabilized_Triangle_AD_btest_OBJECT.dir/ElementDualLocalSolve3D_Galerkin_Stabilized_Triangle_AD_btest.cpp.o
[ 97%] Built target ElementDualLocalSolve3D_Galerkin_Stabilized_Triangle_AD_btest_OBJECT
Scanning dependencies of target ElementDualLocalSolve3D_Galerkin_Stabilized_Triangle_AD_btest_build_vera
[ 97%] Checking style of test/system/LocalSolve/ElementDualLocalSolve3D_Galerkin_Stabilized_Triangle_AD_btest.cpp
[ 97%] Built target ElementDualLocalSolve3D_Galerkin_Stabilized_Triangle_AD_btest_build_vera
Scanning dependencies of target ElementDualLocalSolve3D_Galerkin_Stabilized_Triangle_AD_btest_build
[ 97%] Linking CXX executable ElementDualLocalSolve3D_Galerkin_Stabilized_Triangle_AD_btest
[ 97%] Built target ElementDualLocalSolve3D_Galerkin_Stabilized_Triangle_AD_btest_build
Scanning dependencies of target ElementLocalSolve2D_DGBR2_Triangle_AD_btest_OBJECT
[ 97%] Building CXX object test/system/LocalSolve/CMakeFiles/ElementLocalSolve2D_DGBR2_Triangle_AD_btest_OBJECT.dir/ElementLocalSolve2D_DGBR2_Triangle_AD_btest.cpp.o
[ 97%] Built target ElementLocalSolve2D_DGBR2_Triangle_AD_btest_OBJECT
Scanning dependencies of target ElementLocalSolve2D_DGBR2_Triangle_AD_btest_build_vera
[ 97%] Checking style of test/system/LocalSolve/ElementLocalSolve2D_DGBR2_Triangle_AD_btest.cpp
[ 97%] Built target ElementLocalSolve2D_DGBR2_Triangle_AD_btest_build_vera
Scanning dependencies of target ElementLocalSolve2D_DGBR2_Triangle_AD_btest_build
[ 97%] Linking CXX executable ElementLocalSolve2D_DGBR2_Triangle_AD_btest
[ 97%] Built target ElementLocalSolve2D_DGBR2_Triangle_AD_btest_build
Scanning dependencies of target EdgeLocalSolve2D_Dual_Galerkin_Stabilized_AD_btest_build_vera
[ 97%] Checking style of test/system/LocalSolve/EdgeLocalSolve2D_Dual_Galerkin_Stabilized_AD_btest.cpp
[ 97%] Built target EdgeLocalSolve2D_Dual_Galerkin_Stabilized_AD_btest_build_vera
Scanning dependencies of target EdgeLocalSolve2D_Dual_Galerkin_Stabilized_AD_btest_OBJECT
[ 97%] Building CXX object test/system/LocalSolve/CMakeFiles/EdgeLocalSolve2D_Dual_Galerkin_Stabilized_AD_btest_OBJECT.dir/EdgeLocalSolve2D_Dual_Galerkin_Stabilized_AD_btest.cpp.o
[ 97%] Built target EdgeLocalSolve2D_Dual_Galerkin_Stabilized_AD_btest_OBJECT
Scanning dependencies of target EdgeLocalSolve2D_Dual_Galerkin_Stabilized_AD_btest_build
[ 97%] Linking CXX executable EdgeLocalSolve2D_Dual_Galerkin_Stabilized_AD_btest
[ 97%] Built target EdgeLocalSolve2D_Dual_Galerkin_Stabilized_AD_btest_build
Scanning dependencies of target ElementLocalSolve1D_DGBR2_Triangle_AD_btest_build_vera
[ 97%] Checking style of test/system/LocalSolve/ElementLocalSolve1D_DGBR2_Triangle_AD_btest.cpp
[ 97%] Built target ElementLocalSolve1D_DGBR2_Triangle_AD_btest_build_vera
Scanning dependencies of target ElementLocalSolve1D_DGBR2_Triangle_AD_btest_OBJECT
[ 97%] Building CXX object test/system/LocalSolve/CMakeFiles/ElementLocalSolve1D_DGBR2_Triangle_AD_btest_OBJECT.dir/ElementLocalSolve1D_DGBR2_Triangle_AD_btest.cpp.o
[ 97%] Built target ElementLocalSolve1D_DGBR2_Triangle_AD_btest_OBJECT
Scanning dependencies of target ElementLocalSolve1D_DGBR2_Triangle_AD_btest_build
[ 97%] Linking CXX executable ElementLocalSolve1D_DGBR2_Triangle_AD_btest
[ 97%] Built target ElementLocalSolve1D_DGBR2_Triangle_AD_btest_build
Scanning dependencies of target AlgebraicEquationSet_Local_VMSDBR2_Triangle_AD_btest_build_vera
[ 97%] Checking style of test/system/LocalSolve/AlgebraicEquationSet_Local_VMSDBR2_Triangle_AD_btest.cpp
[ 97%] Built target AlgebraicEquationSet_Local_VMSDBR2_Triangle_AD_btest_build_vera
Scanning dependencies of target AlgebraicEquationSet_Local_VMSDBR2_Triangle_AD_btest_OBJECT
[ 97%] Building CXX object test/system/LocalSolve/CMakeFiles/AlgebraicEquationSet_Local_VMSDBR2_Triangle_AD_btest_OBJECT.dir/AlgebraicEquationSet_Local_VMSDBR2_Triangle_AD_btest.cpp.o
[ 97%] Built target AlgebraicEquationSet_Local_VMSDBR2_Triangle_AD_btest_OBJECT
Scanning dependencies of target AlgebraicEquationSet_Local_VMSDBR2_Triangle_AD_btest_build
[ 97%] Linking CXX executable AlgebraicEquationSet_Local_VMSDBR2_Triangle_AD_btest
[ 97%] Built target AlgebraicEquationSet_Local_VMSDBR2_Triangle_AD_btest_build
Scanning dependencies of target ElementLocalSolve3D_DGAdvective_Tet_AD_btest_OBJECT
[ 97%] Building CXX object test/system/LocalSolve/CMakeFiles/ElementLocalSolve3D_DGAdvective_Tet_AD_btest_OBJECT.dir/ElementLocalSolve3D_DGAdvective_Tet_AD_btest.cpp.o
[ 97%] Built target ElementLocalSolve3D_DGAdvective_Tet_AD_btest_OBJECT
Scanning dependencies of target ElementLocalSolve3D_DGAdvective_Tet_AD_btest_build_vera
[ 97%] Checking style of test/system/LocalSolve/ElementLocalSolve3D_DGAdvective_Tet_AD_btest.cpp
[ 97%] Built target ElementLocalSolve3D_DGAdvective_Tet_AD_btest_build_vera
Scanning dependencies of target ElementLocalSolve3D_DGAdvective_Tet_AD_btest_build
[ 97%] Linking CXX executable ElementLocalSolve3D_DGAdvective_Tet_AD_btest
[ 97%] Built target ElementLocalSolve3D_DGAdvective_Tet_AD_btest_build
Scanning dependencies of target EdgeLocalSolve1D_Dual_Galerkin_Stabilized_Line_AD_btest_build_vera
[ 97%] Checking style of test/system/LocalSolve/EdgeLocalSolve1D_Dual_Galerkin_Stabilized_Line_AD_btest.cpp
[ 97%] Built target EdgeLocalSolve1D_Dual_Galerkin_Stabilized_Line_AD_btest_build_vera
Scanning dependencies of target EdgeLocalSolve1D_Dual_Galerkin_Stabilized_Line_AD_btest_OBJECT
[ 97%] Building CXX object test/system/LocalSolve/CMakeFiles/EdgeLocalSolve1D_Dual_Galerkin_Stabilized_Line_AD_btest_OBJECT.dir/EdgeLocalSolve1D_Dual_Galerkin_Stabilized_Line_AD_btest.cpp.o
[ 97%] Built target EdgeLocalSolve1D_Dual_Galerkin_Stabilized_Line_AD_btest_OBJECT
Scanning dependencies of target EdgeLocalSolve1D_Dual_Galerkin_Stabilized_Line_AD_btest_build
[ 97%] Linking CXX executable EdgeLocalSolve1D_Dual_Galerkin_Stabilized_Line_AD_btest
[ 97%] Built target EdgeLocalSolve1D_Dual_Galerkin_Stabilized_Line_AD_btest_build
Scanning dependencies of target Block_1D_Decoupled_AD_btest_build_vera
[ 97%] Checking style of test/system/BlockSolve/Block_1D_Decoupled_AD_btest.cpp
[ 97%] Built target Block_1D_Decoupled_AD_btest_build_vera
Scanning dependencies of target Block_1D_Decoupled_AD_btest_OBJECT
[ 97%] Building CXX object test/system/BlockSolve/CMakeFiles/Block_1D_Decoupled_AD_btest_OBJECT.dir/Block_1D_Decoupled_AD_btest.cpp.o
[ 97%] Built target Block_1D_Decoupled_AD_btest_OBJECT
Scanning dependencies of target Block_1D_Decoupled_AD_btest_build
[ 97%] Linking CXX executable Block_1D_Decoupled_AD_btest
[ 97%] Built target Block_1D_Decoupled_AD_btest_build
Scanning dependencies of target Block_1D_Decoupled_Burgers_btest_OBJECT
[ 97%] Building CXX object test/system/BlockSolve/CMakeFiles/Block_1D_Decoupled_Burgers_btest_OBJECT.dir/Block_1D_Decoupled_Burgers_btest.cpp.o
[ 97%] Built target Block_1D_Decoupled_Burgers_btest_OBJECT
Scanning dependencies of target Block_1D_Decoupled_Burgers_btest_build_vera
[ 97%] Checking style of test/system/BlockSolve/Block_1D_Decoupled_Burgers_btest.cpp
[ 97%] Built target Block_1D_Decoupled_Burgers_btest_build_vera
Scanning dependencies of target Block_1D_Decoupled_Burgers_btest_build
[ 97%] Linking CXX executable Block_1D_Decoupled_Burgers_btest
[ 97%] Built target Block_1D_Decoupled_Burgers_btest_build
Scanning dependencies of target AnalyticSolve3D_IBLFourEqn_StagnationFlow_LamiBL_Triangle_btest_build_vera
[ 97%] Checking style of test/system/AnalyticSolve/AnalyticSolve3D_IBLFourEqn_StagnationFlow_LamiBL_Triangle_btest.cpp
[ 97%] Built target AnalyticSolve3D_IBLFourEqn_StagnationFlow_LamiBL_Triangle_btest_build_vera
Scanning dependencies of target DGBR2NSLib
[100%] Building CXX object src/Discretization/CMakeFiles/DGBR2NSLib.dir/DG/DGBR2_Instantiate/AlgebraicEquationSet_DGBR2_NavierStokes2D_ConservativeConstVisc.cpp.o
[100%] Building CXX object src/Discretization/CMakeFiles/DGBR2NSLib.dir/DG/DGBR2_Instantiate/AlgebraicEquationSet_DGBR2_NavierStokes2D_PrimitiveConstVisc.cpp.o
[100%] Building CXX object src/Discretization/CMakeFiles/DGBR2NSLib.dir/DG/DGBR2_Instantiate/AlgebraicEquationSet_DGBR2_NavierStokes3D_PrimitiveConstVisc.cpp.o
[100%] Building CXX object src/Discretization/CMakeFiles/DGBR2NSLib.dir/DG/DGBR2_Instantiate/AlgebraicEquationSet_DGBR2_NavierStokes3D_PrimitiveSutherland.cpp.o
[100%] Building CXX object src/Discretization/CMakeFiles/DGBR2NSLib.dir/DG/DGBR2_Instantiate/AlgebraicEquationSet_DGBR2_NavierStokes3D_SurrogateSutherland.cpp.o
[100%] Linking CXX static library libDGBR2NSLib.a
[100%] Built target DGBR2NSLib
Scanning dependencies of target AnalyticSolve3D_IBLFourEqn_StagnationFlow_LamiBL_Triangle_btest_OBJECT
[100%] Building CXX object test/system/AnalyticSolve/CMakeFiles/AnalyticSolve3D_IBLFourEqn_StagnationFlow_LamiBL_Triangle_btest_OBJECT.dir/AnalyticSolve3D_IBLFourEqn_StagnationFlow_LamiBL_Triangle_btest.cpp.o
[100%] Built target AnalyticSolve3D_IBLFourEqn_StagnationFlow_LamiBL_Triangle_btest_OBJECT
Scanning dependencies of target AnalyticSolve3D_IBLFourEqn_StagnationFlow_LamiBL_Triangle_btest_build
[100%] Linking CXX executable AnalyticSolve3D_IBLFourEqn_StagnationFlow_LamiBL_Triangle_btest
[100%] Built target AnalyticSolve3D_IBLFourEqn_StagnationFlow_LamiBL_Triangle_btest_build
Scanning dependencies of target AnalyticSolve2D_DGBR2_Triangle_NavierStokes_UniformStream_btest_build_vera
[100%] Checking style of test/system/AnalyticSolve/AnalyticSolve2D_DGBR2_Triangle_NavierStokes_UniformStream_btest.cpp
[100%] Built target AnalyticSolve2D_DGBR2_Triangle_NavierStokes_UniformStream_btest_build_vera
Scanning dependencies of target AnalyticSolve2D_DGBR2_Triangle_NavierStokes_UniformStream_btest_OBJECT
[100%] Building CXX object test/system/AnalyticSolve/CMakeFiles/AnalyticSolve2D_DGBR2_Triangle_NavierStokes_UniformStream_btest_OBJECT.dir/AnalyticSolve2D_DGBR2_Triangle_NavierStokes_UniformStream_btest.cpp.o
[100%] Built target AnalyticSolve2D_DGBR2_Triangle_NavierStokes_UniformStream_btest_OBJECT
Scanning dependencies of target AnalyticSolve2D_DGBR2_Triangle_NavierStokes_UniformStream_btest_build
[100%] Linking CXX executable AnalyticSolve2D_DGBR2_Triangle_NavierStokes_UniformStream_btest
[100%] Built target AnalyticSolve2D_DGBR2_Triangle_NavierStokes_UniformStream_btest_build
Scanning dependencies of target AnalyticSolve2D_HDG_Triangle_NavierStokes_btest_build_vera
[100%] Checking style of test/system/AnalyticSolve/AnalyticSolve2D_HDG_Triangle_NavierStokes_btest.cpp
[100%] Built target AnalyticSolve2D_HDG_Triangle_NavierStokes_btest_build_vera
Scanning dependencies of target AnalyticSolve2D_HDG_Triangle_NavierStokes_btest_OBJECT
[100%] Building CXX object test/system/AnalyticSolve/CMakeFiles/AnalyticSolve2D_HDG_Triangle_NavierStokes_btest_OBJECT.dir/AnalyticSolve2D_HDG_Triangle_NavierStokes_btest.cpp.o
[100%] Built target AnalyticSolve2D_HDG_Triangle_NavierStokes_btest_OBJECT
Scanning dependencies of target AnalyticSolve2D_HDG_Triangle_NavierStokes_btest_build
[100%] Linking CXX executable AnalyticSolve2D_HDG_Triangle_NavierStokes_btest
[100%] Built target AnalyticSolve2D_HDG_Triangle_NavierStokes_btest_build
Scanning dependencies of target AnalyticSolve2D_DGAdvective_IBLSplitAmpLag_StagnationFlow_LamiBL_btest_OBJECT
[100%] Building CXX object test/system/AnalyticSolve/CMakeFiles/AnalyticSolve2D_DGAdvective_IBLSplitAmpLag_StagnationFlow_LamiBL_btest_OBJECT.dir/AnalyticSolve2D_DGAdvective_IBLSplitAmpLag_StagnationFlow_LamiBL_btest.cpp.o
[100%] Built target AnalyticSolve2D_DGAdvective_IBLSplitAmpLag_StagnationFlow_LamiBL_btest_OBJECT
Scanning dependencies of target AnalyticSolve2D_DGAdvective_IBLSplitAmpLag_StagnationFlow_LamiBL_btest_build_vera
[100%] Checking style of test/system/AnalyticSolve/AnalyticSolve2D_DGAdvective_IBLSplitAmpLag_StagnationFlow_LamiBL_btest.cpp
[100%] Built target AnalyticSolve2D_DGAdvective_IBLSplitAmpLag_StagnationFlow_LamiBL_btest_build_vera
Scanning dependencies of target AnalyticSolve2D_DGAdvective_IBLSplitAmpLag_StagnationFlow_LamiBL_btest_build
[100%] Linking CXX executable AnalyticSolve2D_DGAdvective_IBLSplitAmpLag_StagnationFlow_LamiBL_btest
[100%] Built target AnalyticSolve2D_DGAdvective_IBLSplitAmpLag_StagnationFlow_LamiBL_btest_build
Scanning dependencies of target AnalyticSolve2D_DGAdvective_IBL_StagnationFlow_LamiBL_btest_OBJECT
[100%] Building CXX object test/system/AnalyticSolve/CMakeFiles/AnalyticSolve2D_DGAdvective_IBL_StagnationFlow_LamiBL_btest_OBJECT.dir/AnalyticSolve2D_DGAdvective_IBL_StagnationFlow_LamiBL_btest.cpp.o
[100%] Built target AnalyticSolve2D_DGAdvective_IBL_StagnationFlow_LamiBL_btest_OBJECT
Scanning dependencies of target AnalyticSolve2D_DGAdvective_IBL_StagnationFlow_LamiBL_btest_build_vera
[100%] Checking style of test/system/AnalyticSolve/AnalyticSolve2D_DGAdvective_IBL_StagnationFlow_LamiBL_btest.cpp
[100%] Built target AnalyticSolve2D_DGAdvective_IBL_StagnationFlow_LamiBL_btest_build_vera
Scanning dependencies of target AnalyticSolve2D_DGAdvective_IBL_StagnationFlow_LamiBL_btest_build
[100%] Linking CXX executable AnalyticSolve2D_DGAdvective_IBL_StagnationFlow_LamiBL_btest
[100%] Built target AnalyticSolve2D_DGAdvective_IBL_StagnationFlow_LamiBL_btest_build
Scanning dependencies of target AnalyticSolve2D_HDG_Triangle_NavierStokes_UniformStream_btest_OBJECT
[100%] Building CXX object test/system/AnalyticSolve/CMakeFiles/AnalyticSolve2D_HDG_Triangle_NavierStokes_UniformStream_btest_OBJECT.dir/AnalyticSolve2D_HDG_Triangle_NavierStokes_UniformStream_btest.cpp.o
[100%] Built target AnalyticSolve2D_HDG_Triangle_NavierStokes_UniformStream_btest_OBJECT
Scanning dependencies of target AnalyticSolve2D_HDG_Triangle_NavierStokes_UniformStream_btest_build_vera
[100%] Checking style of test/system/AnalyticSolve/AnalyticSolve2D_HDG_Triangle_NavierStokes_UniformStream_btest.cpp
[100%] Built target AnalyticSolve2D_HDG_Triangle_NavierStokes_UniformStream_btest_build_vera
Scanning dependencies of target AnalyticSolve2D_HDG_Triangle_NavierStokes_UniformStream_btest_build
[100%] Linking CXX executable AnalyticSolve2D_HDG_Triangle_NavierStokes_UniformStream_btest
[100%] Built target AnalyticSolve2D_HDG_Triangle_NavierStokes_UniformStream_btest_build
Scanning dependencies of target AnalyticSolve2D_DGAdvective_IBL_StagnationFlow_SingleElem_LamiBL_btest_build_vera
[100%] Checking style of test/system/AnalyticSolve/AnalyticSolve2D_DGAdvective_IBL_StagnationFlow_SingleElem_LamiBL_btest.cpp
[100%] Built target AnalyticSolve2D_DGAdvective_IBL_StagnationFlow_SingleElem_LamiBL_btest_build_vera
Scanning dependencies of target AnalyticSolve2D_DGAdvective_IBL_StagnationFlow_SingleElem_LamiBL_btest_OBJECT
[100%] Building CXX object test/system/AnalyticSolve/CMakeFiles/AnalyticSolve2D_DGAdvective_IBL_StagnationFlow_SingleElem_LamiBL_btest_OBJECT.dir/AnalyticSolve2D_DGAdvective_IBL_StagnationFlow_SingleElem_LamiBL_btest.cpp.o
[100%] Built target AnalyticSolve2D_DGAdvective_IBL_StagnationFlow_SingleElem_LamiBL_btest_OBJECT
Scanning dependencies of target AnalyticSolve2D_DGAdvective_IBL_StagnationFlow_SingleElem_LamiBL_btest_build
[100%] Linking CXX executable AnalyticSolve2D_DGAdvective_IBL_StagnationFlow_SingleElem_LamiBL_btest
[100%] Built target AnalyticSolve2D_DGAdvective_IBL_StagnationFlow_SingleElem_LamiBL_btest_build
Scanning dependencies of target AnalyticSolve_HDG_AD_btest_build_vera
[100%] Checking style of test/system/AnalyticSolve/AnalyticSolve_HDG_AD_btest.cpp
[100%] Built target AnalyticSolve_HDG_AD_btest_build_vera
Scanning dependencies of target AnalyticSolve_HDG_AD_btest_OBJECT
[100%] Building CXX object test/system/AnalyticSolve/CMakeFiles/AnalyticSolve_HDG_AD_btest_OBJECT.dir/AnalyticSolve_HDG_AD_btest.cpp.o
[100%] Built target AnalyticSolve_HDG_AD_btest_OBJECT
Scanning dependencies of target AnalyticSolve_HDG_AD_btest_build
[100%] Linking CXX executable AnalyticSolve_HDG_AD_btest
[100%] Built target AnalyticSolve_HDG_AD_btest_build
Scanning dependencies of target AnalyticSolve_IBL3D_StagnationFlow_LamiBL_Triangle_btest_build_vera
[100%] Checking style of test/system/AnalyticSolve/AnalyticSolve_IBL3D_StagnationFlow_LamiBL_Triangle_btest.cpp
[100%] Built target AnalyticSolve_IBL3D_StagnationFlow_LamiBL_Triangle_btest_build_vera
Scanning dependencies of target AnalyticSolve_IBL3D_StagnationFlow_LamiBL_Triangle_btest_OBJECT
[100%] Building CXX object test/system/AnalyticSolve/CMakeFiles/AnalyticSolve_IBL3D_StagnationFlow_LamiBL_Triangle_btest_OBJECT.dir/AnalyticSolve_IBL3D_StagnationFlow_LamiBL_Triangle_btest.cpp.o
[100%] Built target AnalyticSolve_IBL3D_StagnationFlow_LamiBL_Triangle_btest_OBJECT
Scanning dependencies of target AnalyticSolve_IBL3D_StagnationFlow_LamiBL_Triangle_btest_build
[100%] Linking CXX executable AnalyticSolve_IBL3D_StagnationFlow_LamiBL_Triangle_btest
[100%] Built target AnalyticSolve_IBL3D_StagnationFlow_LamiBL_Triangle_btest_build
Scanning dependencies of target AnalyticSolve2D_DGAdvective_Triangle_Euler_UniformStream_btest_build_vera
[100%] Checking style of test/system/AnalyticSolve/AnalyticSolve2D_DGAdvective_Triangle_Euler_UniformStream_btest.cpp
[100%] Built target AnalyticSolve2D_DGAdvective_Triangle_Euler_UniformStream_btest_build_vera
Scanning dependencies of target AnalyticSolve2D_DGAdvective_Triangle_Euler_UniformStream_btest_OBJECT
[100%] Building CXX object test/system/AnalyticSolve/CMakeFiles/AnalyticSolve2D_DGAdvective_Triangle_Euler_UniformStream_btest_OBJECT.dir/AnalyticSolve2D_DGAdvective_Triangle_Euler_UniformStream_btest.cpp.o
[100%] Built target AnalyticSolve2D_DGAdvective_Triangle_Euler_UniformStream_btest_OBJECT
Scanning dependencies of target AnalyticSolve2D_DGAdvective_Triangle_Euler_UniformStream_btest_build
[100%] Linking CXX executable AnalyticSolve2D_DGAdvective_Triangle_Euler_UniformStream_btest
[100%] Built target AnalyticSolve2D_DGAdvective_Triangle_Euler_UniformStream_btest_build
Scanning dependencies of target AnalyticSolve2D_DGBR2_Triangle_NavierStokes_btest_OBJECT
[100%] Building CXX object test/system/AnalyticSolve/CMakeFiles/AnalyticSolve2D_DGBR2_Triangle_NavierStokes_btest_OBJECT.dir/AnalyticSolve2D_DGBR2_Triangle_NavierStokes_btest.cpp.o
[100%] Built target AnalyticSolve2D_DGBR2_Triangle_NavierStokes_btest_OBJECT
Scanning dependencies of target AnalyticSolve2D_DGBR2_Triangle_NavierStokes_btest_build_vera
[100%] Checking style of test/system/AnalyticSolve/AnalyticSolve2D_DGBR2_Triangle_NavierStokes_btest.cpp
[100%] Built target AnalyticSolve2D_DGBR2_Triangle_NavierStokes_btest_build_vera
Scanning dependencies of target AnalyticSolve2D_DGBR2_Triangle_NavierStokes_btest_build
[100%] Linking CXX executable AnalyticSolve2D_DGBR2_Triangle_NavierStokes_btest
[100%] Built target AnalyticSolve2D_DGBR2_Triangle_NavierStokes_btest_build
Scanning dependencies of target PDEEulermitAVDiffusion2D_Consistency_btest_build_vera
[100%] Checking style of test/system/CodeConsistency/PDEEulermitAVDiffusion2D_Consistency_btest.cpp
[100%] Built target PDEEulermitAVDiffusion2D_Consistency_btest_build_vera
Scanning dependencies of target PDEEulermitAVDiffusion2D_Consistency_btest_OBJECT
[100%] Building CXX object test/system/CodeConsistency/CMakeFiles/PDEEulermitAVDiffusion2D_Consistency_btest_OBJECT.dir/PDEEulermitAVDiffusion2D_Consistency_btest.cpp.o
[100%] Built target PDEEulermitAVDiffusion2D_Consistency_btest_OBJECT
Scanning dependencies of target PDEEulermitAVDiffusion2D_Consistency_btest_build
[100%] Linking CXX executable PDEEulermitAVDiffusion2D_Consistency_btest
[100%] Built target PDEEulermitAVDiffusion2D_Consistency_btest_build
Scanning dependencies of target BCEulermitAVSensor2D_Consistency_btest_OBJECT
[100%] Building CXX object test/system/CodeConsistency/CMakeFiles/BCEulermitAVSensor2D_Consistency_btest_OBJECT.dir/BCEulermitAVSensor2D_Consistency_btest.cpp.o
[100%] Built target BCEulermitAVSensor2D_Consistency_btest_OBJECT
Scanning dependencies of target BCEulermitAVSensor2D_Consistency_btest_build_vera
[100%] Checking style of test/system/CodeConsistency/BCEulermitAVSensor2D_Consistency_btest.cpp
[100%] Built target BCEulermitAVSensor2D_Consistency_btest_build_vera
Scanning dependencies of target BCEulermitAVSensor2D_Consistency_btest_build
[100%] Linking CXX executable BCEulermitAVSensor2D_Consistency_btest
[100%] Built target BCEulermitAVSensor2D_Consistency_btest_build
Scanning dependencies of target PDEmitAVSensor3D_Consistency_btest_build_vera
[100%] Checking style of test/system/CodeConsistency/PDEmitAVSensor3D_Consistency_btest.cpp
[100%] Built target PDEmitAVSensor3D_Consistency_btest_build_vera
Scanning dependencies of target PDEmitAVSensor3D_Consistency_btest_OBJECT
[100%] Building CXX object test/system/CodeConsistency/CMakeFiles/PDEmitAVSensor3D_Consistency_btest_OBJECT.dir/PDEmitAVSensor3D_Consistency_btest.cpp.o
[100%] Built target PDEmitAVSensor3D_Consistency_btest_OBJECT
Scanning dependencies of target PDEmitAVSensor3D_Consistency_btest_build
[100%] Linking CXX executable PDEmitAVSensor3D_Consistency_btest
[100%] Built target PDEmitAVSensor3D_Consistency_btest_build
Scanning dependencies of target Solve2D_Uncoupled_HDGAdvectiveIBL_LamiBL_btest_OBJECT
[100%] Building CXX object test/system/CodeConsistency/CMakeFiles/Solve2D_Uncoupled_HDGAdvectiveIBL_LamiBL_btest_OBJECT.dir/Solve2D_Uncoupled_HDGAdvectiveIBL_LamiBL_btest.cpp.o
[100%] Built target Solve2D_Uncoupled_HDGAdvectiveIBL_LamiBL_btest_OBJECT
Scanning dependencies of target Solve2D_Uncoupled_HDGAdvectiveIBL_LamiBL_btest_build_vera
[100%] Checking style of test/system/CodeConsistency/Solve2D_Uncoupled_HDGAdvectiveIBL_LamiBL_btest.cpp
[100%] Built target Solve2D_Uncoupled_HDGAdvectiveIBL_LamiBL_btest_build_vera
Scanning dependencies of target Solve2D_Uncoupled_HDGAdvectiveIBL_LamiBL_btest_build
[100%] Linking CXX executable Solve2D_Uncoupled_HDGAdvectiveIBL_LamiBL_btest
[100%] Built target Solve2D_Uncoupled_HDGAdvectiveIBL_LamiBL_btest_build
Scanning dependencies of target PDEEulermitAVDiffusion3D_Consistency_btest_OBJECT
[100%] Building CXX object test/system/CodeConsistency/CMakeFiles/PDEEulermitAVDiffusion3D_Consistency_btest_OBJECT.dir/PDEEulermitAVDiffusion3D_Consistency_btest.cpp.o
[100%] Built target PDEEulermitAVDiffusion3D_Consistency_btest_OBJECT
Scanning dependencies of target PDEEulermitAVDiffusion3D_Consistency_btest_build_vera
[100%] Checking style of test/system/CodeConsistency/PDEEulermitAVDiffusion3D_Consistency_btest.cpp
[100%] Built target PDEEulermitAVDiffusion3D_Consistency_btest_build_vera
Scanning dependencies of target PDEEulermitAVDiffusion3D_Consistency_btest_build
[100%] Linking CXX executable PDEEulermitAVDiffusion3D_Consistency_btest
[100%] Built target PDEEulermitAVDiffusion3D_Consistency_btest_build
Scanning dependencies of target Solve2D_Coupled4x4_IBLSplitAmpLag_CorrelationClosure_CapturedTransition_PTC_btest_OBJECT
[100%] Building CXX object test/system/CodeConsistency/CMakeFiles/Solve2D_Coupled4x4_IBLSplitAmpLag_CorrelationClosure_CapturedTransition_PTC_btest_OBJECT.dir/Solve2D_Coupled4x4_IBLSplitAmpLag_CorrelationClosure_CapturedTransition_PTC_btest.cpp.o
[100%] Built target Solve2D_Coupled4x4_IBLSplitAmpLag_CorrelationClosure_CapturedTransition_PTC_btest_OBJECT
Scanning dependencies of target Solve2D_Coupled4x4_IBLSplitAmpLag_CorrelationClosure_CapturedTransition_PTC_btest_build_vera
[100%] Checking style of test/system/CodeConsistency/Solve2D_Coupled4x4_IBLSplitAmpLag_CorrelationClosure_CapturedTransition_PTC_btest.cpp
[100%] Built target Solve2D_Coupled4x4_IBLSplitAmpLag_CorrelationClosure_CapturedTransition_PTC_btest_build_vera
Scanning dependencies of target Solve2D_Coupled4x4_IBLSplitAmpLag_CorrelationClosure_CapturedTransition_PTC_btest_build
[100%] Linking CXX executable Solve2D_Coupled4x4_IBLSplitAmpLag_CorrelationClosure_CapturedTransition_PTC_btest
[100%] Built target Solve2D_Coupled4x4_IBLSplitAmpLag_CorrelationClosure_CapturedTransition_PTC_btest_build
Scanning dependencies of target PDEEulermitAVDiffusion3D_RANSSA_Consistency_btest_OBJECT
[100%] Building CXX object test/system/CodeConsistency/CMakeFiles/PDEEulermitAVDiffusion3D_RANSSA_Consistency_btest_OBJECT.dir/PDEEulermitAVDiffusion3D_RANSSA_Consistency_btest.cpp.o
[100%] Built target PDEEulermitAVDiffusion3D_RANSSA_Consistency_btest_OBJECT
Scanning dependencies of target PDEEulermitAVDiffusion3D_RANSSA_Consistency_btest_build_vera
[100%] Checking style of test/system/CodeConsistency/PDEEulermitAVDiffusion3D_RANSSA_Consistency_btest.cpp
[100%] Built target PDEEulermitAVDiffusion3D_RANSSA_Consistency_btest_build_vera
Scanning dependencies of target PDEEulermitAVDiffusion3D_RANSSA_Consistency_btest_build
[100%] Linking CXX executable PDEEulermitAVDiffusion3D_RANSSA_Consistency_btest
[100%] Built target PDEEulermitAVDiffusion3D_RANSSA_Consistency_btest_build
Scanning dependencies of target BCEulermitAVSensor2D_Consistency_RANSSA_btest_build_vera
[100%] Checking style of test/system/CodeConsistency/BCEulermitAVSensor2D_Consistency_RANSSA_btest.cpp
[100%] Built target BCEulermitAVSensor2D_Consistency_RANSSA_btest_build_vera
Scanning dependencies of target BCEulermitAVSensor2D_Consistency_RANSSA_btest_OBJECT
[100%] Building CXX object test/system/CodeConsistency/CMakeFiles/BCEulermitAVSensor2D_Consistency_RANSSA_btest_OBJECT.dir/BCEulermitAVSensor2D_Consistency_RANSSA_btest.cpp.o
[100%] Built target BCEulermitAVSensor2D_Consistency_RANSSA_btest_OBJECT
Scanning dependencies of target BCEulermitAVSensor2D_Consistency_RANSSA_btest_build
[100%] Linking CXX executable BCEulermitAVSensor2D_Consistency_RANSSA_btest
[100%] Built target BCEulermitAVSensor2D_Consistency_RANSSA_btest_build
Scanning dependencies of target PDEmitAVSensor2D_Consistency_RANSSA_btest_build_vera
[100%] Checking style of test/system/CodeConsistency/PDEmitAVSensor2D_Consistency_RANSSA_btest.cpp
[100%] Built target PDEmitAVSensor2D_Consistency_RANSSA_btest_build_vera
Scanning dependencies of target PDEmitAVSensor2D_Consistency_RANSSA_btest_OBJECT
[100%] Building CXX object test/system/CodeConsistency/CMakeFiles/PDEmitAVSensor2D_Consistency_RANSSA_btest_OBJECT.dir/PDEmitAVSensor2D_Consistency_RANSSA_btest.cpp.o
[100%] Built target PDEmitAVSensor2D_Consistency_RANSSA_btest_OBJECT
Scanning dependencies of target PDEmitAVSensor2D_Consistency_RANSSA_btest_build
[100%] Linking CXX executable PDEmitAVSensor2D_Consistency_RANSSA_btest
[100%] Built target PDEmitAVSensor2D_Consistency_RANSSA_btest_build
Scanning dependencies of target AlgebraicEquationSet_PTC_VMSD_Triangle_SA_btest_OBJECT
[100%] Building CXX object test/system/CodeConsistency/CMakeFiles/AlgebraicEquationSet_PTC_VMSD_Triangle_SA_btest_OBJECT.dir/AlgebraicEquationSet_PTC_VMSD_Triangle_SA_btest.cpp.o
[100%] Built target AlgebraicEquationSet_PTC_VMSD_Triangle_SA_btest_OBJECT
Scanning dependencies of target AlgebraicEquationSet_PTC_VMSD_Triangle_SA_btest_build_vera
[100%] Checking style of test/system/CodeConsistency/AlgebraicEquationSet_PTC_VMSD_Triangle_SA_btest.cpp
[100%] Built target AlgebraicEquationSet_PTC_VMSD_Triangle_SA_btest_build_vera
Scanning dependencies of target AlgebraicEquationSet_PTC_VMSD_Triangle_SA_btest_build
[100%] Linking CXX executable AlgebraicEquationSet_PTC_VMSD_Triangle_SA_btest
[100%] Built target AlgebraicEquationSet_PTC_VMSD_Triangle_SA_btest_build
Scanning dependencies of target PDEmitAVSensor1D_Consistency_btest_build_vera
[100%] Checking style of test/system/CodeConsistency/PDEmitAVSensor1D_Consistency_btest.cpp
[100%] Built target PDEmitAVSensor1D_Consistency_btest_build_vera
Scanning dependencies of target PDEmitAVSensor1D_Consistency_btest_OBJECT
[100%] Building CXX object test/system/CodeConsistency/CMakeFiles/PDEmitAVSensor1D_Consistency_btest_OBJECT.dir/PDEmitAVSensor1D_Consistency_btest.cpp.o
[100%] Built target PDEmitAVSensor1D_Consistency_btest_OBJECT
Scanning dependencies of target PDEmitAVSensor1D_Consistency_btest_build
[100%] Linking CXX executable PDEmitAVSensor1D_Consistency_btest
[100%] Built target PDEmitAVSensor1D_Consistency_btest_build
Scanning dependencies of target Solve2D_Coupled4x4_IBL_Panel_NACA0004_FittedTransition_TwoLayerNewton_btest_OBJECT
[100%] Building CXX object test/system/CodeConsistency/CMakeFiles/Solve2D_Coupled4x4_IBL_Panel_NACA0004_FittedTransition_TwoLayerNewton_btest_OBJECT.dir/Solve2D_Coupled4x4_IBL_Panel_NACA0004_FittedTransition_TwoLayerNewton_btest.cpp.o
[100%] Built target Solve2D_Coupled4x4_IBL_Panel_NACA0004_FittedTransition_TwoLayerNewton_btest_OBJECT
Scanning dependencies of target Solve2D_Coupled4x4_IBL_Panel_NACA0004_FittedTransition_TwoLayerNewton_btest_build_vera
[100%] Checking style of test/system/CodeConsistency/Solve2D_Coupled4x4_IBL_Panel_NACA0004_FittedTransition_TwoLayerNewton_btest.cpp
[100%] Built target Solve2D_Coupled4x4_IBL_Panel_NACA0004_FittedTransition_TwoLayerNewton_btest_build_vera
Scanning dependencies of target Solve2D_Coupled4x4_IBL_Panel_NACA0004_FittedTransition_TwoLayerNewton_btest_build
[100%] Linking CXX executable Solve2D_Coupled4x4_IBL_Panel_NACA0004_FittedTransition_TwoLayerNewton_btest
[100%] Built target Solve2D_Coupled4x4_IBL_Panel_NACA0004_FittedTransition_TwoLayerNewton_btest_build
Scanning dependencies of target BCEulermitAVSensor3D_Consistency_btest_OBJECT
[100%] Building CXX object test/system/CodeConsistency/CMakeFiles/BCEulermitAVSensor3D_Consistency_btest_OBJECT.dir/BCEulermitAVSensor3D_Consistency_btest.cpp.o
[100%] Built target BCEulermitAVSensor3D_Consistency_btest_OBJECT
Scanning dependencies of target BCEulermitAVSensor3D_Consistency_btest_build_vera
[100%] Checking style of test/system/CodeConsistency/BCEulermitAVSensor3D_Consistency_btest.cpp
[100%] Built target BCEulermitAVSensor3D_Consistency_btest_build_vera
Scanning dependencies of target BCEulermitAVSensor3D_Consistency_btest_build
[100%] Linking CXX executable BCEulermitAVSensor3D_Consistency_btest
[100%] Built target BCEulermitAVSensor3D_Consistency_btest_build
Scanning dependencies of target PDEEulermitAVDiffusion2D_RANSSA_Consistency_btest_build_vera
[100%] Checking style of test/system/CodeConsistency/PDEEulermitAVDiffusion2D_RANSSA_Consistency_btest.cpp
[100%] Built target PDEEulermitAVDiffusion2D_RANSSA_Consistency_btest_build_vera
Scanning dependencies of target PDEEulermitAVDiffusion2D_RANSSA_Consistency_btest_OBJECT
[100%] Building CXX object test/system/CodeConsistency/CMakeFiles/PDEEulermitAVDiffusion2D_RANSSA_Consistency_btest_OBJECT.dir/PDEEulermitAVDiffusion2D_RANSSA_Consistency_btest.cpp.o
[100%] Built target PDEEulermitAVDiffusion2D_RANSSA_Consistency_btest_OBJECT
Scanning dependencies of target PDEEulermitAVDiffusion2D_RANSSA_Consistency_btest_build
[100%] Linking CXX executable PDEEulermitAVDiffusion2D_RANSSA_Consistency_btest
[100%] Built target PDEEulermitAVDiffusion2D_RANSSA_Consistency_btest_build
Scanning dependencies of target Solve2D_Uncoupled_DGAdvectiveIBL_LamiBL_PTC_btest_OBJECT
[100%] Building CXX object test/system/CodeConsistency/CMakeFiles/Solve2D_Uncoupled_DGAdvectiveIBL_LamiBL_PTC_btest_OBJECT.dir/Solve2D_Uncoupled_DGAdvectiveIBL_LamiBL_PTC_btest.cpp.o
[100%] Built target Solve2D_Uncoupled_DGAdvectiveIBL_LamiBL_PTC_btest_OBJECT
Scanning dependencies of target Solve2D_Uncoupled_DGAdvectiveIBL_LamiBL_PTC_btest_build_vera
[100%] Checking style of test/system/CodeConsistency/Solve2D_Uncoupled_DGAdvectiveIBL_LamiBL_PTC_btest.cpp
[100%] Built target Solve2D_Uncoupled_DGAdvectiveIBL_LamiBL_PTC_btest_build_vera
Scanning dependencies of target Solve2D_Uncoupled_DGAdvectiveIBL_LamiBL_PTC_btest_build
[100%] Linking CXX executable Solve2D_Uncoupled_DGAdvectiveIBL_LamiBL_PTC_btest
[100%] Built target Solve2D_Uncoupled_DGAdvectiveIBL_LamiBL_PTC_btest_build
Scanning dependencies of target BCEulermitAVSensor3D_Consistency_RANSSA_btest_OBJECT
[100%] Building CXX object test/system/CodeConsistency/CMakeFiles/BCEulermitAVSensor3D_Consistency_RANSSA_btest_OBJECT.dir/BCEulermitAVSensor3D_Consistency_RANSSA_btest.cpp.o
[100%] Built target BCEulermitAVSensor3D_Consistency_RANSSA_btest_OBJECT
Scanning dependencies of target BCEulermitAVSensor3D_Consistency_RANSSA_btest_build_vera
[100%] Checking style of test/system/CodeConsistency/BCEulermitAVSensor3D_Consistency_RANSSA_btest.cpp
[100%] Built target BCEulermitAVSensor3D_Consistency_RANSSA_btest_build_vera
Scanning dependencies of target BCEulermitAVSensor3D_Consistency_RANSSA_btest_build
[100%] Linking CXX executable BCEulermitAVSensor3D_Consistency_RANSSA_btest
[100%] Built target BCEulermitAVSensor3D_Consistency_RANSSA_btest_build
Scanning dependencies of target PDEEulermitAVDiffusion1D_Consistency_btest_OBJECT
[100%] Building CXX object test/system/CodeConsistency/CMakeFiles/PDEEulermitAVDiffusion1D_Consistency_btest_OBJECT.dir/PDEEulermitAVDiffusion1D_Consistency_btest.cpp.o
[100%] Built target PDEEulermitAVDiffusion1D_Consistency_btest_OBJECT
Scanning dependencies of target PDEEulermitAVDiffusion1D_Consistency_btest_build_vera
[100%] Checking style of test/system/CodeConsistency/PDEEulermitAVDiffusion1D_Consistency_btest.cpp
[100%] Built target PDEEulermitAVDiffusion1D_Consistency_btest_build_vera
Scanning dependencies of target PDEEulermitAVDiffusion1D_Consistency_btest_build
[100%] Linking CXX executable PDEEulermitAVDiffusion1D_Consistency_btest
[100%] Built target PDEEulermitAVDiffusion1D_Consistency_btest_build
Scanning dependencies of target Solve2D_Uncoupled_DGAdvectiveIBLUniField_CorrelationClosure_LamiBL_btest_OBJECT
[100%] Building CXX object test/system/CodeConsistency/CMakeFiles/Solve2D_Uncoupled_DGAdvectiveIBLUniField_CorrelationClosure_LamiBL_btest_OBJECT.dir/Solve2D_Uncoupled_DGAdvectiveIBLUniField_CorrelationClosure_LamiBL_btest.cpp.o
[100%] Built target Solve2D_Uncoupled_DGAdvectiveIBLUniField_CorrelationClosure_LamiBL_btest_OBJECT
Scanning dependencies of target Solve2D_Uncoupled_DGAdvectiveIBLUniField_CorrelationClosure_LamiBL_btest_build_vera
[100%] Checking style of test/system/CodeConsistency/Solve2D_Uncoupled_DGAdvectiveIBLUniField_CorrelationClosure_LamiBL_btest.cpp
[100%] Built target Solve2D_Uncoupled_DGAdvectiveIBLUniField_CorrelationClosure_LamiBL_btest_build_vera
Scanning dependencies of target Solve2D_Uncoupled_DGAdvectiveIBLUniField_CorrelationClosure_LamiBL_btest_build
[100%] Linking CXX executable Solve2D_Uncoupled_DGAdvectiveIBLUniField_CorrelationClosure_LamiBL_btest
[100%] Built target Solve2D_Uncoupled_DGAdvectiveIBLUniField_CorrelationClosure_LamiBL_btest_build
Scanning dependencies of target PDEmitAVSensor2D_Consistency_btest_OBJECT
[100%] Building CXX object test/system/CodeConsistency/CMakeFiles/PDEmitAVSensor2D_Consistency_btest_OBJECT.dir/PDEmitAVSensor2D_Consistency_btest.cpp.o
[100%] Built target PDEmitAVSensor2D_Consistency_btest_OBJECT
Scanning dependencies of target PDEmitAVSensor2D_Consistency_btest_build_vera
[100%] Checking style of test/system/CodeConsistency/PDEmitAVSensor2D_Consistency_btest.cpp
[100%] Built target PDEmitAVSensor2D_Consistency_btest_build_vera
Scanning dependencies of target PDEmitAVSensor2D_Consistency_btest_build
[100%] Linking CXX executable PDEmitAVSensor2D_Consistency_btest
[100%] Built target PDEmitAVSensor2D_Consistency_btest_build
Scanning dependencies of target PDEmitAVSensor3D_Consistency_RANSSA_btest_OBJECT
[100%] Building CXX object test/system/CodeConsistency/CMakeFiles/PDEmitAVSensor3D_Consistency_RANSSA_btest_OBJECT.dir/PDEmitAVSensor3D_Consistency_RANSSA_btest.cpp.o
[100%] Built target PDEmitAVSensor3D_Consistency_RANSSA_btest_OBJECT
Scanning dependencies of target PDEmitAVSensor3D_Consistency_RANSSA_btest_build_vera
[100%] Checking style of test/system/CodeConsistency/PDEmitAVSensor3D_Consistency_RANSSA_btest.cpp
[100%] Built target PDEmitAVSensor3D_Consistency_RANSSA_btest_build_vera
Scanning dependencies of target PDEmitAVSensor3D_Consistency_RANSSA_btest_build
[100%] Linking CXX executable PDEmitAVSensor3D_Consistency_RANSSA_btest
[100%] Built target PDEmitAVSensor3D_Consistency_RANSSA_btest_build
Scanning dependencies of target PDESourceOnly_Projection_btest_build_vera
[100%] Checking style of test/system/CodeConsistency/PDESourceOnly_Projection_btest.cpp
[100%] Built target PDESourceOnly_Projection_btest_build_vera
Scanning dependencies of target PDESourceOnly_Projection_btest_OBJECT
[100%] Building CXX object test/system/CodeConsistency/CMakeFiles/PDESourceOnly_Projection_btest_OBJECT.dir/PDESourceOnly_Projection_btest.cpp.o
[100%] Built target PDESourceOnly_Projection_btest_OBJECT
Scanning dependencies of target PDESourceOnly_Projection_btest_build
[100%] Linking CXX executable PDESourceOnly_Projection_btest
[100%] Built target PDESourceOnly_Projection_btest_build
Scanning dependencies of target check_system_build
[100%] Built target check_system_build
Scanning dependencies of target memcheck_system
   Site: reynolds
   Build name: Linux-icpc
Create new tag: 20200926-0757 - Experimental
Test project /jenkins/workspace/SANS_Weekly/builddir/debug_intel/buildnode/reynolds/build/debug_intel
        Start 1770: SolverInterface_Galerkin_Stabilized_btest_memcheck
  1/107 Test #1770: SolverInterface_Galerkin_Stabilized_btest_memcheck ...........................................   Passed   36.25 sec
        Start 1772: SolverInterface_DGAdvective_btest_memcheck
  2/107 Test #1772: SolverInterface_DGAdvective_btest_memcheck ...................................................   Passed   27.63 sec
        Start 1774: SolverInterface_DGBR2_btest_memcheck
  3/107 Test #1774: SolverInterface_DGBR2_btest_memcheck .........................................................   Passed   65.62 sec
        Start 1776: ErrorOrder_2D_CG_Triangle_AD_btest_memcheck
  4/107 Test #1776: ErrorOrder_2D_CG_Triangle_AD_btest_memcheck ..................................................   Passed   17.02 sec
        Start 1778: ErrorOrder_2D_EDG_Triangle_AD_btest_memcheck
  5/107 Test #1778: ErrorOrder_2D_EDG_Triangle_AD_btest_memcheck .................................................   Passed   80.89 sec
        Start 1780: ErrorOrder_3D_DGBR2_Sphere_Triangle_AD_btest_memcheck
  6/107 Test #1780: ErrorOrder_3D_DGBR2_Sphere_Triangle_AD_btest_memcheck ........................................   Passed   31.69 sec
        Start 1782: ErrorOrder_3D_CG_Tet_AD_btest_memcheck
  7/107 Test #1782: ErrorOrder_3D_CG_Tet_AD_btest_memcheck .......................................................   Passed   23.44 sec
        Start 1784: ErrorOrder_4D_DG_Pentatope_btest_memcheck
  8/107 Test #1784: ErrorOrder_4D_DG_Pentatope_btest_memcheck ....................................................   Passed  301.37 sec
        Start 1786: ErrorEstimateOrder_2D_HDG_Triangle_AD_btest_memcheck
  9/107 Test #1786: ErrorEstimateOrder_2D_HDG_Triangle_AD_btest_memcheck .........................................   Passed  441.84 sec
        Start 1788: ErrorOrder_1D_DGBR2_BuckleyLeverett_ST_btest_memcheck
 10/107 Test #1788: ErrorOrder_1D_DGBR2_BuckleyLeverett_ST_btest_memcheck ........................................   Passed  408.28 sec
        Start 1790: ErrorOrder_1D_HDG_AD_btest_memcheck
 11/107 Test #1790: ErrorOrder_1D_HDG_AD_btest_memcheck ..........................................................   Passed   18.06 sec
        Start 1792: ErrorOrder_1D_HDG_AD_BDF_btest_memcheck
 12/107 Test #1792: ErrorOrder_1D_HDG_AD_BDF_btest_memcheck ......................................................   Passed  241.49 sec
        Start 1794: ErrorOrder_1D_DGBR2_AD_BDF_btest_memcheck
 13/107 Test #1794: ErrorOrder_1D_DGBR2_AD_BDF_btest_memcheck ....................................................   Passed  143.06 sec
        Start 1796: ErrorEstimateOrder_2D_DGAdvective_Triangle_AD_btest_memcheck
 14/107 Test #1796: ErrorEstimateOrder_2D_DGAdvective_Triangle_AD_btest_memcheck .................................   Passed  463.68 sec
        Start 1798: ErrorEstimateOrder_1D_CG_Line_AD_btest_memcheck
 15/107 Test #1798: ErrorEstimateOrder_1D_CG_Line_AD_btest_memcheck ..............................................   Passed   11.38 sec
        Start 1800: Adjoint2D_HDG_Triangle_AD_sansLG_btest_memcheck
 16/107 Test #1800: Adjoint2D_HDG_Triangle_AD_sansLG_btest_memcheck ..............................................   Passed  214.06 sec
        Start 1802: Adjoint1D_DGBR2_BuckleyLeverett_ST_btest_memcheck
 17/107 Test #1802: Adjoint1D_DGBR2_BuckleyLeverett_ST_btest_memcheck ............................................   Passed  128.62 sec
        Start 1804: ErrorOrder_1D_CG_AD_btest_memcheck
 18/107 Test #1804: ErrorOrder_1D_CG_AD_btest_memcheck ...........................................................   Passed   11.23 sec
        Start 1806: ErrorEstimateOrder_3D_CG_Tet_AD_btest_memcheck
 19/107 Test #1806: ErrorEstimateOrder_3D_CG_Tet_AD_btest_memcheck ...............................................   Passed    4.74 sec
        Start 1808: ErrorOrder_1D_DGBR2_TwoPhase_ST_btest_memcheck
 20/107 Test #1808: ErrorOrder_1D_DGBR2_TwoPhase_ST_btest_memcheck ...............................................   Passed  225.73 sec
        Start 1810: Adjoint2D_DGAdvective_Triangle_AD_btest_memcheck
 21/107 Test #1810: Adjoint2D_DGAdvective_Triangle_AD_btest_memcheck .............................................   Passed   20.35 sec
        Start 1812: Solve2D_DGAdvective_LinearRobin_mitLG_sansLG_Consistency_AD_btest_memcheck
 22/107 Test #1812: Solve2D_DGAdvective_LinearRobin_mitLG_sansLG_Consistency_AD_btest_memcheck ...................   Passed   24.19 sec
        Start 1814: ErrorOrder_2D_HDG_Triangle_AD_btest_memcheck
 23/107 Test #1814: ErrorOrder_2D_HDG_Triangle_AD_btest_memcheck .................................................   Passed   91.86 sec
        Start 1816: ErrorOrder_1D_HDGAdvective_Advection_btest_memcheck
 24/107 Test #1816: ErrorOrder_1D_HDGAdvective_Advection_btest_memcheck ..........................................   Passed   12.33 sec
        Start 1818: ErrorOrder_1D_CG_AD_BDF_btest_memcheck
 25/107 Test #1818: ErrorOrder_1D_CG_AD_BDF_btest_memcheck .......................................................   Passed  441.80 sec
        Start 1820: ErrorOrder_3D_CG_Sphere_Triangle_AD_btest_memcheck
 26/107 Test #1820: ErrorOrder_3D_CG_Sphere_Triangle_AD_btest_memcheck ...........................................   Passed   34.49 sec
        Start 1822: ErrorEstimateOrder_1D_DGBR2_Line_AD_btest_memcheck
 27/107 Test #1822: ErrorEstimateOrder_1D_DGBR2_Line_AD_btest_memcheck ...........................................   Passed   17.55 sec
        Start 1824: ErrorOrder_3D_CG_Hex_AD_btest_memcheck
 28/107 Test #1824: ErrorOrder_3D_CG_Hex_AD_btest_memcheck .......................................................   Passed   17.66 sec
        Start 1826: ErrorOrder_1D_HDG_Burgers_btest_memcheck
 29/107 Test #1826: ErrorOrder_1D_HDG_Burgers_btest_memcheck .....................................................   Passed  891.24 sec
        Start 1828: ErrorEstimateOrder_2D_CG_Nodal_Triangle_AD_btest_memcheck
 30/107 Test #1828: ErrorEstimateOrder_2D_CG_Nodal_Triangle_AD_btest_memcheck ....................................   Passed  527.03 sec
        Start 1830: ErrorOrder_1D_DGBR2_Burgers_btest_memcheck
 31/107 Test #1830: ErrorOrder_1D_DGBR2_Burgers_btest_memcheck ...................................................   Passed  152.26 sec
        Start 1832: ErrorOrder_2D_DGAdvective_Flat_Line_AD_btest_memcheck
 32/107 Test #1832: ErrorOrder_2D_DGAdvective_Flat_Line_AD_btest_memcheck ........................................   Passed   15.93 sec
        Start 1834: ErrorOrder_3D_DGBR2_Tet_AD_btest_memcheck
 33/107 Test #1834: ErrorOrder_3D_DGBR2_Tet_AD_btest_memcheck ....................................................   Passed   21.98 sec
        Start 1836: ErrorOrder_1D_DGBR2_AD_btest_memcheck
 34/107 Test #1836: ErrorOrder_1D_DGBR2_AD_btest_memcheck ........................................................   Passed   15.88 sec
        Start 1838: ErrorOrder_2D_DGAdvective_Annulus_Triangle_btest_memcheck
 35/107 Test #1838: ErrorOrder_2D_DGAdvective_Annulus_Triangle_btest_memcheck ....................................   Passed   15.55 sec
        Start 1840: ErrorEstimateOrder_2D_CG_Triangle_RD_btest_memcheck
 36/107 Test #1840: ErrorEstimateOrder_2D_CG_Triangle_RD_btest_memcheck ..........................................   Passed  177.69 sec
        Start 1842: ErrorOrder_2D_DGAdvective_Circle_Line_AD_btest_memcheck
 37/107 Test #1842: ErrorOrder_2D_DGAdvective_Circle_Line_AD_btest_memcheck ......................................   Passed   15.29 sec
        Start 1844: ErrorOrder_2D_CG_Quad_AD_btest_memcheck
 38/107 Test #1844: ErrorOrder_2D_CG_Quad_AD_btest_memcheck ......................................................   Passed   14.31 sec
        Start 1846: ErrorEstimateOrder_2D_DGBR2_Triangle_AD_btest_memcheck
 39/107 Test #1846: ErrorEstimateOrder_2D_DGBR2_Triangle_AD_btest_memcheck .......................................   Passed  210.64 sec
        Start 1848: ErrorOrder_2D_DGAdvective_Circle_Line_ShallowWater_btest_memcheck
 40/107 Test #1848: ErrorOrder_2D_DGAdvective_Circle_Line_ShallowWater_btest_memcheck ............................   Passed   16.40 sec
        Start 1850: ErrorEstimateOrder_2D_CG_Triangle_AD_btest_memcheck
 41/107 Test #1850: ErrorEstimateOrder_2D_CG_Triangle_AD_btest_memcheck ..........................................   Passed  481.25 sec
        Start 1852: ErrorOrder_2D_DGBR2_Triangle_AD_btest_memcheck
 42/107 Test #1852: ErrorOrder_2D_DGBR2_Triangle_AD_btest_memcheck ...............................................   Passed   29.91 sec
        Start 1854: ErrorOrder_1D_DGAdvective_ShallowWater_btest_memcheck
 43/107 Test #1854: ErrorOrder_1D_DGAdvective_ShallowWater_btest_memcheck ........................................   Passed   15.86 sec
        Start 1856: ErrorOrder_3D_DGBR2_Periodic_Hex_AD_btest_memcheck
 44/107 Test #1856: ErrorOrder_3D_DGBR2_Periodic_Hex_AD_btest_memcheck ...........................................   Passed   17.65 sec
        Start 1858: ErrorOrder_1D_DGBR2_AD_HB_btest_memcheck
 45/107 Test #1858: ErrorOrder_1D_DGBR2_AD_HB_btest_memcheck .....................................................   Passed   30.97 sec
        Start 1860: ErrorOrder_2D_DGAdvective_Annulus_Quad_btest_memcheck
 46/107 Test #1860: ErrorOrder_2D_DGAdvective_Annulus_Quad_btest_memcheck ........................................   Passed   15.74 sec
        Start 1862: ErrorOrder_2D_CGStabilized_RANS_MMS_btest_memcheck
 47/107 Test #1862: ErrorOrder_2D_CGStabilized_RANS_MMS_btest_memcheck ...........................................   Passed   53.55 sec
        Start 1864: Adjoint2D_HDG_Triangle_AD_mitState_btest_memcheck
 48/107 Test #1864: Adjoint2D_HDG_Triangle_AD_mitState_btest_memcheck ............................................   Passed  203.31 sec
        Start 1866: ErrorOrder_2D_DGBR2_RANS_MMS_btest_memcheck
 49/107 Test #1866: ErrorOrder_2D_DGBR2_RANS_MMS_btest_memcheck ..................................................   Passed   71.24 sec
        Start 1868: Adjoint2D_DGBR2_Triangle_AD_btest_memcheck
 50/107 Test #1868: Adjoint2D_DGBR2_Triangle_AD_btest_memcheck ...................................................   Passed   32.39 sec
        Start 1870: Adjoint2D_CG_Triangle_AD_btest_memcheck
 51/107 Test #1870: Adjoint2D_CG_Triangle_AD_btest_memcheck ......................................................   Passed   15.31 sec
        Start 1872: ElementLocalSolve3D_DGBR2_Tet_AD_btest_memcheck
 52/107 Test #1872: ElementLocalSolve3D_DGBR2_Tet_AD_btest_memcheck ..............................................   Passed  241.26 sec
        Start 1874: AlgebraicEquationSet_Local_VMSD_Triangle_AD_btest_memcheck
 53/107 Test #1874: AlgebraicEquationSet_Local_VMSD_Triangle_AD_btest_memcheck ...................................   Passed   17.29 sec
        Start 1876: LocalSolve3D_HDG_Tet_AD_btest_memcheck
 54/107 Test #1876: LocalSolve3D_HDG_Tet_AD_btest_memcheck .......................................................   Passed  611.23 sec
        Start 1878: LocalSolve3D_Split_HDG_Tet_AD_btest_memcheck
 55/107 Test #1878: LocalSolve3D_Split_HDG_Tet_AD_btest_memcheck .................................................   Passed  559.91 sec
        Start 1880: EdgeLocalSolve3D_Dual_Galerkin_Stabilized_AD_btest_memcheck
 56/107 Test #1880: EdgeLocalSolve3D_Dual_Galerkin_Stabilized_AD_btest_memcheck ..................................   Passed  137.62 sec
        Start 1882: EdgeLocalSolve2D_Dual_Galerkin_Stabilized_AR_btest_memcheck
 57/107 Test #1882: EdgeLocalSolve2D_Dual_Galerkin_Stabilized_AR_btest_memcheck ..................................   Passed  193.90 sec
        Start 1884: EdgeLocalSolve2D_Dual_Galerkin_Stabilized_Euler_btest_memcheck
 58/107 Test #1884: EdgeLocalSolve2D_Dual_Galerkin_Stabilized_Euler_btest_memcheck ...............................   Passed   24.67 sec
        Start 1886: LocalSolve2D_Split_HDG_Triangle_AD_btest_memcheck
 59/107 Test #1886: LocalSolve2D_Split_HDG_Triangle_AD_btest_memcheck ............................................   Passed   78.55 sec
        Start 1888: LocalSolve1D_Split_DGBR2_AD_btest_memcheck
 60/107 Test #1888: LocalSolve1D_Split_DGBR2_AD_btest_memcheck ...................................................   Passed   18.17 sec
        Start 1890: LocalSolve1D_HDG_AD_btest_memcheck
 61/107 Test #1890: LocalSolve1D_HDG_AD_btest_memcheck ...........................................................   Passed   20.02 sec
        Start 1892: AlgebraicEquationSet_Local_VMSDBR2_Triangle_AD_btest_memcheck
 62/107 Test #1892: AlgebraicEquationSet_Local_VMSDBR2_Triangle_AD_btest_memcheck ................................   Passed   19.42 sec
        Start 1894: LocalSolve2D_HDG_Triangle_AD_btest_memcheck
 63/107 Test #1894: LocalSolve2D_HDG_Triangle_AD_btest_memcheck ..................................................   Passed   64.28 sec
        Start 1896: ElementLocalSolve1D_DGBR2_Triangle_AD_btest_memcheck
 64/107 Test #1896: ElementLocalSolve1D_DGBR2_Triangle_AD_btest_memcheck .........................................   Passed   21.38 sec
        Start 1898: LocalSolve1D_Split_HDG_AD_btest_memcheck
 65/107 Test #1898: LocalSolve1D_Split_HDG_AD_btest_memcheck .....................................................   Passed   18.77 sec
        Start 1900: LocalSolve2D_Split_DGBR2_Triangle_AD_AV_btest_memcheck
 66/107 Test #1900: LocalSolve2D_Split_DGBR2_Triangle_AD_AV_btest_memcheck .......................................   Passed  318.29 sec
        Start 1902: ElementLocalSolve3D_DGAdvective_Tet_AD_btest_memcheck
 67/107 Test #1902: ElementLocalSolve3D_DGAdvective_Tet_AD_btest_memcheck ........................................   Passed  125.16 sec
        Start 1904: EdgeLocalSolve1D_Dual_Galerkin_Stabilized_Line_AD_btest_memcheck
 68/107 Test #1904: EdgeLocalSolve1D_Dual_Galerkin_Stabilized_Line_AD_btest_memcheck .............................   Passed   22.63 sec
        Start 1906: ElementDualLocalSolve3D_Galerkin_Stabilized_Triangle_AD_btest_memcheck
 69/107 Test #1906: ElementDualLocalSolve3D_Galerkin_Stabilized_Triangle_AD_btest_memcheck .......................   Passed  468.56 sec
        Start 1908: EdgeLocalSolve2D_Dual_Galerkin_Stabilized_AD_btest_memcheck
 70/107 Test #1908: EdgeLocalSolve2D_Dual_Galerkin_Stabilized_AD_btest_memcheck ..................................   Passed  219.39 sec
        Start 1910: ElementLocalSolve2D_DGBR2_Triangle_AD_btest_memcheck
 71/107 Test #1910: ElementLocalSolve2D_DGBR2_Triangle_AD_btest_memcheck .........................................   Passed  221.93 sec
        Start 1912: ElementDualLocalSolve2D_Galerkin_Stabilized_Triangle_AD_btest_memcheck
 72/107 Test #1912: ElementDualLocalSolve2D_Galerkin_Stabilized_Triangle_AD_btest_memcheck .......................   Passed  145.46 sec
        Start 1914: Block_1D_Decoupled_Burgers_btest_memcheck
 73/107 Test #1914: Block_1D_Decoupled_Burgers_btest_memcheck ....................................................   Passed  609.24 sec
        Start 1916: Block_1D_Decoupled_AD_btest_memcheck
 74/107 Test #1916: Block_1D_Decoupled_AD_btest_memcheck .........................................................   Passed   10.52 sec
        Start 1918: AnalyticSolve2D_HDG_Triangle_NavierStokes_UniformStream_btest_memcheck
 75/107 Test #1918: AnalyticSolve2D_HDG_Triangle_NavierStokes_UniformStream_btest_memcheck .......................   Passed   22.47 sec
        Start 1920: AnalyticSolve2D_DGAdvective_IBL_StagnationFlow_SingleElem_LamiBL_btest_memcheck
 76/107 Test #1920: AnalyticSolve2D_DGAdvective_IBL_StagnationFlow_SingleElem_LamiBL_btest_memcheck ..............   Passed   29.04 sec
        Start 1922: AnalyticSolve2D_DGAdvective_IBLSplitAmpLag_StagnationFlow_LamiBL_btest_memcheck
 77/107 Test #1922: AnalyticSolve2D_DGAdvective_IBLSplitAmpLag_StagnationFlow_LamiBL_btest_memcheck ..............   Passed   17.75 sec
        Start 1924: AnalyticSolve2D_HDG_Triangle_NavierStokes_btest_memcheck
 78/107 Test #1924: AnalyticSolve2D_HDG_Triangle_NavierStokes_btest_memcheck .....................................   Passed  511.86 sec
        Start 1926: AnalyticSolve2D_DGBR2_Triangle_NavierStokes_UniformStream_btest_memcheck
 79/107 Test #1926: AnalyticSolve2D_DGBR2_Triangle_NavierStokes_UniformStream_btest_memcheck .....................   Passed   56.14 sec
        Start 1928: AnalyticSolve_IBL3D_StagnationFlow_LamiBL_Triangle_btest_memcheck
 80/107 Test #1928: AnalyticSolve_IBL3D_StagnationFlow_LamiBL_Triangle_btest_memcheck ............................   Passed    4.76 sec
        Start 1930: AnalyticSolve2D_DGAdvective_Triangle_Euler_UniformStream_btest_memcheck
 81/107 Test #1930: AnalyticSolve2D_DGAdvective_Triangle_Euler_UniformStream_btest_memcheck ......................   Passed   71.58 sec
        Start 1932: AnalyticSolve2D_DGAdvective_IBL_StagnationFlow_LamiBL_btest_memcheck
 82/107 Test #1932: AnalyticSolve2D_DGAdvective_IBL_StagnationFlow_LamiBL_btest_memcheck .........................   Passed   54.21 sec
        Start 1934: AnalyticSolve_HDG_AD_btest_memcheck
 83/107 Test #1934: AnalyticSolve_HDG_AD_btest_memcheck ..........................................................   Passed   18.94 sec
        Start 1936: AnalyticSolve2D_DGBR2_Triangle_NavierStokes_btest_memcheck
 84/107 Test #1936: AnalyticSolve2D_DGBR2_Triangle_NavierStokes_btest_memcheck ...................................   Passed   71.85 sec
        Start 1938: AnalyticSolve3D_IBLFourEqn_StagnationFlow_LamiBL_Triangle_btest_memcheck
 85/107 Test #1938: AnalyticSolve3D_IBLFourEqn_StagnationFlow_LamiBL_Triangle_btest_memcheck .....................   Passed  337.76 sec
        Start 1940: PDEmitAVSensor2D_Consistency_RANSSA_btest_memcheck
 86/107 Test #1940: PDEmitAVSensor2D_Consistency_RANSSA_btest_memcheck ...........................................   Passed    7.38 sec
        Start 1942: Solve2D_Uncoupled_HDGAdvectiveIBL_LamiBL_btest_memcheck
 87/107 Test #1942: Solve2D_Uncoupled_HDGAdvectiveIBL_LamiBL_btest_memcheck ......................................   Passed  227.90 sec
        Start 1944: AlgebraicEquationSet_PTC_VMSD_Triangle_SA_btest_memcheck
 88/107 Test #1944: AlgebraicEquationSet_PTC_VMSD_Triangle_SA_btest_memcheck .....................................   Passed    4.88 sec
        Start 1946: PDEmitAVSensor1D_Consistency_btest_memcheck
 89/107 Test #1946: PDEmitAVSensor1D_Consistency_btest_memcheck ..................................................   Passed    6.28 sec
        Start 1948: PDEEulermitAVDiffusion3D_RANSSA_Consistency_btest_memcheck
 90/107 Test #1948: PDEEulermitAVDiffusion3D_RANSSA_Consistency_btest_memcheck ...................................   Passed    6.12 sec
        Start 1950: Solve2D_Coupled4x4_IBLSplitAmpLag_CorrelationClosure_CapturedTransition_PTC_btest_memcheck
 91/107 Test #1950: Solve2D_Coupled4x4_IBLSplitAmpLag_CorrelationClosure_CapturedTransition_PTC_btest_memcheck ...   Passed  478.71 sec
        Start 1952: PDEEulermitAVDiffusion3D_Consistency_btest_memcheck
 92/107 Test #1952: PDEEulermitAVDiffusion3D_Consistency_btest_memcheck ..........................................   Passed    6.59 sec
        Start 1954: Solve2D_Coupled4x4_IBL_Panel_NACA0004_FittedTransition_TwoLayerNewton_btest_memcheck
 93/107 Test #1954: Solve2D_Coupled4x4_IBL_Panel_NACA0004_FittedTransition_TwoLayerNewton_btest_memcheck .........   Passed  1527.09 sec
        Start 1956: PDEEulermitAVDiffusion1D_Consistency_btest_memcheck
 94/107 Test #1956: PDEEulermitAVDiffusion1D_Consistency_btest_memcheck ..........................................   Passed    5.94 sec
        Start 1958: PDEEulermitAVDiffusion2D_RANSSA_Consistency_btest_memcheck
 95/107 Test #1958: PDEEulermitAVDiffusion2D_RANSSA_Consistency_btest_memcheck ...................................   Passed    5.81 sec
        Start 1960: BCEulermitAVSensor2D_Consistency_RANSSA_btest_memcheck
 96/107 Test #1960: BCEulermitAVSensor2D_Consistency_RANSSA_btest_memcheck .......................................   Passed    7.78 sec
        Start 1962: BCEulermitAVSensor3D_Consistency_btest_memcheck
 97/107 Test #1962: BCEulermitAVSensor3D_Consistency_btest_memcheck ..............................................   Passed    7.40 sec
        Start 1964: BCEulermitAVSensor3D_Consistency_RANSSA_btest_memcheck
 98/107 Test #1964: BCEulermitAVSensor3D_Consistency_RANSSA_btest_memcheck .......................................   Passed    7.23 sec
        Start 1966: Solve2D_Uncoupled_DGAdvectiveIBLUniField_CorrelationClosure_LamiBL_btest_memcheck
 99/107 Test #1966: Solve2D_Uncoupled_DGAdvectiveIBLUniField_CorrelationClosure_LamiBL_btest_memcheck ............   Passed   57.31 sec
        Start 1968: PDEmitAVSensor2D_Consistency_btest_memcheck
100/107 Test #1968: PDEmitAVSensor2D_Consistency_btest_memcheck ..................................................   Passed   11.67 sec
        Start 1970: PDEmitAVSensor3D_Consistency_RANSSA_btest_memcheck
101/107 Test #1970: PDEmitAVSensor3D_Consistency_RANSSA_btest_memcheck ...........................................   Passed    7.96 sec
        Start 1972: PDESourceOnly_Projection_btest_memcheck
102/107 Test #1972: PDESourceOnly_Projection_btest_memcheck ......................................................***Timeout 3600.05 sec
Running 4 test cases...
Generating grid: 4x4
Generated
Newton iteration: 0, Residual Norm: 1.01298e+00, 1.01298e+00, 0.00000e+00
  Linesearch: s = 1.000e+00, Res_L2norm = 2.428e-16, 2.428e-16, 0.000e+00
Newton iteration: 1, Residual Norm: 2.42822e-16, 2.42822e-16, 0.00000e+00
Newton iteration: 0, Residual Norm: 3.81272e-01, 3.81272e-01, 0.00000e+00
  Linesearch: s = 1.000e+00, Res_L2norm = 6.484e-17, 6.484e-17, 0.000e+00
Newton iteration: 1, Residual Norm: 6.48372e-17, 6.48372e-17, 0.00000e+00
Newton iteration: 0, Residual Norm: 1.67066e-01, 1.67066e-01, 0.00000e+00
  Linesearch: s = 1.000e+00, Res_L2norm = 4.760e-17, 4.760e-17, 0.000e+00
Newton iteration: 1, Residual Norm: 4.75990e-17, 4.75990e-17, 0.00000e+00
Generating grid: 8x8
Generated
Newton iteration: 0, Residual Norm: 6.26691e-01, 6.26691e-01, 0.00000e+00
  Linesearch: s = 1.000e+00, Res_L2norm = 1.245e-16, 1.245e-16, 0.000e+00
Newton iteration: 1, Residual Norm: 1.24539e-16, 1.24539e-16, 0.00000e+00
Newton iteration: 0, Residual Norm: 2.14479e-01, 2.14479e-01, 0.00000e+00
  Linesearch: s = 1.000e+00, Res_L2norm = 3.339e-17, 3.339e-17, 0.000e+00
Newton iteration: 1, Residual Norm: 3.33936e-17, 3.33936e-17, 0.00000e+00
Newton iteration: 0, Residual Norm: 9.19203e-02, 9.19203e-02, 0.00000e+00
  Linesearch: s = 1.000e+00, Res_L2norm = 3.906e-17, 3.906e-17, 0.000e+00
Newton iteration: 1, Residual Norm: 3.90562e-17, 3.90562e-17, 0.00000e+00
Generating grid: 16x16
Generated
Newton iteration: 0, Residual Norm: 3.51390e-01, 3.51390e-01, 0.00000e+00
  Linesearch: s = 1.000e+00, Res_L2norm = 4.522e-17, 4.522e-17, 0.000e+00
Newton iteration: 1, Residual Norm: 4.52162e-17, 4.52162e-17, 0.00000e+00
Newton iteration: 0, Residual Norm: 1.14139e-01, 1.14139e-01, 0.00000e+00
  Linesearch: s = 1.000e+00, Res_L2norm = 2.633e-17, 2.633e-17, 0.000e+00
Newton iteration: 1, Residual Norm: 2.63270e-17, 2.63270e-17, 0.00000e+00
Newton iteration: 0, Residual Norm: 4.83537e-02, 4.83537e-02, 0.00000e+00
  Linesearch: s = 1.000e+00, Res_L2norm = 1.550e-17, 1.550e-17, 0.000e+00
Newton iteration: 1, Residual Norm: 1.55047e-17, 1.55047e-17, 0.00000e+00
Generating grid: 32x32
Generated
Newton iteration: 0, Residual Norm: 1.86352e-01, 1.86352e-01, 0.00000e+00
  Linesearch: s = 1.000e+00, Res_L2norm = 4.721e-17, 4.721e-17, 0.000e+00
Newton iteration: 1, Residual Norm: 4.72070e-17, 4.72070e-17, 0.00000e+00
Newton iteration: 0, Residual Norm: 5.89176e-02, 5.89176e-02, 0.00000e+00
  Linesearch: s = 1.000e+00, Res_L2norm = 1.555e-17, 1.555e-17, 0.000e+00
Newton iteration: 1, Residual Norm: 1.55453e-17, 1.55453e-17, 0.00000e+00
Newton iteration: 0, Residual Norm: 2.48127e-02, 2.48127e-02, 0.00000e+00
  Linesearch: s = 1.000e+00, Res_L2norm = 6.169e-18, 6.169e-18, 0.000e+00
Newton iteration: 1, Residual Norm: 6.16919e-18, 6.16919e-18, 0.00000e+00
Generating grid: 4x4
Generated
Newton iteration: 0, Residual Norm: 7.33434e-01, 7.33434e-01, 0.00000e+00
  Linesearch: s = 1.000e+00, Res_L2norm = 1.794e-16, 1.794e-16, 0.000e+00
Newton iteration: 1, Residual Norm: 1.79386e-16, 1.79386e-16, 0.00000e+00
Newton iteration: 0, Residual Norm: 2.78209e-01, 2.78209e-01, 0.00000e+00
  Linesearch: s = 1.000e+00, Res_L2norm = 5.445e-17, 5.445e-17, 0.000e+00
Newton iteration: 1, Residual Norm: 5.44477e-17, 5.44477e-17, 0.00000e+00
Newton iteration: 0, Residual Norm: 1.22264e-01, 1.22264e-01, 0.00000e+00
  Linesearch: s = 1.000e+00, Res_L2norm = 4.387e-17, 4.387e-17, 0.000e+00
Newton iteration: 1, Residual Norm: 4.38711e-17, 4.38711e-17, 0.00000e+00
Generating grid: 8x8
Generated
Newton iteration: 0, Residual Norm: 4.56154e-01, 4.56154e-01, 0.00000e+00
  Linesearch: s = 1.000e+00, Res_L2norm = 6.939e-17, 6.939e-17, 0.000e+00
Newton iteration: 1, Residual Norm: 6.93934e-17, 6.93934e-17, 0.00000e+00
Newton iteration: 0, Residual Norm: 1.56688e-01, 1.56688e-01, 0.00000e+00
  Linesearch: s = 1.000e+00, Res_L2norm = 2.622e-17, 2.622e-17, 0.000e+00
Newton iteration: 1, Residual Norm: 2.62180e-17, 2.62180e-17, 0.00000e+00
Newton iteration: 0, Residual Norm: 6.72256e-02, 6.72256e-02, 0.00000e+00
  Linesearch: s = 1.000e+00, Res_L2norm = 2.680e-17, 2.680e-17, 0.000e+00
Newton iteration: 1, Residual Norm: 2.67981e-17, 2.67981e-17, 0.00000e+00
Generating grid: 16x16
Generated
Newton iteration: 0, Residual Norm: 2.56247e-01, 2.56247e-01, 0.00000e+00
  Linesearch: s = 1.000e+00, Res_L2norm = 4.608e-17, 4.608e-17, 0.000e+00
Newton iteration: 1, Residual Norm: 4.60802e-17, 4.60802e-17, 0.00000e+00
Newton iteration: 0, Residual Norm: 8.33831e-02, 8.33831e-02, 0.00000e+00
  Linesearch: s = 1.000e+00, Res_L2norm = 1.503e-17, 1.503e-17, 0.000e+00
Newton iteration: 1, Residual Norm: 1.50301e-17, 1.50301e-17, 0.00000e+00
Newton iteration: 0, Residual Norm: 3.53402e-02, 3.53402e-02, 0.00000e+00
  Linesearch: s = 1.000e+00, Res_L2norm = 1.319e-17, 1.319e-17, 0.000e+00
Newton iteration: 1, Residual Norm: 1.31858e-17, 1.31858e-17, 0.00000e+00
Generating grid: 32x32
Generated
Newton iteration: 0, Residual Norm: 1.36000e-01, 1.36000e-01, 0.00000e+00
  Linesearch: s = 1.000e+00, Res_L2norm = 2.190e-17, 2.190e-17, 0.000e+00
Newton iteration: 1, Residual Norm: 2.18971e-17, 2.18971e-17, 0.00000e+00
Newton iteration: 0, Residual Norm: 4.30360e-02, 4.30360e-02, 0.00000e+00
  Linesearch: s = 1.000e+00, Res_L2norm = 7.638e-18, 7.638e-18, 0.000e+00
Newton iteration: 1, Residual Norm: 7.63804e-18, 7.63804e-18, 0.00000e+00
Newton iteration: 0, Residual Norm: 1.81280e-02, 1.81280e-02, 0.00000e+00

        Start 1974: Solve2D_XfoilLikePanelMethod_btest_memcheck
103/107 Test #1974: Solve2D_XfoilLikePanelMethod_btest_memcheck ..................................................   Passed  496.53 sec
        Start 1976: PDEmitAVSensor3D_Consistency_btest_memcheck
104/107 Test #1976: PDEmitAVSensor3D_Consistency_btest_memcheck ..................................................   Passed    9.17 sec
        Start 1978: Solve2D_Uncoupled_DGAdvectiveIBL_LamiBL_PTC_btest_memcheck
105/107 Test #1978: Solve2D_Uncoupled_DGAdvectiveIBL_LamiBL_PTC_btest_memcheck ...................................   Passed  808.87 sec
        Start 1980: BCEulermitAVSensor2D_Consistency_btest_memcheck
106/107 Test #1980: BCEulermitAVSensor2D_Consistency_btest_memcheck ..............................................   Passed    8.17 sec
        Start 1982: PDEEulermitAVDiffusion2D_Consistency_btest_memcheck
107/107 Test #1982: PDEEulermitAVDiffusion2D_Consistency_btest_memcheck ..........................................   Passed    6.53 sec

99% tests passed, 1 tests failed out of 107

Label Time Summary:
SANSMemCheck_system    = 19267.06 sec (107 tests)

Total Test time (real) = 19267.29 sec

The following tests FAILED:
	1972 - PDESourceOnly_Projection_btest_memcheck (Timeout)
Errors while running CTest
test/system/CMakeFiles/memcheck_system.dir/build.make:57: recipe for target 'test/system/CMakeFiles/memcheck_system' failed
make[3]: *** [test/system/CMakeFiles/memcheck_system] Error 8
CMakeFiles/Makefile2:182234: recipe for target 'test/system/CMakeFiles/memcheck_system.dir/all' failed
make[2]: *** [test/system/CMakeFiles/memcheck_system.dir/all] Error 2
CMakeFiles/Makefile2:182241: recipe for target 'test/system/CMakeFiles/memcheck_system.dir/rule' failed
make[1]: *** [test/system/CMakeFiles/memcheck_system.dir/rule] Error 2
Makefile:63977: recipe for target 'memcheck_system' failed
make: *** [memcheck_system] Error 2

real	440m9.831s
user	403m35.732s
sys	31m12.904s
+ status=1
++ find /jenkins/workspace/SANS_Weekly/builddir/debug_intel/buildnode/reynolds/build/debug_intel -name Test.xml
+ mv /jenkins/workspace/SANS_Weekly/builddir/debug_intel/buildnode/reynolds/build/debug_intel/Testing/20200926-0757/Test.xml /jenkins/workspace/SANS_Weekly/builddir/debug_intel/buildnode/reynolds/build/Test_system_memcheck.xml
+ '[' 1 -eq 1 ']'
+ exit 1
Build step 'Execute shell' marked build as failure
[GNU C Compiler (gcc)Clang (LLVM based)Intel Compiler (C, Fortran)Vera++] Skipping execution of recorder since overall result is 'FAILURE'
[Valgrind] Files to copy:
[Valgrind] build/debug_intel/test/valgrind.10277.memcheck.xml
[Valgrind] build/debug_intel/test/valgrind.10336.memcheck.xml
[Valgrind] build/debug_intel/test/valgrind.10415.memcheck.xml
[Valgrind] build/debug_intel/test/valgrind.10449.memcheck.xml
[Valgrind] build/debug_intel/test/valgrind.1125.memcheck.xml
[Valgrind] build/debug_intel/test/valgrind.11955.memcheck.xml
[Valgrind] build/debug_intel/test/valgrind.11991.memcheck.xml
[Valgrind] build/debug_intel/test/valgrind.12154.memcheck.xml
[Valgrind] build/debug_intel/test/valgrind.12577.memcheck.xml
[Valgrind] build/debug_intel/test/valgrind.12838.memcheck.xml
[Valgrind] build/debug_intel/test/valgrind.1293.memcheck.xml
[Valgrind] build/debug_intel/test/valgrind.14049.memcheck.xml
[Valgrind] build/debug_intel/test/valgrind.1596.memcheck.xml
[Valgrind] build/debug_intel/test/valgrind.16326.memcheck.xml
[Valgrind] build/debug_intel/test/valgrind.16426.memcheck.xml
[Valgrind] build/debug_intel/test/valgrind.16504.memcheck.xml
[Valgrind] build/debug_intel/test/valgrind.17035.memcheck.xml
[Valgrind] build/debug_intel/test/valgrind.17072.memcheck.xml
[Valgrind] build/debug_intel/test/valgrind.1831.memcheck.xml
[Valgrind] build/debug_intel/test/valgrind.19759.memcheck.xml
[Valgrind] build/debug_intel/test/valgrind.20037.memcheck.xml
[Valgrind] build/debug_intel/test/valgrind.20380.memcheck.xml
[Valgrind] build/debug_intel/test/valgrind.2159.memcheck.xml
[Valgrind] build/debug_intel/test/valgrind.2160.memcheck.xml
[Valgrind] build/debug_intel/test/valgrind.21758.memcheck.xml
[Valgrind] build/debug_intel/test/valgrind.21931.memcheck.xml
[Valgrind] build/debug_intel/test/valgrind.21957.memcheck.xml
[Valgrind] build/debug_intel/test/valgrind.21990.memcheck.xml
[Valgrind] build/debug_intel/test/valgrind.21992.memcheck.xml
[Valgrind] build/debug_intel/test/valgrind.21993.memcheck.xml
[Valgrind] build/debug_intel/test/valgrind.22023.memcheck.xml
[Valgrind] build/debug_intel/test/valgrind.22039.memcheck.xml
[Valgrind] build/debug_intel/test/valgrind.22295.memcheck.xml
[Valgrind] build/debug_intel/test/valgrind.22407.memcheck.xml
[Valgrind] build/debug_intel/test/valgrind.22500.memcheck.xml
[Valgrind] build/debug_intel/test/valgrind.22552.memcheck.xml
[Valgrind] build/debug_intel/test/valgrind.24210.memcheck.xml
[Valgrind] build/debug_intel/test/valgrind.2470.memcheck.xml
[Valgrind] build/debug_intel/test/valgrind.25212.memcheck.xml
[Valgrind] build/debug_intel/test/valgrind.2531.memcheck.xml
[Valgrind] build/debug_intel/test/valgrind.25736.memcheck.xml
[Valgrind] build/debug_intel/test/valgrind.26274.memcheck.xml
[Valgrind] build/debug_intel/test/valgrind.26343.memcheck.xml
[Valgrind] build/debug_intel/test/valgrind.26452.memcheck.xml
[Valgrind] build/debug_intel/test/valgrind.27053.memcheck.xml
[Valgrind] build/debug_intel/test/valgrind.27187.memcheck.xml
[Valgrind] build/debug_intel/test/valgrind.27873.memcheck.xml
[Valgrind] build/debug_intel/test/valgrind.27931.memcheck.xml
[Valgrind] build/debug_intel/test/valgrind.2800.memcheck.xml
[Valgrind] build/debug_intel/test/valgrind.28432.memcheck.xml
[Valgrind] build/debug_intel/test/valgrind.28460.memcheck.xml
[Valgrind] build/debug_intel/test/valgrind.28609.memcheck.xml
[Valgrind] build/debug_intel/test/valgrind.28715.memcheck.xml
[Valgrind] build/debug_intel/test/valgrind.28865.memcheck.xml
[Valgrind] build/debug_intel/test/valgrind.29047.memcheck.xml
[Valgrind] build/debug_intel/test/valgrind.29147.memcheck.xml
[Valgrind] build/debug_intel/test/valgrind.29350.memcheck.xml
[Valgrind] build/debug_intel/test/valgrind.3046.memcheck.xml
[Valgrind] build/debug_intel/test/valgrind.34172.memcheck.xml
[Valgrind] build/debug_intel/test/valgrind.3550.memcheck.xml
[Valgrind] build/debug_intel/test/valgrind.35833.memcheck.xml
[Valgrind] build/debug_intel/test/valgrind.36163.memcheck.xml
[Valgrind] build/debug_intel/test/valgrind.36210.memcheck.xml
[Valgrind] build/debug_intel/test/valgrind.3625.memcheck.xml
[Valgrind] build/debug_intel/test/valgrind.3629.memcheck.xml
[Valgrind] build/debug_intel/test/valgrind.36509.memcheck.xml
[Valgrind] build/debug_intel/test/valgrind.36686.memcheck.xml
[Valgrind] build/debug_intel/test/valgrind.37035.memcheck.xml
[Valgrind] build/debug_intel/test/valgrind.37101.memcheck.xml
[Valgrind] build/debug_intel/test/valgrind.37555.memcheck.xml
[Valgrind] build/debug_intel/test/valgrind.37979.memcheck.xml
[Valgrind] build/debug_intel/test/valgrind.38677.memcheck.xml
[Valgrind] build/debug_intel/test/valgrind.38905.memcheck.xml
[Valgrind] build/debug_intel/test/valgrind.39019.memcheck.xml
[Valgrind] build/debug_intel/test/valgrind.3915.memcheck.xml
[Valgrind] build/debug_intel/test/valgrind.39171.memcheck.xml
[Valgrind] build/debug_intel/test/valgrind.3926.memcheck.xml
[Valgrind] build/debug_intel/test/valgrind.3927.memcheck.xml
[Valgrind] build/debug_intel/test/valgrind.40258.memcheck.xml
[Valgrind] build/debug_intel/test/valgrind.40295.memcheck.xml
[Valgrind] build/debug_intel/test/valgrind.40311.memcheck.xml
[Valgrind] build/debug_intel/test/valgrind.40412.memcheck.xml
[Valgrind] build/debug_intel/test/valgrind.40587.memcheck.xml
[Valgrind] build/debug_intel/test/valgrind.40664.memcheck.xml
[Valgrind] build/debug_intel/test/valgrind.4095.memcheck.xml
[Valgrind] build/debug_intel/test/valgrind.4529.memcheck.xml
[Valgrind] build/debug_intel/test/valgrind.4581.memcheck.xml
[Valgrind] build/debug_intel/test/valgrind.4649.memcheck.xml
[Valgrind] build/debug_intel/test/valgrind.4713.memcheck.xml
[Valgrind] build/debug_intel/test/valgrind.4733.memcheck.xml
[Valgrind] build/debug_intel/test/valgrind.4954.memcheck.xml
[Valgrind] build/debug_intel/test/valgrind.5111.memcheck.xml
[Valgrind] build/debug_intel/test/valgrind.5233.memcheck.xml
[Valgrind] build/debug_intel/test/valgrind.5260.memcheck.xml
[Valgrind] build/debug_intel/test/valgrind.5406.memcheck.xml
[Valgrind] build/debug_intel/test/valgrind.5937.memcheck.xml
[Valgrind] build/debug_intel/test/valgrind.6012.memcheck.xml
[Valgrind] build/debug_intel/test/valgrind.6767.memcheck.xml
[Valgrind] build/debug_intel/test/valgrind.7521.memcheck.xml
[Valgrind] build/debug_intel/test/valgrind.7564.memcheck.xml
[Valgrind] build/debug_intel/test/valgrind.9096.memcheck.xml
[Valgrind] build/debug_intel/test/valgrind.9142.memcheck.xml
[Valgrind] build/debug_intel/test/valgrind.9187.memcheck.xml
[Valgrind] build/debug_intel/test/valgrind.9230.memcheck.xml
[Valgrind] build/debug_intel/test/valgrind.9254.memcheck.xml
[Valgrind] build/debug_intel/test/valgrind.9579.memcheck.xml
[Valgrind] build/debug_intel/test/valgrind.9680.memcheck.xml
[Valgrind] Copying build/debug_intel/test/valgrind.10277.memcheck.xml to /var/lib/jenkins/jobs/SANS_Weekly/configurations/axis-builddir/debug_intel/axis-buildnode/reynolds/builds/266/valgrind-plugin/valgrind-results/build/debug_intel/test/valgrind.10277.memcheck.xml
[Valgrind] Copying build/debug_intel/test/valgrind.10336.memcheck.xml to /var/lib/jenkins/jobs/SANS_Weekly/configurations/axis-builddir/debug_intel/axis-buildnode/reynolds/builds/266/valgrind-plugin/valgrind-results/build/debug_intel/test/valgrind.10336.memcheck.xml
[Valgrind] Copying build/debug_intel/test/valgrind.10415.memcheck.xml to /var/lib/jenkins/jobs/SANS_Weekly/configurations/axis-builddir/debug_intel/axis-buildnode/reynolds/builds/266/valgrind-plugin/valgrind-results/build/debug_intel/test/valgrind.10415.memcheck.xml
[Valgrind] Copying build/debug_intel/test/valgrind.10449.memcheck.xml to /var/lib/jenkins/jobs/SANS_Weekly/configurations/axis-builddir/debug_intel/axis-buildnode/reynolds/builds/266/valgrind-plugin/valgrind-results/build/debug_intel/test/valgrind.10449.memcheck.xml
[Valgrind] Copying build/debug_intel/test/valgrind.1125.memcheck.xml to /var/lib/jenkins/jobs/SANS_Weekly/configurations/axis-builddir/debug_intel/axis-buildnode/reynolds/builds/266/valgrind-plugin/valgrind-results/build/debug_intel/test/valgrind.1125.memcheck.xml
[Valgrind] Copying build/debug_intel/test/valgrind.11955.memcheck.xml to /var/lib/jenkins/jobs/SANS_Weekly/configurations/axis-builddir/debug_intel/axis-buildnode/reynolds/builds/266/valgrind-plugin/valgrind-results/build/debug_intel/test/valgrind.11955.memcheck.xml
[Valgrind] Copying build/debug_intel/test/valgrind.11991.memcheck.xml to /var/lib/jenkins/jobs/SANS_Weekly/configurations/axis-builddir/debug_intel/axis-buildnode/reynolds/builds/266/valgrind-plugin/valgrind-results/build/debug_intel/test/valgrind.11991.memcheck.xml
[Valgrind] Copying build/debug_intel/test/valgrind.12154.memcheck.xml to /var/lib/jenkins/jobs/SANS_Weekly/configurations/axis-builddir/debug_intel/axis-buildnode/reynolds/builds/266/valgrind-plugin/valgrind-results/build/debug_intel/test/valgrind.12154.memcheck.xml
[Valgrind] Copying build/debug_intel/test/valgrind.12577.memcheck.xml to /var/lib/jenkins/jobs/SANS_Weekly/configurations/axis-builddir/debug_intel/axis-buildnode/reynolds/builds/266/valgrind-plugin/valgrind-results/build/debug_intel/test/valgrind.12577.memcheck.xml
[Valgrind] Copying build/debug_intel/test/valgrind.12838.memcheck.xml to /var/lib/jenkins/jobs/SANS_Weekly/configurations/axis-builddir/debug_intel/axis-buildnode/reynolds/builds/266/valgrind-plugin/valgrind-results/build/debug_intel/test/valgrind.12838.memcheck.xml
[Valgrind] Copying build/debug_intel/test/valgrind.1293.memcheck.xml to /var/lib/jenkins/jobs/SANS_Weekly/configurations/axis-builddir/debug_intel/axis-buildnode/reynolds/builds/266/valgrind-plugin/valgrind-results/build/debug_intel/test/valgrind.1293.memcheck.xml
[Valgrind] Copying build/debug_intel/test/valgrind.14049.memcheck.xml to /var/lib/jenkins/jobs/SANS_Weekly/configurations/axis-builddir/debug_intel/axis-buildnode/reynolds/builds/266/valgrind-plugin/valgrind-results/build/debug_intel/test/valgrind.14049.memcheck.xml
[Valgrind] Copying build/debug_intel/test/valgrind.1596.memcheck.xml to /var/lib/jenkins/jobs/SANS_Weekly/configurations/axis-builddir/debug_intel/axis-buildnode/reynolds/builds/266/valgrind-plugin/valgrind-results/build/debug_intel/test/valgrind.1596.memcheck.xml
[Valgrind] Copying build/debug_intel/test/valgrind.16326.memcheck.xml to /var/lib/jenkins/jobs/SANS_Weekly/configurations/axis-builddir/debug_intel/axis-buildnode/reynolds/builds/266/valgrind-plugin/valgrind-results/build/debug_intel/test/valgrind.16326.memcheck.xml
[Valgrind] Copying build/debug_intel/test/valgrind.16426.memcheck.xml to /var/lib/jenkins/jobs/SANS_Weekly/configurations/axis-builddir/debug_intel/axis-buildnode/reynolds/builds/266/valgrind-plugin/valgrind-results/build/debug_intel/test/valgrind.16426.memcheck.xml
[Valgrind] Copying build/debug_intel/test/valgrind.16504.memcheck.xml to /var/lib/jenkins/jobs/SANS_Weekly/configurations/axis-builddir/debug_intel/axis-buildnode/reynolds/builds/266/valgrind-plugin/valgrind-results/build/debug_intel/test/valgrind.16504.memcheck.xml
[Valgrind] Copying build/debug_intel/test/valgrind.17035.memcheck.xml to /var/lib/jenkins/jobs/SANS_Weekly/configurations/axis-builddir/debug_intel/axis-buildnode/reynolds/builds/266/valgrind-plugin/valgrind-results/build/debug_intel/test/valgrind.17035.memcheck.xml
[Valgrind] Copying build/debug_intel/test/valgrind.17072.memcheck.xml to /var/lib/jenkins/jobs/SANS_Weekly/configurations/axis-builddir/debug_intel/axis-buildnode/reynolds/builds/266/valgrind-plugin/valgrind-results/build/debug_intel/test/valgrind.17072.memcheck.xml
[Valgrind] Copying build/debug_intel/test/valgrind.1831.memcheck.xml to /var/lib/jenkins/jobs/SANS_Weekly/configurations/axis-builddir/debug_intel/axis-buildnode/reynolds/builds/266/valgrind-plugin/valgrind-results/build/debug_intel/test/valgrind.1831.memcheck.xml
[Valgrind] Copying build/debug_intel/test/valgrind.19759.memcheck.xml to /var/lib/jenkins/jobs/SANS_Weekly/configurations/axis-builddir/debug_intel/axis-buildnode/reynolds/builds/266/valgrind-plugin/valgrind-results/build/debug_intel/test/valgrind.19759.memcheck.xml
[Valgrind] Copying build/debug_intel/test/valgrind.20037.memcheck.xml to /var/lib/jenkins/jobs/SANS_Weekly/configurations/axis-builddir/debug_intel/axis-buildnode/reynolds/builds/266/valgrind-plugin/valgrind-results/build/debug_intel/test/valgrind.20037.memcheck.xml
[Valgrind] Copying build/debug_intel/test/valgrind.20380.memcheck.xml to /var/lib/jenkins/jobs/SANS_Weekly/configurations/axis-builddir/debug_intel/axis-buildnode/reynolds/builds/266/valgrind-plugin/valgrind-results/build/debug_intel/test/valgrind.20380.memcheck.xml
[Valgrind] Copying build/debug_intel/test/valgrind.2159.memcheck.xml to /var/lib/jenkins/jobs/SANS_Weekly/configurations/axis-builddir/debug_intel/axis-buildnode/reynolds/builds/266/valgrind-plugin/valgrind-results/build/debug_intel/test/valgrind.2159.memcheck.xml
[Valgrind] Copying build/debug_intel/test/valgrind.2160.memcheck.xml to /var/lib/jenkins/jobs/SANS_Weekly/configurations/axis-builddir/debug_intel/axis-buildnode/reynolds/builds/266/valgrind-plugin/valgrind-results/build/debug_intel/test/valgrind.2160.memcheck.xml
[Valgrind] Copying build/debug_intel/test/valgrind.21758.memcheck.xml to /var/lib/jenkins/jobs/SANS_Weekly/configurations/axis-builddir/debug_intel/axis-buildnode/reynolds/builds/266/valgrind-plugin/valgrind-results/build/debug_intel/test/valgrind.21758.memcheck.xml
[Valgrind] Copying build/debug_intel/test/valgrind.21931.memcheck.xml to /var/lib/jenkins/jobs/SANS_Weekly/configurations/axis-builddir/debug_intel/axis-buildnode/reynolds/builds/266/valgrind-plugin/valgrind-results/build/debug_intel/test/valgrind.21931.memcheck.xml
[Valgrind] Copying build/debug_intel/test/valgrind.21957.memcheck.xml to /var/lib/jenkins/jobs/SANS_Weekly/configurations/axis-builddir/debug_intel/axis-buildnode/reynolds/builds/266/valgrind-plugin/valgrind-results/build/debug_intel/test/valgrind.21957.memcheck.xml
[Valgrind] Copying build/debug_intel/test/valgrind.21990.memcheck.xml to /var/lib/jenkins/jobs/SANS_Weekly/configurations/axis-builddir/debug_intel/axis-buildnode/reynolds/builds/266/valgrind-plugin/valgrind-results/build/debug_intel/test/valgrind.21990.memcheck.xml
[Valgrind] Copying build/debug_intel/test/valgrind.21992.memcheck.xml to /var/lib/jenkins/jobs/SANS_Weekly/configurations/axis-builddir/debug_intel/axis-buildnode/reynolds/builds/266/valgrind-plugin/valgrind-results/build/debug_intel/test/valgrind.21992.memcheck.xml
[Valgrind] Copying build/debug_intel/test/valgrind.21993.memcheck.xml to /var/lib/jenkins/jobs/SANS_Weekly/configurations/axis-builddir/debug_intel/axis-buildnode/reynolds/builds/266/valgrind-plugin/valgrind-results/build/debug_intel/test/valgrind.21993.memcheck.xml
[Valgrind] Copying build/debug_intel/test/valgrind.22023.memcheck.xml to /var/lib/jenkins/jobs/SANS_Weekly/configurations/axis-builddir/debug_intel/axis-buildnode/reynolds/builds/266/valgrind-plugin/valgrind-results/build/debug_intel/test/valgrind.22023.memcheck.xml
[Valgrind] Copying build/debug_intel/test/valgrind.22039.memcheck.xml to /var/lib/jenkins/jobs/SANS_Weekly/configurations/axis-builddir/debug_intel/axis-buildnode/reynolds/builds/266/valgrind-plugin/valgrind-results/build/debug_intel/test/valgrind.22039.memcheck.xml
[Valgrind] Copying build/debug_intel/test/valgrind.22295.memcheck.xml to /var/lib/jenkins/jobs/SANS_Weekly/configurations/axis-builddir/debug_intel/axis-buildnode/reynolds/builds/266/valgrind-plugin/valgrind-results/build/debug_intel/test/valgrind.22295.memcheck.xml
[Valgrind] Copying build/debug_intel/test/valgrind.22407.memcheck.xml to /var/lib/jenkins/jobs/SANS_Weekly/configurations/axis-builddir/debug_intel/axis-buildnode/reynolds/builds/266/valgrind-plugin/valgrind-results/build/debug_intel/test/valgrind.22407.memcheck.xml
[Valgrind] Copying build/debug_intel/test/valgrind.22500.memcheck.xml to /var/lib/jenkins/jobs/SANS_Weekly/configurations/axis-builddir/debug_intel/axis-buildnode/reynolds/builds/266/valgrind-plugin/valgrind-results/build/debug_intel/test/valgrind.22500.memcheck.xml
[Valgrind] Copying build/debug_intel/test/valgrind.22552.memcheck.xml to /var/lib/jenkins/jobs/SANS_Weekly/configurations/axis-builddir/debug_intel/axis-buildnode/reynolds/builds/266/valgrind-plugin/valgrind-results/build/debug_intel/test/valgrind.22552.memcheck.xml
[Valgrind] Copying build/debug_intel/test/valgrind.24210.memcheck.xml to /var/lib/jenkins/jobs/SANS_Weekly/configurations/axis-builddir/debug_intel/axis-buildnode/reynolds/builds/266/valgrind-plugin/valgrind-results/build/debug_intel/test/valgrind.24210.memcheck.xml
[Valgrind] Copying build/debug_intel/test/valgrind.2470.memcheck.xml to /var/lib/jenkins/jobs/SANS_Weekly/configurations/axis-builddir/debug_intel/axis-buildnode/reynolds/builds/266/valgrind-plugin/valgrind-results/build/debug_intel/test/valgrind.2470.memcheck.xml
[Valgrind] Copying build/debug_intel/test/valgrind.25212.memcheck.xml to /var/lib/jenkins/jobs/SANS_Weekly/configurations/axis-builddir/debug_intel/axis-buildnode/reynolds/builds/266/valgrind-plugin/valgrind-results/build/debug_intel/test/valgrind.25212.memcheck.xml
[Valgrind] Copying build/debug_intel/test/valgrind.2531.memcheck.xml to /var/lib/jenkins/jobs/SANS_Weekly/configurations/axis-builddir/debug_intel/axis-buildnode/reynolds/builds/266/valgrind-plugin/valgrind-results/build/debug_intel/test/valgrind.2531.memcheck.xml
[Valgrind] Copying build/debug_intel/test/valgrind.25736.memcheck.xml to /var/lib/jenkins/jobs/SANS_Weekly/configurations/axis-builddir/debug_intel/axis-buildnode/reynolds/builds/266/valgrind-plugin/valgrind-results/build/debug_intel/test/valgrind.25736.memcheck.xml
[Valgrind] Copying build/debug_intel/test/valgrind.26274.memcheck.xml to /var/lib/jenkins/jobs/SANS_Weekly/configurations/axis-builddir/debug_intel/axis-buildnode/reynolds/builds/266/valgrind-plugin/valgrind-results/build/debug_intel/test/valgrind.26274.memcheck.xml
[Valgrind] Copying build/debug_intel/test/valgrind.26343.memcheck.xml to /var/lib/jenkins/jobs/SANS_Weekly/configurations/axis-builddir/debug_intel/axis-buildnode/reynolds/builds/266/valgrind-plugin/valgrind-results/build/debug_intel/test/valgrind.26343.memcheck.xml
[Valgrind] Copying build/debug_intel/test/valgrind.26452.memcheck.xml to /var/lib/jenkins/jobs/SANS_Weekly/configurations/axis-builddir/debug_intel/axis-buildnode/reynolds/builds/266/valgrind-plugin/valgrind-results/build/debug_intel/test/valgrind.26452.memcheck.xml
[Valgrind] Copying build/debug_intel/test/valgrind.27053.memcheck.xml to /var/lib/jenkins/jobs/SANS_Weekly/configurations/axis-builddir/debug_intel/axis-buildnode/reynolds/builds/266/valgrind-plugin/valgrind-results/build/debug_intel/test/valgrind.27053.memcheck.xml
[Valgrind] Copying build/debug_intel/test/valgrind.27187.memcheck.xml to /var/lib/jenkins/jobs/SANS_Weekly/configurations/axis-builddir/debug_intel/axis-buildnode/reynolds/builds/266/valgrind-plugin/valgrind-results/build/debug_intel/test/valgrind.27187.memcheck.xml
[Valgrind] Copying build/debug_intel/test/valgrind.27873.memcheck.xml to /var/lib/jenkins/jobs/SANS_Weekly/configurations/axis-builddir/debug_intel/axis-buildnode/reynolds/builds/266/valgrind-plugin/valgrind-results/build/debug_intel/test/valgrind.27873.memcheck.xml
[Valgrind] Copying build/debug_intel/test/valgrind.27931.memcheck.xml to /var/lib/jenkins/jobs/SANS_Weekly/configurations/axis-builddir/debug_intel/axis-buildnode/reynolds/builds/266/valgrind-plugin/valgrind-results/build/debug_intel/test/valgrind.27931.memcheck.xml
[Valgrind] Copying build/debug_intel/test/valgrind.2800.memcheck.xml to /var/lib/jenkins/jobs/SANS_Weekly/configurations/axis-builddir/debug_intel/axis-buildnode/reynolds/builds/266/valgrind-plugin/valgrind-results/build/debug_intel/test/valgrind.2800.memcheck.xml
[Valgrind] Copying build/debug_intel/test/valgrind.28432.memcheck.xml to /var/lib/jenkins/jobs/SANS_Weekly/configurations/axis-builddir/debug_intel/axis-buildnode/reynolds/builds/266/valgrind-plugin/valgrind-results/build/debug_intel/test/valgrind.28432.memcheck.xml
[Valgrind] Copying build/debug_intel/test/valgrind.28460.memcheck.xml to /var/lib/jenkins/jobs/SANS_Weekly/configurations/axis-builddir/debug_intel/axis-buildnode/reynolds/builds/266/valgrind-plugin/valgrind-results/build/debug_intel/test/valgrind.28460.memcheck.xml
[Valgrind] Copying build/debug_intel/test/valgrind.28609.memcheck.xml to /var/lib/jenkins/jobs/SANS_Weekly/configurations/axis-builddir/debug_intel/axis-buildnode/reynolds/builds/266/valgrind-plugin/valgrind-results/build/debug_intel/test/valgrind.28609.memcheck.xml
[Valgrind] Copying build/debug_intel/test/valgrind.28715.memcheck.xml to /var/lib/jenkins/jobs/SANS_Weekly/configurations/axis-builddir/debug_intel/axis-buildnode/reynolds/builds/266/valgrind-plugin/valgrind-results/build/debug_intel/test/valgrind.28715.memcheck.xml
[Valgrind] Copying build/debug_intel/test/valgrind.28865.memcheck.xml to /var/lib/jenkins/jobs/SANS_Weekly/configurations/axis-builddir/debug_intel/axis-buildnode/reynolds/builds/266/valgrind-plugin/valgrind-results/build/debug_intel/test/valgrind.28865.memcheck.xml
[Valgrind] Copying build/debug_intel/test/valgrind.29047.memcheck.xml to /var/lib/jenkins/jobs/SANS_Weekly/configurations/axis-builddir/debug_intel/axis-buildnode/reynolds/builds/266/valgrind-plugin/valgrind-results/build/debug_intel/test/valgrind.29047.memcheck.xml
[Valgrind] Copying build/debug_intel/test/valgrind.29147.memcheck.xml to /var/lib/jenkins/jobs/SANS_Weekly/configurations/axis-builddir/debug_intel/axis-buildnode/reynolds/builds/266/valgrind-plugin/valgrind-results/build/debug_intel/test/valgrind.29147.memcheck.xml
[Valgrind] Copying build/debug_intel/test/valgrind.29350.memcheck.xml to /var/lib/jenkins/jobs/SANS_Weekly/configurations/axis-builddir/debug_intel/axis-buildnode/reynolds/builds/266/valgrind-plugin/valgrind-results/build/debug_intel/test/valgrind.29350.memcheck.xml
[Valgrind] Copying build/debug_intel/test/valgrind.3046.memcheck.xml to /var/lib/jenkins/jobs/SANS_Weekly/configurations/axis-builddir/debug_intel/axis-buildnode/reynolds/builds/266/valgrind-plugin/valgrind-results/build/debug_intel/test/valgrind.3046.memcheck.xml
[Valgrind] Copying build/debug_intel/test/valgrind.34172.memcheck.xml to /var/lib/jenkins/jobs/SANS_Weekly/configurations/axis-builddir/debug_intel/axis-buildnode/reynolds/builds/266/valgrind-plugin/valgrind-results/build/debug_intel/test/valgrind.34172.memcheck.xml
[Valgrind] Copying build/debug_intel/test/valgrind.3550.memcheck.xml to /var/lib/jenkins/jobs/SANS_Weekly/configurations/axis-builddir/debug_intel/axis-buildnode/reynolds/builds/266/valgrind-plugin/valgrind-results/build/debug_intel/test/valgrind.3550.memcheck.xml
[Valgrind] Copying build/debug_intel/test/valgrind.35833.memcheck.xml to /var/lib/jenkins/jobs/SANS_Weekly/configurations/axis-builddir/debug_intel/axis-buildnode/reynolds/builds/266/valgrind-plugin/valgrind-results/build/debug_intel/test/valgrind.35833.memcheck.xml
[Valgrind] Copying build/debug_intel/test/valgrind.36163.memcheck.xml to /var/lib/jenkins/jobs/SANS_Weekly/configurations/axis-builddir/debug_intel/axis-buildnode/reynolds/builds/266/valgrind-plugin/valgrind-results/build/debug_intel/test/valgrind.36163.memcheck.xml
[Valgrind] Copying build/debug_intel/test/valgrind.36210.memcheck.xml to /var/lib/jenkins/jobs/SANS_Weekly/configurations/axis-builddir/debug_intel/axis-buildnode/reynolds/builds/266/valgrind-plugin/valgrind-results/build/debug_intel/test/valgrind.36210.memcheck.xml
[Valgrind] Copying build/debug_intel/test/valgrind.3625.memcheck.xml to /var/lib/jenkins/jobs/SANS_Weekly/configurations/axis-builddir/debug_intel/axis-buildnode/reynolds/builds/266/valgrind-plugin/valgrind-results/build/debug_intel/test/valgrind.3625.memcheck.xml
[Valgrind] Copying build/debug_intel/test/valgrind.3629.memcheck.xml to /var/lib/jenkins/jobs/SANS_Weekly/configurations/axis-builddir/debug_intel/axis-buildnode/reynolds/builds/266/valgrind-plugin/valgrind-results/build/debug_intel/test/valgrind.3629.memcheck.xml
[Valgrind] Copying build/debug_intel/test/valgrind.36509.memcheck.xml to /var/lib/jenkins/jobs/SANS_Weekly/configurations/axis-builddir/debug_intel/axis-buildnode/reynolds/builds/266/valgrind-plugin/valgrind-results/build/debug_intel/test/valgrind.36509.memcheck.xml
[Valgrind] Copying build/debug_intel/test/valgrind.36686.memcheck.xml to /var/lib/jenkins/jobs/SANS_Weekly/configurations/axis-builddir/debug_intel/axis-buildnode/reynolds/builds/266/valgrind-plugin/valgrind-results/build/debug_intel/test/valgrind.36686.memcheck.xml
[Valgrind] Copying build/debug_intel/test/valgrind.37035.memcheck.xml to /var/lib/jenkins/jobs/SANS_Weekly/configurations/axis-builddir/debug_intel/axis-buildnode/reynolds/builds/266/valgrind-plugin/valgrind-results/build/debug_intel/test/valgrind.37035.memcheck.xml
[Valgrind] Copying build/debug_intel/test/valgrind.37101.memcheck.xml to /var/lib/jenkins/jobs/SANS_Weekly/configurations/axis-builddir/debug_intel/axis-buildnode/reynolds/builds/266/valgrind-plugin/valgrind-results/build/debug_intel/test/valgrind.37101.memcheck.xml
[Valgrind] Copying build/debug_intel/test/valgrind.37555.memcheck.xml to /var/lib/jenkins/jobs/SANS_Weekly/configurations/axis-builddir/debug_intel/axis-buildnode/reynolds/builds/266/valgrind-plugin/valgrind-results/build/debug_intel/test/valgrind.37555.memcheck.xml
[Valgrind] Copying build/debug_intel/test/valgrind.37979.memcheck.xml to /var/lib/jenkins/jobs/SANS_Weekly/configurations/axis-builddir/debug_intel/axis-buildnode/reynolds/builds/266/valgrind-plugin/valgrind-results/build/debug_intel/test/valgrind.37979.memcheck.xml
[Valgrind] Copying build/debug_intel/test/valgrind.38677.memcheck.xml to /var/lib/jenkins/jobs/SANS_Weekly/configurations/axis-builddir/debug_intel/axis-buildnode/reynolds/builds/266/valgrind-plugin/valgrind-results/build/debug_intel/test/valgrind.38677.memcheck.xml
[Valgrind] Copying build/debug_intel/test/valgrind.38905.memcheck.xml to /var/lib/jenkins/jobs/SANS_Weekly/configurations/axis-builddir/debug_intel/axis-buildnode/reynolds/builds/266/valgrind-plugin/valgrind-results/build/debug_intel/test/valgrind.38905.memcheck.xml
[Valgrind] Copying build/debug_intel/test/valgrind.39019.memcheck.xml to /var/lib/jenkins/jobs/SANS_Weekly/configurations/axis-builddir/debug_intel/axis-buildnode/reynolds/builds/266/valgrind-plugin/valgrind-results/build/debug_intel/test/valgrind.39019.memcheck.xml
[Valgrind] Copying build/debug_intel/test/valgrind.3915.memcheck.xml to /var/lib/jenkins/jobs/SANS_Weekly/configurations/axis-builddir/debug_intel/axis-buildnode/reynolds/builds/266/valgrind-plugin/valgrind-results/build/debug_intel/test/valgrind.3915.memcheck.xml
[Valgrind] Copying build/debug_intel/test/valgrind.39171.memcheck.xml to /var/lib/jenkins/jobs/SANS_Weekly/configurations/axis-builddir/debug_intel/axis-buildnode/reynolds/builds/266/valgrind-plugin/valgrind-results/build/debug_intel/test/valgrind.39171.memcheck.xml
[Valgrind] Copying build/debug_intel/test/valgrind.3926.memcheck.xml to /var/lib/jenkins/jobs/SANS_Weekly/configurations/axis-builddir/debug_intel/axis-buildnode/reynolds/builds/266/valgrind-plugin/valgrind-results/build/debug_intel/test/valgrind.3926.memcheck.xml
[Valgrind] Copying build/debug_intel/test/valgrind.3927.memcheck.xml to /var/lib/jenkins/jobs/SANS_Weekly/configurations/axis-builddir/debug_intel/axis-buildnode/reynolds/builds/266/valgrind-plugin/valgrind-results/build/debug_intel/test/valgrind.3927.memcheck.xml
[Valgrind] Copying build/debug_intel/test/valgrind.40258.memcheck.xml to /var/lib/jenkins/jobs/SANS_Weekly/configurations/axis-builddir/debug_intel/axis-buildnode/reynolds/builds/266/valgrind-plugin/valgrind-results/build/debug_intel/test/valgrind.40258.memcheck.xml
[Valgrind] Copying build/debug_intel/test/valgrind.40295.memcheck.xml to /var/lib/jenkins/jobs/SANS_Weekly/configurations/axis-builddir/debug_intel/axis-buildnode/reynolds/builds/266/valgrind-plugin/valgrind-results/build/debug_intel/test/valgrind.40295.memcheck.xml
[Valgrind] Copying build/debug_intel/test/valgrind.40311.memcheck.xml to /var/lib/jenkins/jobs/SANS_Weekly/configurations/axis-builddir/debug_intel/axis-buildnode/reynolds/builds/266/valgrind-plugin/valgrind-results/build/debug_intel/test/valgrind.40311.memcheck.xml
[Valgrind] Copying build/debug_intel/test/valgrind.40412.memcheck.xml to /var/lib/jenkins/jobs/SANS_Weekly/configurations/axis-builddir/debug_intel/axis-buildnode/reynolds/builds/266/valgrind-plugin/valgrind-results/build/debug_intel/test/valgrind.40412.memcheck.xml
[Valgrind] Copying build/debug_intel/test/valgrind.40587.memcheck.xml to /var/lib/jenkins/jobs/SANS_Weekly/configurations/axis-builddir/debug_intel/axis-buildnode/reynolds/builds/266/valgrind-plugin/valgrind-results/build/debug_intel/test/valgrind.40587.memcheck.xml
[Valgrind] Copying build/debug_intel/test/valgrind.40664.memcheck.xml to /var/lib/jenkins/jobs/SANS_Weekly/configurations/axis-builddir/debug_intel/axis-buildnode/reynolds/builds/266/valgrind-plugin/valgrind-results/build/debug_intel/test/valgrind.40664.memcheck.xml
[Valgrind] Copying build/debug_intel/test/valgrind.4095.memcheck.xml to /var/lib/jenkins/jobs/SANS_Weekly/configurations/axis-builddir/debug_intel/axis-buildnode/reynolds/builds/266/valgrind-plugin/valgrind-results/build/debug_intel/test/valgrind.4095.memcheck.xml
[Valgrind] Copying build/debug_intel/test/valgrind.4529.memcheck.xml to /var/lib/jenkins/jobs/SANS_Weekly/configurations/axis-builddir/debug_intel/axis-buildnode/reynolds/builds/266/valgrind-plugin/valgrind-results/build/debug_intel/test/valgrind.4529.memcheck.xml
[Valgrind] Copying build/debug_intel/test/valgrind.4581.memcheck.xml to /var/lib/jenkins/jobs/SANS_Weekly/configurations/axis-builddir/debug_intel/axis-buildnode/reynolds/builds/266/valgrind-plugin/valgrind-results/build/debug_intel/test/valgrind.4581.memcheck.xml
[Valgrind] Copying build/debug_intel/test/valgrind.4649.memcheck.xml to /var/lib/jenkins/jobs/SANS_Weekly/configurations/axis-builddir/debug_intel/axis-buildnode/reynolds/builds/266/valgrind-plugin/valgrind-results/build/debug_intel/test/valgrind.4649.memcheck.xml
[Valgrind] Copying build/debug_intel/test/valgrind.4713.memcheck.xml to /var/lib/jenkins/jobs/SANS_Weekly/configurations/axis-builddir/debug_intel/axis-buildnode/reynolds/builds/266/valgrind-plugin/valgrind-results/build/debug_intel/test/valgrind.4713.memcheck.xml
[Valgrind] Copying build/debug_intel/test/valgrind.4733.memcheck.xml to /var/lib/jenkins/jobs/SANS_Weekly/configurations/axis-builddir/debug_intel/axis-buildnode/reynolds/builds/266/valgrind-plugin/valgrind-results/build/debug_intel/test/valgrind.4733.memcheck.xml
[Valgrind] Copying build/debug_intel/test/valgrind.4954.memcheck.xml to /var/lib/jenkins/jobs/SANS_Weekly/configurations/axis-builddir/debug_intel/axis-buildnode/reynolds/builds/266/valgrind-plugin/valgrind-results/build/debug_intel/test/valgrind.4954.memcheck.xml
[Valgrind] Copying build/debug_intel/test/valgrind.5111.memcheck.xml to /var/lib/jenkins/jobs/SANS_Weekly/configurations/axis-builddir/debug_intel/axis-buildnode/reynolds/builds/266/valgrind-plugin/valgrind-results/build/debug_intel/test/valgrind.5111.memcheck.xml
[Valgrind] Copying build/debug_intel/test/valgrind.5233.memcheck.xml to /var/lib/jenkins/jobs/SANS_Weekly/configurations/axis-builddir/debug_intel/axis-buildnode/reynolds/builds/266/valgrind-plugin/valgrind-results/build/debug_intel/test/valgrind.5233.memcheck.xml
[Valgrind] Copying build/debug_intel/test/valgrind.5260.memcheck.xml to /var/lib/jenkins/jobs/SANS_Weekly/configurations/axis-builddir/debug_intel/axis-buildnode/reynolds/builds/266/valgrind-plugin/valgrind-results/build/debug_intel/test/valgrind.5260.memcheck.xml
[Valgrind] Copying build/debug_intel/test/valgrind.5406.memcheck.xml to /var/lib/jenkins/jobs/SANS_Weekly/configurations/axis-builddir/debug_intel/axis-buildnode/reynolds/builds/266/valgrind-plugin/valgrind-results/build/debug_intel/test/valgrind.5406.memcheck.xml
[Valgrind] Copying build/debug_intel/test/valgrind.5937.memcheck.xml to /var/lib/jenkins/jobs/SANS_Weekly/configurations/axis-builddir/debug_intel/axis-buildnode/reynolds/builds/266/valgrind-plugin/valgrind-results/build/debug_intel/test/valgrind.5937.memcheck.xml
[Valgrind] Copying build/debug_intel/test/valgrind.6012.memcheck.xml to /var/lib/jenkins/jobs/SANS_Weekly/configurations/axis-builddir/debug_intel/axis-buildnode/reynolds/builds/266/valgrind-plugin/valgrind-results/build/debug_intel/test/valgrind.6012.memcheck.xml
[Valgrind] Copying build/debug_intel/test/valgrind.6767.memcheck.xml to /var/lib/jenkins/jobs/SANS_Weekly/configurations/axis-builddir/debug_intel/axis-buildnode/reynolds/builds/266/valgrind-plugin/valgrind-results/build/debug_intel/test/valgrind.6767.memcheck.xml
[Valgrind] Copying build/debug_intel/test/valgrind.7521.memcheck.xml to /var/lib/jenkins/jobs/SANS_Weekly/configurations/axis-builddir/debug_intel/axis-buildnode/reynolds/builds/266/valgrind-plugin/valgrind-results/build/debug_intel/test/valgrind.7521.memcheck.xml
[Valgrind] Copying build/debug_intel/test/valgrind.7564.memcheck.xml to /var/lib/jenkins/jobs/SANS_Weekly/configurations/axis-builddir/debug_intel/axis-buildnode/reynolds/builds/266/valgrind-plugin/valgrind-results/build/debug_intel/test/valgrind.7564.memcheck.xml
[Valgrind] Copying build/debug_intel/test/valgrind.9096.memcheck.xml to /var/lib/jenkins/jobs/SANS_Weekly/configurations/axis-builddir/debug_intel/axis-buildnode/reynolds/builds/266/valgrind-plugin/valgrind-results/build/debug_intel/test/valgrind.9096.memcheck.xml
[Valgrind] Copying build/debug_intel/test/valgrind.9142.memcheck.xml to /var/lib/jenkins/jobs/SANS_Weekly/configurations/axis-builddir/debug_intel/axis-buildnode/reynolds/builds/266/valgrind-plugin/valgrind-results/build/debug_intel/test/valgrind.9142.memcheck.xml
[Valgrind] Copying build/debug_intel/test/valgrind.9187.memcheck.xml to /var/lib/jenkins/jobs/SANS_Weekly/configurations/axis-builddir/debug_intel/axis-buildnode/reynolds/builds/266/valgrind-plugin/valgrind-results/build/debug_intel/test/valgrind.9187.memcheck.xml
[Valgrind] Copying build/debug_intel/test/valgrind.9230.memcheck.xml to /var/lib/jenkins/jobs/SANS_Weekly/configurations/axis-builddir/debug_intel/axis-buildnode/reynolds/builds/266/valgrind-plugin/valgrind-results/build/debug_intel/test/valgrind.9230.memcheck.xml
[Valgrind] Copying build/debug_intel/test/valgrind.9254.memcheck.xml to /var/lib/jenkins/jobs/SANS_Weekly/configurations/axis-builddir/debug_intel/axis-buildnode/reynolds/builds/266/valgrind-plugin/valgrind-results/build/debug_intel/test/valgrind.9254.memcheck.xml
[Valgrind] Copying build/debug_intel/test/valgrind.9579.memcheck.xml to /var/lib/jenkins/jobs/SANS_Weekly/configurations/axis-builddir/debug_intel/axis-buildnode/reynolds/builds/266/valgrind-plugin/valgrind-results/build/debug_intel/test/valgrind.9579.memcheck.xml
[Valgrind] Copying build/debug_intel/test/valgrind.9680.memcheck.xml to /var/lib/jenkins/jobs/SANS_Weekly/configurations/axis-builddir/debug_intel/axis-buildnode/reynolds/builds/266/valgrind-plugin/valgrind-results/build/debug_intel/test/valgrind.9680.memcheck.xml
[Valgrind] Analysing valgrind results
[Valgrind] workspacePath: /jenkins/workspace/SANS_Weekly/builddir/debug_intel/buildnode/reynolds/
[Valgrind] Ending the valgrind analysis.
INFO: Starting to record.
INFO: Processing CTest-Version 3.x (default)
INFO: [CTest-Version 3.x (default)] - 1 test report file(s) were found with the pattern 'build/Test*.xml' relative to '/jenkins/workspace/SANS_Weekly/builddir/debug_intel/buildnode/reynolds' for the testing framework 'CTest-Version 3.x (default)'.
INFO: Check 'Failed Tests' threshold.
INFO: The total number of tests for the threshold 'Failed Tests' exceeds the specified "failure threshold" value.
INFO: Setting the build status to FAILURE
INFO: Stopping recording.
[PostBuildScript] - [INFO] Executing post build scripts.
[PostBuildScript] - [INFO] Build does not have any of the results []. Did not execute build step #0.
[Checks API] No suitable checks publisher found.
[WS-CLEANUP] Deleting project workspace...
[WS-CLEANUP] Deferred wipeout is used...
[WS-CLEANUP] done
Finished: FAILURE