Console Output

Skipping 424 KB.. Full Log
[ 51%] Generating CXX prefix header src/pde/IncompressibleNS/cotire/IncompressibleNSLib_CXX_prefix.hxx
[ 51%] Building CXX precompiled header src/pde/IncompressibleNS/cotire/IncompressibleNSLib_CXX_prefix.hxx.gch
Scanning dependencies of target IncompressibleNSLib
[ 51%] Building CXX object src/pde/IncompressibleNS/CMakeFiles/IncompressibleNSLib.dir/BCIncompressibleNavierStokes1DChannel.cpp.o
[ 51%] Building CXX object src/pde/IncompressibleNS/CMakeFiles/IncompressibleNSLib.dir/BCIncompressibleRANSSA1DChannel.cpp.o
[ 51%] Building CXX object src/pde/IncompressibleNS/CMakeFiles/IncompressibleNSLib.dir/SolutionFunction_IncompressibleRANSSA1DChannel.cpp.o
[ 51%] Linking CXX static library libIncompressibleNSLib.a
[ 51%] Built target IncompressibleNSLib
Scanning dependencies of target FunctionalCell_Galerkin_btest_build_vera
[ 51%] Checking style of test/unit/Discretization/Galerkin/FunctionalCell_Galerkin_btest.cpp
[ 51%] Built target FunctionalCell_Galerkin_btest_build_vera
Scanning dependencies of target FunctionalCell_Galerkin_btest_OBJECT
[ 51%] Building CXX object test/unit/Discretization/Galerkin/CMakeFiles/FunctionalCell_Galerkin_btest_OBJECT.dir/FunctionalCell_Galerkin_btest.cpp.o
[ 51%] Built target FunctionalCell_Galerkin_btest_OBJECT
Scanning dependencies of target FunctionalCell_Galerkin_btest_build
[ 51%] Linking CXX executable FunctionalCell_Galerkin_btest
[ 51%] Built target FunctionalCell_Galerkin_btest_build
Scanning dependencies of target IntegrandCell_Galerkin_Stabilized_AD_btest_build_vera
[ 51%] Checking style of test/unit/Discretization/Galerkin/IntegrandCell_Galerkin_Stabilized_AD_btest.cpp
[ 51%] Built target IntegrandCell_Galerkin_Stabilized_AD_btest_build_vera
Scanning dependencies of target IntegrandCell_Galerkin_Stabilized_AD_btest_OBJECT
[ 51%] Building CXX object test/unit/Discretization/Galerkin/CMakeFiles/IntegrandCell_Galerkin_Stabilized_AD_btest_OBJECT.dir/IntegrandCell_Galerkin_Stabilized_AD_btest.cpp.o
[ 51%] Built target IntegrandCell_Galerkin_Stabilized_AD_btest_OBJECT
Scanning dependencies of target IntegrandCell_Galerkin_Stabilized_AD_btest_build
[ 51%] Linking CXX executable IntegrandCell_Galerkin_Stabilized_AD_btest
[ 51%] Built target IntegrandCell_Galerkin_Stabilized_AD_btest_build
Scanning dependencies of target FunctionalBoundaryTrace_Galerkin_btest_build_vera
[ 51%] Checking style of test/unit/Discretization/Galerkin/FunctionalBoundaryTrace_Galerkin_btest.cpp
[ 51%] Built target FunctionalBoundaryTrace_Galerkin_btest_build_vera
Scanning dependencies of target FunctionalBoundaryTrace_Galerkin_btest_OBJECT
[ 51%] Building CXX object test/unit/Discretization/Galerkin/CMakeFiles/FunctionalBoundaryTrace_Galerkin_btest_OBJECT.dir/FunctionalBoundaryTrace_Galerkin_btest.cpp.o
[ 51%] Built target FunctionalBoundaryTrace_Galerkin_btest_OBJECT
Scanning dependencies of target FunctionalBoundaryTrace_Galerkin_btest_build
[ 51%] Linking CXX executable FunctionalBoundaryTrace_Galerkin_btest
[ 51%] Built target FunctionalBoundaryTrace_Galerkin_btest_build
Scanning dependencies of target IntegrandCell_Project_btest_OBJECT
[ 51%] Building CXX object test/unit/Discretization/Galerkin/CMakeFiles/IntegrandCell_Project_btest_OBJECT.dir/IntegrandCell_Project_btest.cpp.o
[ 51%] Built target IntegrandCell_Project_btest_OBJECT
Scanning dependencies of target IntegrandCell_Project_btest_build_vera
[ 51%] Checking style of test/unit/Discretization/Galerkin/IntegrandCell_Project_btest.cpp
[ 51%] Built target IntegrandCell_Project_btest_build_vera
Scanning dependencies of target IntegrandCell_Project_btest_build
[ 51%] Linking CXX executable IntegrandCell_Project_btest
[ 51%] Built target IntegrandCell_Project_btest_build
Scanning dependencies of target FunctionalBoundaryTrace_WeightedResidual_Galerkin_btest_OBJECT
[ 51%] Building CXX object test/unit/Discretization/Galerkin/CMakeFiles/FunctionalBoundaryTrace_WeightedResidual_Galerkin_btest_OBJECT.dir/FunctionalBoundaryTrace_WeightedResidual_Galerkin_btest.cpp.o
[ 51%] Built target FunctionalBoundaryTrace_WeightedResidual_Galerkin_btest_OBJECT
Scanning dependencies of target FunctionalBoundaryTrace_WeightedResidual_Galerkin_btest_build_vera
[ 51%] Checking style of test/unit/Discretization/Galerkin/FunctionalBoundaryTrace_WeightedResidual_Galerkin_btest.cpp
[ 51%] Built target FunctionalBoundaryTrace_WeightedResidual_Galerkin_btest_build_vera
Scanning dependencies of target FunctionalBoundaryTrace_WeightedResidual_Galerkin_btest_build
[ 51%] Linking CXX executable FunctionalBoundaryTrace_WeightedResidual_Galerkin_btest
[ 51%] Built target FunctionalBoundaryTrace_WeightedResidual_Galerkin_btest_build
Scanning dependencies of target IntegrandBoundaryTrace_Dirichlet_Galerkin_HSM2D_btest_OBJECT
[ 51%] Building CXX object test/unit/Discretization/Galerkin/CMakeFiles/IntegrandBoundaryTrace_Dirichlet_Galerkin_HSM2D_btest_OBJECT.dir/IntegrandBoundaryTrace_Dirichlet_Galerkin_HSM2D_btest.cpp.o
[ 51%] Built target IntegrandBoundaryTrace_Dirichlet_Galerkin_HSM2D_btest_OBJECT
Scanning dependencies of target IntegrandBoundaryTrace_Dirichlet_Galerkin_HSM2D_btest_build_vera
[ 51%] Checking style of test/unit/Discretization/Galerkin/IntegrandBoundaryTrace_Dirichlet_Galerkin_HSM2D_btest.cpp
[ 51%] Built target IntegrandBoundaryTrace_Dirichlet_Galerkin_HSM2D_btest_build_vera
Scanning dependencies of target IntegrandBoundaryTrace_Dirichlet_Galerkin_HSM2D_btest_build
[ 51%] Linking CXX executable IntegrandBoundaryTrace_Dirichlet_Galerkin_HSM2D_btest
[ 51%] Built target IntegrandBoundaryTrace_Dirichlet_Galerkin_HSM2D_btest_build
Scanning dependencies of target JacobianCell_Galerkin_Stabilized_NS_btest_OBJECT
[ 51%] Building CXX object test/unit/Discretization/Galerkin/CMakeFiles/JacobianCell_Galerkin_Stabilized_NS_btest_OBJECT.dir/JacobianCell_Galerkin_Stabilized_NS_btest.cpp.o
[ 51%] Built target JacobianCell_Galerkin_Stabilized_NS_btest_OBJECT
Scanning dependencies of target JacobianCell_Galerkin_Stabilized_NS_btest_build_vera
[ 51%] Checking style of test/unit/Discretization/Galerkin/JacobianCell_Galerkin_Stabilized_NS_btest.cpp
[ 51%] Built target JacobianCell_Galerkin_Stabilized_NS_btest_build_vera
Scanning dependencies of target JacobianCell_Galerkin_Stabilized_NS_btest_build
[ 51%] Linking CXX executable JacobianCell_Galerkin_Stabilized_NS_btest
[ 51%] Built target JacobianCell_Galerkin_Stabilized_NS_btest_build
Scanning dependencies of target ResidualCell_Galerkin_ShallowWater1D_btest_build_vera
[ 51%] Checking style of test/unit/Discretization/Galerkin/ResidualCell_Galerkin_ShallowWater1D_btest.cpp
[ 51%] Built target ResidualCell_Galerkin_ShallowWater1D_btest_build_vera
Scanning dependencies of target ResidualCell_Galerkin_ShallowWater1D_btest_OBJECT
[ 51%] Building CXX object test/unit/Discretization/Galerkin/CMakeFiles/ResidualCell_Galerkin_ShallowWater1D_btest_OBJECT.dir/ResidualCell_Galerkin_ShallowWater1D_btest.cpp.o
[ 51%] Built target ResidualCell_Galerkin_ShallowWater1D_btest_OBJECT
Scanning dependencies of target ResidualCell_Galerkin_ShallowWater1D_btest_build
[ 51%] Linking CXX executable ResidualCell_Galerkin_ShallowWater1D_btest
[ 51%] Built target ResidualCell_Galerkin_ShallowWater1D_btest_build
Scanning dependencies of target JacobianInteriorTrace_Galerkin_AD_btest_OBJECT
[ 53%] Building CXX object test/unit/Discretization/Galerkin/CMakeFiles/JacobianInteriorTrace_Galerkin_AD_btest_OBJECT.dir/JacobianInteriorTrace_Galerkin_AD_btest.cpp.o
[ 53%] Built target JacobianInteriorTrace_Galerkin_AD_btest_OBJECT
Scanning dependencies of target JacobianInteriorTrace_Galerkin_AD_btest_build_vera
[ 53%] Checking style of test/unit/Discretization/Galerkin/JacobianInteriorTrace_Galerkin_AD_btest.cpp
[ 53%] Built target JacobianInteriorTrace_Galerkin_AD_btest_build_vera
Scanning dependencies of target JacobianInteriorTrace_Galerkin_AD_btest_build
[ 53%] Linking CXX executable JacobianInteriorTrace_Galerkin_AD_btest
[ 53%] Built target JacobianInteriorTrace_Galerkin_AD_btest_build
Scanning dependencies of target IntegrandBoundaryTrace_Robin_sansLG_Galerkin_IncRANSSA_btest_OBJECT
[ 53%] Building CXX object test/unit/Discretization/Galerkin/CMakeFiles/IntegrandBoundaryTrace_Robin_sansLG_Galerkin_IncRANSSA_btest_OBJECT.dir/IntegrandBoundaryTrace_Robin_sansLG_Galerkin_IncRANSSA_btest.cpp.o
[ 53%] Built target IntegrandBoundaryTrace_Robin_sansLG_Galerkin_IncRANSSA_btest_OBJECT
Scanning dependencies of target IntegrandBoundaryTrace_Robin_sansLG_Galerkin_IncRANSSA_btest_build_vera
[ 53%] Checking style of test/unit/Discretization/Galerkin/IntegrandBoundaryTrace_Robin_sansLG_Galerkin_IncRANSSA_btest.cpp
[ 53%] Built target IntegrandBoundaryTrace_Robin_sansLG_Galerkin_IncRANSSA_btest_build_vera
Scanning dependencies of target IntegrandBoundaryTrace_Robin_sansLG_Galerkin_IncRANSSA_btest_build
[ 53%] Linking CXX executable IntegrandBoundaryTrace_Robin_sansLG_Galerkin_IncRANSSA_btest
[ 53%] Built target IntegrandBoundaryTrace_Robin_sansLG_Galerkin_IncRANSSA_btest_build
Scanning dependencies of target IntegrandBoundaryTrace_Robin_sansLG_Galerkin_IncNS_btest_OBJECT
[ 53%] Building CXX object test/unit/Discretization/Galerkin/CMakeFiles/IntegrandBoundaryTrace_Robin_sansLG_Galerkin_IncNS_btest_OBJECT.dir/IntegrandBoundaryTrace_Robin_sansLG_Galerkin_IncNS_btest.cpp.o
[ 53%] Built target IntegrandBoundaryTrace_Robin_sansLG_Galerkin_IncNS_btest_OBJECT
Scanning dependencies of target IntegrandBoundaryTrace_Robin_sansLG_Galerkin_IncNS_btest_build_vera
[ 53%] Checking style of test/unit/Discretization/Galerkin/IntegrandBoundaryTrace_Robin_sansLG_Galerkin_IncNS_btest.cpp
[ 53%] Built target IntegrandBoundaryTrace_Robin_sansLG_Galerkin_IncNS_btest_build_vera
Scanning dependencies of target IntegrandBoundaryTrace_Robin_sansLG_Galerkin_IncNS_btest_build
[ 53%] Linking CXX executable IntegrandBoundaryTrace_Robin_sansLG_Galerkin_IncNS_btest
[ 53%] Built target IntegrandBoundaryTrace_Robin_sansLG_Galerkin_IncNS_btest_build
Scanning dependencies of target isValidStateInteriorTrace_Euler_btest_build_vera
[ 53%] Checking style of test/unit/Discretization/Galerkin/isValidStateInteriorTrace_Euler_btest.cpp
[ 53%] Built target isValidStateInteriorTrace_Euler_btest_build_vera
Scanning dependencies of target isValidStateInteriorTrace_Euler_btest_OBJECT
[ 53%] Building CXX object test/unit/Discretization/Galerkin/CMakeFiles/isValidStateInteriorTrace_Euler_btest_OBJECT.dir/isValidStateInteriorTrace_Euler_btest.cpp.o
[ 53%] Built target isValidStateInteriorTrace_Euler_btest_OBJECT
Scanning dependencies of target isValidStateInteriorTrace_Euler_btest_build
[ 53%] Linking CXX executable isValidStateInteriorTrace_Euler_btest
[ 53%] Built target isValidStateInteriorTrace_Euler_btest_build
Scanning dependencies of target ResidualInteriorTrace_Galerkin_CR_btest_OBJECT
[ 53%] Building CXX object test/unit/Discretization/Galerkin/CMakeFiles/ResidualInteriorTrace_Galerkin_CR_btest_OBJECT.dir/ResidualInteriorTrace_Galerkin_CR_btest.cpp.o
[ 53%] Built target ResidualInteriorTrace_Galerkin_CR_btest_OBJECT
Scanning dependencies of target ResidualInteriorTrace_Galerkin_CR_btest_build_vera
[ 53%] Checking style of test/unit/Discretization/Galerkin/ResidualInteriorTrace_Galerkin_CR_btest.cpp
[ 53%] Built target ResidualInteriorTrace_Galerkin_CR_btest_build_vera
Scanning dependencies of target ResidualInteriorTrace_Galerkin_CR_btest_build
[ 53%] Linking CXX executable ResidualInteriorTrace_Galerkin_CR_btest
[ 53%] Built target ResidualInteriorTrace_Galerkin_CR_btest_build
Scanning dependencies of target UpdateFraction_Euler_btest_build_vera
[ 53%] Checking style of test/unit/Discretization/Galerkin/UpdateFraction_Euler_btest.cpp
[ 53%] Built target UpdateFraction_Euler_btest_build_vera
Scanning dependencies of target UpdateFraction_Euler_btest_OBJECT
[ 53%] Building CXX object test/unit/Discretization/Galerkin/CMakeFiles/UpdateFraction_Euler_btest_OBJECT.dir/UpdateFraction_Euler_btest.cpp.o
[ 53%] Built target UpdateFraction_Euler_btest_OBJECT
Scanning dependencies of target UpdateFraction_Euler_btest_build
[ 53%] Linking CXX executable UpdateFraction_Euler_btest
[ 53%] Built target UpdateFraction_Euler_btest_build
Scanning dependencies of target ResidualCell_Galerkin_IRS_AD_btest_build_vera
[ 53%] Checking style of test/unit/Discretization/Galerkin/ResidualCell_Galerkin_IRS_AD_btest.cpp
[ 53%] Built target ResidualCell_Galerkin_IRS_AD_btest_build_vera
Scanning dependencies of target ResidualCell_Galerkin_IRS_AD_btest_OBJECT
[ 53%] Building CXX object test/unit/Discretization/Galerkin/CMakeFiles/ResidualCell_Galerkin_IRS_AD_btest_OBJECT.dir/ResidualCell_Galerkin_IRS_AD_btest.cpp.o
[ 53%] Built target ResidualCell_Galerkin_IRS_AD_btest_OBJECT
Scanning dependencies of target ResidualCell_Galerkin_IRS_AD_btest_build
[ 53%] Linking CXX executable ResidualCell_Galerkin_IRS_AD_btest
[ 53%] Built target ResidualCell_Galerkin_IRS_AD_btest_build
Scanning dependencies of target JacobianCell_Galerkin_PTC_AD_btest_OBJECT
[ 53%] Building CXX object test/unit/Discretization/Galerkin/CMakeFiles/JacobianCell_Galerkin_PTC_AD_btest_OBJECT.dir/JacobianCell_Galerkin_PTC_AD_btest.cpp.o
[ 53%] Built target JacobianCell_Galerkin_PTC_AD_btest_OBJECT
Scanning dependencies of target JacobianCell_Galerkin_PTC_AD_btest_build_vera
[ 53%] Checking style of test/unit/Discretization/Galerkin/JacobianCell_Galerkin_PTC_AD_btest.cpp
[ 53%] Built target JacobianCell_Galerkin_PTC_AD_btest_build_vera
Scanning dependencies of target JacobianCell_Galerkin_PTC_AD_btest_build
[ 53%] Linking CXX executable JacobianCell_Galerkin_PTC_AD_btest
[ 53%] Built target JacobianCell_Galerkin_PTC_AD_btest_build
Scanning dependencies of target ResidualBoundaryTrace_LinearScalar_mitLG_Galerkin_AD_btest_OBJECT
[ 53%] Building CXX object test/unit/Discretization/Galerkin/CMakeFiles/ResidualBoundaryTrace_LinearScalar_mitLG_Galerkin_AD_btest_OBJECT.dir/ResidualBoundaryTrace_LinearScalar_mitLG_Galerkin_AD_btest.cpp.o
[ 53%] Built target ResidualBoundaryTrace_LinearScalar_mitLG_Galerkin_AD_btest_OBJECT
Scanning dependencies of target ResidualBoundaryTrace_LinearScalar_mitLG_Galerkin_AD_btest_build_vera
[ 53%] Checking style of test/unit/Discretization/Galerkin/ResidualBoundaryTrace_LinearScalar_mitLG_Galerkin_AD_btest.cpp
[ 53%] Built target ResidualBoundaryTrace_LinearScalar_mitLG_Galerkin_AD_btest_build_vera
Scanning dependencies of target ResidualBoundaryTrace_LinearScalar_mitLG_Galerkin_AD_btest_build
[ 53%] Linking CXX executable ResidualBoundaryTrace_LinearScalar_mitLG_Galerkin_AD_btest
[ 53%] Built target ResidualBoundaryTrace_LinearScalar_mitLG_Galerkin_AD_btest_build
Scanning dependencies of target IntegrandBoundaryTrace_Flux_mitState_Nitsche_AD_btest_OBJECT
[ 53%] Building CXX object test/unit/Discretization/Galerkin/CMakeFiles/IntegrandBoundaryTrace_Flux_mitState_Nitsche_AD_btest_OBJECT.dir/IntegrandBoundaryTrace_Flux_mitState_Nitsche_AD_btest.cpp.o
[ 53%] Built target IntegrandBoundaryTrace_Flux_mitState_Nitsche_AD_btest_OBJECT
Scanning dependencies of target IntegrandBoundaryTrace_Flux_mitState_Nitsche_AD_btest_build_vera
[ 53%] Checking style of test/unit/Discretization/Galerkin/IntegrandBoundaryTrace_Flux_mitState_Nitsche_AD_btest.cpp
[ 53%] Built target IntegrandBoundaryTrace_Flux_mitState_Nitsche_AD_btest_build_vera
Scanning dependencies of target IntegrandBoundaryTrace_Flux_mitState_Nitsche_AD_btest_build
[ 53%] Linking CXX executable IntegrandBoundaryTrace_Flux_mitState_Nitsche_AD_btest
[ 53%] Built target IntegrandBoundaryTrace_Flux_mitState_Nitsche_AD_btest_build
Scanning dependencies of target IntegrandCell_Galerkin_Output_AD_btest_build_vera
[ 53%] Checking style of test/unit/Discretization/Galerkin/IntegrandCell_Galerkin_Output_AD_btest.cpp
[ 53%] Built target IntegrandCell_Galerkin_Output_AD_btest_build_vera
Scanning dependencies of target IntegrandCell_Galerkin_Output_AD_btest_OBJECT
[ 53%] Building CXX object test/unit/Discretization/Galerkin/CMakeFiles/IntegrandCell_Galerkin_Output_AD_btest_OBJECT.dir/IntegrandCell_Galerkin_Output_AD_btest.cpp.o
[ 53%] Built target IntegrandCell_Galerkin_Output_AD_btest_OBJECT
Scanning dependencies of target IntegrandCell_Galerkin_Output_AD_btest_build
[ 53%] Linking CXX executable IntegrandCell_Galerkin_Output_AD_btest
[ 53%] Built target IntegrandCell_Galerkin_Output_AD_btest_build
Scanning dependencies of target IntegrandCell_Galerkin_Stabilized_Corrected_AD_btest_build_vera
[ 53%] Checking style of test/unit/Discretization/Galerkin/IntegrandCell_Galerkin_Stabilized_Corrected_AD_btest.cpp
[ 53%] Built target IntegrandCell_Galerkin_Stabilized_Corrected_AD_btest_build_vera
Scanning dependencies of target IntegrandCell_Galerkin_Stabilized_Corrected_AD_btest_OBJECT
[ 53%] Building CXX object test/unit/Discretization/Galerkin/CMakeFiles/IntegrandCell_Galerkin_Stabilized_Corrected_AD_btest_OBJECT.dir/IntegrandCell_Galerkin_Stabilized_Corrected_AD_btest.cpp.o
[ 53%] Built target IntegrandCell_Galerkin_Stabilized_Corrected_AD_btest_OBJECT
Scanning dependencies of target IntegrandCell_Galerkin_Stabilized_Corrected_AD_btest_build
[ 53%] Linking CXX executable IntegrandCell_Galerkin_Stabilized_Corrected_AD_btest
[ 53%] Built target IntegrandCell_Galerkin_Stabilized_Corrected_AD_btest_build
Scanning dependencies of target IntegrandCell_Galerkin_StrongForm_AD_btest_OBJECT
[ 53%] Building CXX object test/unit/Discretization/Galerkin/CMakeFiles/IntegrandCell_Galerkin_StrongForm_AD_btest_OBJECT.dir/IntegrandCell_Galerkin_StrongForm_AD_btest.cpp.o
[ 53%] Built target IntegrandCell_Galerkin_StrongForm_AD_btest_OBJECT
Scanning dependencies of target IntegrandCell_Galerkin_StrongForm_AD_btest_build_vera
[ 53%] Checking style of test/unit/Discretization/Galerkin/IntegrandCell_Galerkin_StrongForm_AD_btest.cpp
[ 53%] Built target IntegrandCell_Galerkin_StrongForm_AD_btest_build_vera
Scanning dependencies of target IntegrandCell_Galerkin_StrongForm_AD_btest_build
[ 53%] Linking CXX executable IntegrandCell_Galerkin_StrongForm_AD_btest
[ 53%] Built target IntegrandCell_Galerkin_StrongForm_AD_btest_build
Scanning dependencies of target JacobianCell_Galerkin_AD_btest_OBJECT
[ 53%] Building CXX object test/unit/Discretization/Galerkin/CMakeFiles/JacobianCell_Galerkin_AD_btest_OBJECT.dir/JacobianCell_Galerkin_AD_btest.cpp.o
[ 53%] Built target JacobianCell_Galerkin_AD_btest_OBJECT
Scanning dependencies of target JacobianCell_Galerkin_AD_btest_build_vera
[ 53%] Checking style of test/unit/Discretization/Galerkin/JacobianCell_Galerkin_AD_btest.cpp
[ 53%] Built target JacobianCell_Galerkin_AD_btest_build_vera
Scanning dependencies of target JacobianCell_Galerkin_AD_btest_build
[ 53%] Linking CXX executable JacobianCell_Galerkin_AD_btest
[ 53%] Built target JacobianCell_Galerkin_AD_btest_build
Scanning dependencies of target ResidualCell_Galerkin_PTC_AD_btest_OBJECT
[ 53%] Building CXX object test/unit/Discretization/Galerkin/CMakeFiles/ResidualCell_Galerkin_PTC_AD_btest_OBJECT.dir/ResidualCell_Galerkin_PTC_AD_btest.cpp.o
[ 53%] Built target ResidualCell_Galerkin_PTC_AD_btest_OBJECT
Scanning dependencies of target ResidualCell_Galerkin_PTC_AD_btest_build_vera
[ 53%] Checking style of test/unit/Discretization/Galerkin/ResidualCell_Galerkin_PTC_AD_btest.cpp
[ 53%] Built target ResidualCell_Galerkin_PTC_AD_btest_build_vera
Scanning dependencies of target ResidualCell_Galerkin_PTC_AD_btest_build
[ 53%] Linking CXX executable ResidualCell_Galerkin_PTC_AD_btest
[ 53%] Built target ResidualCell_Galerkin_PTC_AD_btest_build
Scanning dependencies of target IntegrandCell_Galerkin_IRS_AD_btest_OBJECT
[ 53%] Building CXX object test/unit/Discretization/Galerkin/CMakeFiles/IntegrandCell_Galerkin_IRS_AD_btest_OBJECT.dir/IntegrandCell_Galerkin_IRS_AD_btest.cpp.o
[ 53%] Built target IntegrandCell_Galerkin_IRS_AD_btest_OBJECT
Scanning dependencies of target IntegrandCell_Galerkin_IRS_AD_btest_build_vera
[ 53%] Checking style of test/unit/Discretization/Galerkin/IntegrandCell_Galerkin_IRS_AD_btest.cpp
[ 53%] Built target IntegrandCell_Galerkin_IRS_AD_btest_build_vera
Scanning dependencies of target IntegrandCell_Galerkin_IRS_AD_btest_build
[ 53%] Linking CXX executable IntegrandCell_Galerkin_IRS_AD_btest
[ 53%] Built target IntegrandCell_Galerkin_IRS_AD_btest_build
Scanning dependencies of target IntegrandBoundaryTrace_Output_Galerkin_btest_build_vera
[ 53%] Checking style of test/unit/Discretization/Galerkin/IntegrandBoundaryTrace_Output_Galerkin_btest.cpp
[ 53%] Built target IntegrandBoundaryTrace_Output_Galerkin_btest_build_vera
Scanning dependencies of target IntegrandBoundaryTrace_Output_Galerkin_btest_OBJECT
[ 53%] Building CXX object test/unit/Discretization/Galerkin/CMakeFiles/IntegrandBoundaryTrace_Output_Galerkin_btest_OBJECT.dir/IntegrandBoundaryTrace_Output_Galerkin_btest.cpp.o
[ 53%] Built target IntegrandBoundaryTrace_Output_Galerkin_btest_OBJECT
Scanning dependencies of target IntegrandBoundaryTrace_Output_Galerkin_btest_build
[ 53%] Linking CXX executable IntegrandBoundaryTrace_Output_Galerkin_btest
[ 53%] Built target IntegrandBoundaryTrace_Output_Galerkin_btest_build
Scanning dependencies of target IntegrandInteriorTrace_Galerkin_CR_btest_OBJECT
[ 53%] Building CXX object test/unit/Discretization/Galerkin/CMakeFiles/IntegrandInteriorTrace_Galerkin_CR_btest_OBJECT.dir/IntegrandInteriorTrace_Galerkin_CR_btest.cpp.o
[ 53%] Built target IntegrandInteriorTrace_Galerkin_CR_btest_OBJECT
Scanning dependencies of target IntegrandInteriorTrace_Galerkin_CR_btest_build_vera
[ 53%] Checking style of test/unit/Discretization/Galerkin/IntegrandInteriorTrace_Galerkin_CR_btest.cpp
[ 53%] Built target IntegrandInteriorTrace_Galerkin_CR_btest_build_vera
Scanning dependencies of target IntegrandInteriorTrace_Galerkin_CR_btest_build
[ 53%] Linking CXX executable IntegrandInteriorTrace_Galerkin_CR_btest
[ 53%] Built target IntegrandInteriorTrace_Galerkin_CR_btest_build
Scanning dependencies of target ResidualCell_Galerkin_HSM2D_btest_build_vera
[ 53%] Checking style of test/unit/Discretization/Galerkin/ResidualCell_Galerkin_HSM2D_btest.cpp
[ 53%] Built target ResidualCell_Galerkin_HSM2D_btest_build_vera
Scanning dependencies of target ResidualCell_Galerkin_HSM2D_btest_OBJECT
[ 53%] Building CXX object test/unit/Discretization/Galerkin/CMakeFiles/ResidualCell_Galerkin_HSM2D_btest_OBJECT.dir/ResidualCell_Galerkin_HSM2D_btest.cpp.o
[ 53%] Built target ResidualCell_Galerkin_HSM2D_btest_OBJECT
Scanning dependencies of target ResidualCell_Galerkin_HSM2D_btest_build
[ 53%] Linking CXX executable ResidualCell_Galerkin_HSM2D_btest
[ 53%] Built target ResidualCell_Galerkin_HSM2D_btest_build
Scanning dependencies of target StabilizationMatrix_NS_btest_OBJECT
[ 53%] Building CXX object test/unit/Discretization/Galerkin/CMakeFiles/StabilizationMatrix_NS_btest_OBJECT.dir/StabilizationMatrix_NS_btest.cpp.o
[ 53%] Built target StabilizationMatrix_NS_btest_OBJECT
Scanning dependencies of target StabilizationMatrix_NS_btest_build_vera
[ 53%] Checking style of test/unit/Discretization/Galerkin/StabilizationMatrix_NS_btest.cpp
[ 53%] Built target StabilizationMatrix_NS_btest_build_vera
Scanning dependencies of target StabilizationMatrix_NS_btest_build
[ 53%] Linking CXX executable StabilizationMatrix_NS_btest
[ 53%] Built target StabilizationMatrix_NS_btest_build
Scanning dependencies of target ExtractCGLocalBoundaries_btest_OBJECT
[ 53%] Building CXX object test/unit/Discretization/Galerkin/CMakeFiles/ExtractCGLocalBoundaries_btest_OBJECT.dir/ExtractCGLocalBoundaries_btest.cpp.o
[ 53%] Built target ExtractCGLocalBoundaries_btest_OBJECT
Scanning dependencies of target ExtractCGLocalBoundaries_btest_build_vera
[ 53%] Checking style of test/unit/Discretization/Galerkin/ExtractCGLocalBoundaries_btest.cpp
[ 53%] Built target ExtractCGLocalBoundaries_btest_build_vera
Scanning dependencies of target ExtractCGLocalBoundaries_btest_build
[ 53%] Linking CXX executable ExtractCGLocalBoundaries_btest
[ 53%] Built target ExtractCGLocalBoundaries_btest_build
Scanning dependencies of target IntegrandInteriorTrace_Galerkin_StrongForm_AD_btest_build_vera
[ 53%] Checking style of test/unit/Discretization/Galerkin/IntegrandInteriorTrace_Galerkin_StrongForm_AD_btest.cpp
[ 53%] Built target IntegrandInteriorTrace_Galerkin_StrongForm_AD_btest_build_vera
Scanning dependencies of target IntegrandInteriorTrace_Galerkin_StrongForm_AD_btest_OBJECT
[ 53%] Building CXX object test/unit/Discretization/Galerkin/CMakeFiles/IntegrandInteriorTrace_Galerkin_StrongForm_AD_btest_OBJECT.dir/IntegrandInteriorTrace_Galerkin_StrongForm_AD_btest.cpp.o
[ 53%] Built target IntegrandInteriorTrace_Galerkin_StrongForm_AD_btest_OBJECT
Scanning dependencies of target IntegrandInteriorTrace_Galerkin_StrongForm_AD_btest_build
[ 53%] Linking CXX executable IntegrandInteriorTrace_Galerkin_StrongForm_AD_btest
[ 53%] Built target IntegrandInteriorTrace_Galerkin_StrongForm_AD_btest_build
Scanning dependencies of target IntegrandBoundaryTrace_Dirichlet_mitLG_Galerkin_AD_btest_OBJECT
[ 53%] Building CXX object test/unit/Discretization/Galerkin/CMakeFiles/IntegrandBoundaryTrace_Dirichlet_mitLG_Galerkin_AD_btest_OBJECT.dir/IntegrandBoundaryTrace_Dirichlet_mitLG_Galerkin_AD_btest.cpp.o
[ 53%] Built target IntegrandBoundaryTrace_Dirichlet_mitLG_Galerkin_AD_btest_OBJECT
Scanning dependencies of target IntegrandBoundaryTrace_Dirichlet_mitLG_Galerkin_AD_btest_build_vera
[ 53%] Checking style of test/unit/Discretization/Galerkin/IntegrandBoundaryTrace_Dirichlet_mitLG_Galerkin_AD_btest.cpp
[ 53%] Built target IntegrandBoundaryTrace_Dirichlet_mitLG_Galerkin_AD_btest_build_vera
Scanning dependencies of target IntegrandBoundaryTrace_Dirichlet_mitLG_Galerkin_AD_btest_build
[ 53%] Linking CXX executable IntegrandBoundaryTrace_Dirichlet_mitLG_Galerkin_AD_btest
[ 53%] Built target IntegrandBoundaryTrace_Dirichlet_mitLG_Galerkin_AD_btest_build
Scanning dependencies of target ResidualCell_Galerkin_CR_btest_build_vera
[ 53%] Checking style of test/unit/Discretization/Galerkin/ResidualCell_Galerkin_CR_btest.cpp
[ 53%] Built target ResidualCell_Galerkin_CR_btest_build_vera
Scanning dependencies of target ResidualCell_Galerkin_CR_btest_OBJECT
[ 53%] Building CXX object test/unit/Discretization/Galerkin/CMakeFiles/ResidualCell_Galerkin_CR_btest_OBJECT.dir/ResidualCell_Galerkin_CR_btest.cpp.o
[ 53%] Built target ResidualCell_Galerkin_CR_btest_OBJECT
Scanning dependencies of target ResidualCell_Galerkin_CR_btest_build
[ 53%] Linking CXX executable ResidualCell_Galerkin_CR_btest
[ 53%] Built target ResidualCell_Galerkin_CR_btest_build
Scanning dependencies of target SolutionData_Galerkin_Stabilized_btest_build_vera
[ 53%] Checking style of test/unit/Discretization/Galerkin/SolutionData_Galerkin_Stabilized_btest.cpp
[ 53%] Built target SolutionData_Galerkin_Stabilized_btest_build_vera
Scanning dependencies of target SolutionData_Galerkin_Stabilized_btest_OBJECT
[ 53%] Building CXX object test/unit/Discretization/Galerkin/CMakeFiles/SolutionData_Galerkin_Stabilized_btest_OBJECT.dir/SolutionData_Galerkin_Stabilized_btest.cpp.o
[ 53%] Built target SolutionData_Galerkin_Stabilized_btest_OBJECT
Scanning dependencies of target SolutionData_Galerkin_Stabilized_btest_build
[ 53%] Linking CXX executable SolutionData_Galerkin_Stabilized_btest
[ 53%] Built target SolutionData_Galerkin_Stabilized_btest_build
Scanning dependencies of target JacobianCell_Galerkin_IRS_AD_btest_build_vera
[ 53%] Checking style of test/unit/Discretization/Galerkin/JacobianCell_Galerkin_IRS_AD_btest.cpp
[ 53%] Built target JacobianCell_Galerkin_IRS_AD_btest_build_vera
Scanning dependencies of target JacobianCell_Galerkin_IRS_AD_btest_OBJECT
[ 53%] Building CXX object test/unit/Discretization/Galerkin/CMakeFiles/JacobianCell_Galerkin_IRS_AD_btest_OBJECT.dir/JacobianCell_Galerkin_IRS_AD_btest.cpp.o
[ 53%] Built target JacobianCell_Galerkin_IRS_AD_btest_OBJECT
Scanning dependencies of target JacobianCell_Galerkin_IRS_AD_btest_build
[ 53%] Linking CXX executable JacobianCell_Galerkin_IRS_AD_btest
[ 53%] Built target JacobianCell_Galerkin_IRS_AD_btest_build
Scanning dependencies of target IntegrateBoundaryTrace_Dispatch_Galerkin_AD_1D_btest_OBJECT
[ 53%] Building CXX object test/unit/Discretization/Galerkin/CMakeFiles/IntegrateBoundaryTrace_Dispatch_Galerkin_AD_1D_btest_OBJECT.dir/IntegrateBoundaryTrace_Dispatch_Galerkin_AD_1D_btest.cpp.o
[ 53%] Built target IntegrateBoundaryTrace_Dispatch_Galerkin_AD_1D_btest_OBJECT
Scanning dependencies of target IntegrateBoundaryTrace_Dispatch_Galerkin_AD_1D_btest_build_vera
[ 53%] Checking style of test/unit/Discretization/Galerkin/IntegrateBoundaryTrace_Dispatch_Galerkin_AD_1D_btest.cpp
[ 53%] Built target IntegrateBoundaryTrace_Dispatch_Galerkin_AD_1D_btest_build_vera
Scanning dependencies of target IntegrateBoundaryTrace_Dispatch_Galerkin_AD_1D_btest_build
[ 53%] Linking CXX executable IntegrateBoundaryTrace_Dispatch_Galerkin_AD_1D_btest
[ 53%] Built target IntegrateBoundaryTrace_Dispatch_Galerkin_AD_1D_btest_build
Scanning dependencies of target IntegrandInteriorTrace_Galerkin_AD_btest_build_vera
[ 53%] Checking style of test/unit/Discretization/Galerkin/IntegrandInteriorTrace_Galerkin_AD_btest.cpp
[ 53%] Built target IntegrandInteriorTrace_Galerkin_AD_btest_build_vera
Scanning dependencies of target IntegrandInteriorTrace_Galerkin_AD_btest_OBJECT
[ 53%] Building CXX object test/unit/Discretization/Galerkin/CMakeFiles/IntegrandInteriorTrace_Galerkin_AD_btest_OBJECT.dir/IntegrandInteriorTrace_Galerkin_AD_btest.cpp.o
[ 53%] Built target IntegrandInteriorTrace_Galerkin_AD_btest_OBJECT
Scanning dependencies of target IntegrandInteriorTrace_Galerkin_AD_btest_build
[ 53%] Linking CXX executable IntegrandInteriorTrace_Galerkin_AD_btest
[ 53%] Built target IntegrandInteriorTrace_Galerkin_AD_btest_build
Scanning dependencies of target JacobianFunctionalCell_Galerkin_btest_OBJECT
[ 53%] Building CXX object test/unit/Discretization/Galerkin/CMakeFiles/JacobianFunctionalCell_Galerkin_btest_OBJECT.dir/JacobianFunctionalCell_Galerkin_btest.cpp.o
[ 53%] Built target JacobianFunctionalCell_Galerkin_btest_OBJECT
Scanning dependencies of target JacobianFunctionalCell_Galerkin_btest_build_vera
[ 53%] Checking style of test/unit/Discretization/Galerkin/JacobianFunctionalCell_Galerkin_btest.cpp
[ 53%] Built target JacobianFunctionalCell_Galerkin_btest_build_vera
Scanning dependencies of target JacobianFunctionalCell_Galerkin_btest_build
[ 53%] Linking CXX executable JacobianFunctionalCell_Galerkin_btest
[ 53%] Built target JacobianFunctionalCell_Galerkin_btest_build
Scanning dependencies of target isValidStateCell_Euler_btest_build_vera
[ 53%] Checking style of test/unit/Discretization/Galerkin/isValidStateCell_Euler_btest.cpp
[ 53%] Built target isValidStateCell_Euler_btest_build_vera
Scanning dependencies of target isValidStateCell_Euler_btest_OBJECT
[ 55%] Building CXX object test/unit/Discretization/Galerkin/CMakeFiles/isValidStateCell_Euler_btest_OBJECT.dir/isValidStateCell_Euler_btest.cpp.o
[ 55%] Built target isValidStateCell_Euler_btest_OBJECT
Scanning dependencies of target isValidStateCell_Euler_btest_build
[ 55%] Linking CXX executable isValidStateCell_Euler_btest
[ 55%] Built target isValidStateCell_Euler_btest_build
Scanning dependencies of target IntegrandCell_Galerkin_Output_Stabilized_AD_btest_OBJECT
[ 55%] Building CXX object test/unit/Discretization/Galerkin/CMakeFiles/IntegrandCell_Galerkin_Output_Stabilized_AD_btest_OBJECT.dir/IntegrandCell_Galerkin_Output_Stabilized_AD_btest.cpp.o
[ 55%] Built target IntegrandCell_Galerkin_Output_Stabilized_AD_btest_OBJECT
Scanning dependencies of target IntegrandCell_Galerkin_Output_Stabilized_AD_btest_build_vera
[ 55%] Checking style of test/unit/Discretization/Galerkin/IntegrandCell_Galerkin_Output_Stabilized_AD_btest.cpp
[ 55%] Built target IntegrandCell_Galerkin_Output_Stabilized_AD_btest_build_vera
Scanning dependencies of target IntegrandCell_Galerkin_Output_Stabilized_AD_btest_build
[ 55%] Linking CXX executable IntegrandCell_Galerkin_Output_Stabilized_AD_btest
[ 55%] Built target IntegrandCell_Galerkin_Output_Stabilized_AD_btest_build
Scanning dependencies of target JacobianCell_Galerkin_Stabilized_AD_btest_build_vera
[ 55%] Checking style of test/unit/Discretization/Galerkin/JacobianCell_Galerkin_Stabilized_AD_btest.cpp
[ 55%] Built target JacobianCell_Galerkin_Stabilized_AD_btest_build_vera
Scanning dependencies of target JacobianCell_Galerkin_Stabilized_AD_btest_OBJECT
[ 55%] Building CXX object test/unit/Discretization/Galerkin/CMakeFiles/JacobianCell_Galerkin_Stabilized_AD_btest_OBJECT.dir/JacobianCell_Galerkin_Stabilized_AD_btest.cpp.o
[ 55%] Built target JacobianCell_Galerkin_Stabilized_AD_btest_OBJECT
Scanning dependencies of target JacobianCell_Galerkin_Stabilized_AD_btest_build
[ 55%] Linking CXX executable JacobianCell_Galerkin_Stabilized_AD_btest
[ 55%] Built target JacobianCell_Galerkin_Stabilized_AD_btest_build
Scanning dependencies of target IntegrandBoundaryTrace_Dirichlet_mitLG_Galerkin_Euler_btest_build_vera
[ 55%] Checking style of test/unit/Discretization/Galerkin/IntegrandBoundaryTrace_Dirichlet_mitLG_Galerkin_Euler_btest.cpp
[ 55%] Built target IntegrandBoundaryTrace_Dirichlet_mitLG_Galerkin_Euler_btest_build_vera
Scanning dependencies of target IntegrandBoundaryTrace_Dirichlet_mitLG_Galerkin_Euler_btest_OBJECT
[ 55%] Building CXX object test/unit/Discretization/Galerkin/CMakeFiles/IntegrandBoundaryTrace_Dirichlet_mitLG_Galerkin_Euler_btest_OBJECT.dir/IntegrandBoundaryTrace_Dirichlet_mitLG_Galerkin_Euler_btest.cpp.o
[ 55%] Built target IntegrandBoundaryTrace_Dirichlet_mitLG_Galerkin_Euler_btest_OBJECT
Scanning dependencies of target IntegrandBoundaryTrace_Dirichlet_mitLG_Galerkin_Euler_btest_build
[ 55%] Linking CXX executable IntegrandBoundaryTrace_Dirichlet_mitLG_Galerkin_Euler_btest
[ 55%] Built target IntegrandBoundaryTrace_Dirichlet_mitLG_Galerkin_Euler_btest_build
Scanning dependencies of target IntegrandBoundaryTrace_LinearScalar_sansLG_Galerkin_AD_btest_OBJECT
[ 55%] Building CXX object test/unit/Discretization/Galerkin/CMakeFiles/IntegrandBoundaryTrace_LinearScalar_sansLG_Galerkin_AD_btest_OBJECT.dir/IntegrandBoundaryTrace_LinearScalar_sansLG_Galerkin_AD_btest.cpp.o
[ 55%] Built target IntegrandBoundaryTrace_LinearScalar_sansLG_Galerkin_AD_btest_OBJECT
Scanning dependencies of target IntegrandBoundaryTrace_LinearScalar_sansLG_Galerkin_AD_btest_build_vera
[ 55%] Checking style of test/unit/Discretization/Galerkin/IntegrandBoundaryTrace_LinearScalar_sansLG_Galerkin_AD_btest.cpp
[ 55%] Built target IntegrandBoundaryTrace_LinearScalar_sansLG_Galerkin_AD_btest_build_vera
Scanning dependencies of target IntegrandBoundaryTrace_LinearScalar_sansLG_Galerkin_AD_btest_build
[ 55%] Linking CXX executable IntegrandBoundaryTrace_LinearScalar_sansLG_Galerkin_AD_btest
[ 55%] Built target IntegrandBoundaryTrace_LinearScalar_sansLG_Galerkin_AD_btest_build
Scanning dependencies of target JacobianCell_Galerkin_BDF_AD_btest_OBJECT
[ 55%] Building CXX object test/unit/Discretization/Galerkin/CMakeFiles/JacobianCell_Galerkin_BDF_AD_btest_OBJECT.dir/JacobianCell_Galerkin_BDF_AD_btest.cpp.o
[ 55%] Built target JacobianCell_Galerkin_BDF_AD_btest_OBJECT
Scanning dependencies of target JacobianCell_Galerkin_BDF_AD_btest_build_vera
[ 55%] Checking style of test/unit/Discretization/Galerkin/JacobianCell_Galerkin_BDF_AD_btest.cpp
[ 55%] Built target JacobianCell_Galerkin_BDF_AD_btest_build_vera
Scanning dependencies of target JacobianCell_Galerkin_BDF_AD_btest_build
[ 55%] Linking CXX executable JacobianCell_Galerkin_BDF_AD_btest
[ 55%] Built target JacobianCell_Galerkin_BDF_AD_btest_build
Scanning dependencies of target AlgebraicEquationSet_Galerkin_BuckleyLeverett_ST_btest_OBJECT
[ 55%] Building CXX object test/unit/Discretization/Galerkin/CMakeFiles/AlgebraicEquationSet_Galerkin_BuckleyLeverett_ST_btest_OBJECT.dir/AlgebraicEquationSet_Galerkin_BuckleyLeverett_ST_btest.cpp.o
[ 55%] Built target AlgebraicEquationSet_Galerkin_BuckleyLeverett_ST_btest_OBJECT
Scanning dependencies of target AlgebraicEquationSet_Galerkin_BuckleyLeverett_ST_btest_build_vera
[ 55%] Checking style of test/unit/Discretization/Galerkin/AlgebraicEquationSet_Galerkin_BuckleyLeverett_ST_btest.cpp
[ 55%] Built target AlgebraicEquationSet_Galerkin_BuckleyLeverett_ST_btest_build_vera
Scanning dependencies of target AlgebraicEquationSet_Galerkin_BuckleyLeverett_ST_btest_build
[ 55%] Linking CXX executable AlgebraicEquationSet_Galerkin_BuckleyLeverett_ST_btest
[ 55%] Built target AlgebraicEquationSet_Galerkin_BuckleyLeverett_ST_btest_build
Scanning dependencies of target ResidualCell_Galerkin_AD_btest_OBJECT
[ 55%] Building CXX object test/unit/Discretization/Galerkin/CMakeFiles/ResidualCell_Galerkin_AD_btest_OBJECT.dir/ResidualCell_Galerkin_AD_btest.cpp.o
[ 55%] Built target ResidualCell_Galerkin_AD_btest_OBJECT
Scanning dependencies of target ResidualCell_Galerkin_AD_btest_build_vera
[ 55%] Checking style of test/unit/Discretization/Galerkin/ResidualCell_Galerkin_AD_btest.cpp
[ 55%] Built target ResidualCell_Galerkin_AD_btest_build_vera
Scanning dependencies of target ResidualCell_Galerkin_AD_btest_build
[ 55%] Linking CXX executable ResidualCell_Galerkin_AD_btest
[ 55%] Built target ResidualCell_Galerkin_AD_btest_build
Scanning dependencies of target JacobianFunctionalBoundaryTrace_WeightedResidual_Galerkin_btest_OBJECT
[ 55%] Building CXX object test/unit/Discretization/Galerkin/CMakeFiles/JacobianFunctionalBoundaryTrace_WeightedResidual_Galerkin_btest_OBJECT.dir/JacobianFunctionalBoundaryTrace_WeightedResidual_Galerkin_btest.cpp.o
[ 55%] Built target JacobianFunctionalBoundaryTrace_WeightedResidual_Galerkin_btest_OBJECT
Scanning dependencies of target JacobianFunctionalBoundaryTrace_WeightedResidual_Galerkin_btest_build_vera
[ 55%] Checking style of test/unit/Discretization/Galerkin/JacobianFunctionalBoundaryTrace_WeightedResidual_Galerkin_btest.cpp
[ 55%] Built target JacobianFunctionalBoundaryTrace_WeightedResidual_Galerkin_btest_build_vera
Scanning dependencies of target JacobianFunctionalBoundaryTrace_WeightedResidual_Galerkin_btest_build
[ 55%] Linking CXX executable JacobianFunctionalBoundaryTrace_WeightedResidual_Galerkin_btest
[ 55%] Built target JacobianFunctionalBoundaryTrace_WeightedResidual_Galerkin_btest_build
Scanning dependencies of target JacobianBoundaryTrace_Dirichlet_mitLG_Galerkin_AD_btest_OBJECT
[ 55%] Building CXX object test/unit/Discretization/Galerkin/CMakeFiles/JacobianBoundaryTrace_Dirichlet_mitLG_Galerkin_AD_btest_OBJECT.dir/JacobianBoundaryTrace_Dirichlet_mitLG_Galerkin_AD_btest.cpp.o
[ 55%] Built target JacobianBoundaryTrace_Dirichlet_mitLG_Galerkin_AD_btest_OBJECT
Scanning dependencies of target JacobianBoundaryTrace_Dirichlet_mitLG_Galerkin_AD_btest_build_vera
[ 55%] Checking style of test/unit/Discretization/Galerkin/JacobianBoundaryTrace_Dirichlet_mitLG_Galerkin_AD_btest.cpp
[ 55%] Built target JacobianBoundaryTrace_Dirichlet_mitLG_Galerkin_AD_btest_build_vera
Scanning dependencies of target JacobianBoundaryTrace_Dirichlet_mitLG_Galerkin_AD_btest_build
[ 55%] Linking CXX executable JacobianBoundaryTrace_Dirichlet_mitLG_Galerkin_AD_btest
[ 55%] Built target JacobianBoundaryTrace_Dirichlet_mitLG_Galerkin_AD_btest_build
Scanning dependencies of target IntegrandCell_Galerkin_PTC_AD_btest_build_vera
[ 55%] Checking style of test/unit/Discretization/Galerkin/IntegrandCell_Galerkin_PTC_AD_btest.cpp
[ 55%] Built target IntegrandCell_Galerkin_PTC_AD_btest_build_vera
Scanning dependencies of target IntegrandCell_Galerkin_PTC_AD_btest_OBJECT
[ 55%] Building CXX object test/unit/Discretization/Galerkin/CMakeFiles/IntegrandCell_Galerkin_PTC_AD_btest_OBJECT.dir/IntegrandCell_Galerkin_PTC_AD_btest.cpp.o
[ 55%] Built target IntegrandCell_Galerkin_PTC_AD_btest_OBJECT
Scanning dependencies of target IntegrandCell_Galerkin_PTC_AD_btest_build
[ 55%] Linking CXX executable IntegrandCell_Galerkin_PTC_AD_btest
[ 55%] Built target IntegrandCell_Galerkin_PTC_AD_btest_build
Scanning dependencies of target IntegrandBoundaryTrace_None_Galerkin_AD_btest_OBJECT
[ 55%] Building CXX object test/unit/Discretization/Galerkin/CMakeFiles/IntegrandBoundaryTrace_None_Galerkin_AD_btest_OBJECT.dir/IntegrandBoundaryTrace_None_Galerkin_AD_btest.cpp.o
[ 55%] Built target IntegrandBoundaryTrace_None_Galerkin_AD_btest_OBJECT
Scanning dependencies of target IntegrandBoundaryTrace_None_Galerkin_AD_btest_build_vera
[ 55%] Checking style of test/unit/Discretization/Galerkin/IntegrandBoundaryTrace_None_Galerkin_AD_btest.cpp
[ 55%] Built target IntegrandBoundaryTrace_None_Galerkin_AD_btest_build_vera
Scanning dependencies of target IntegrandBoundaryTrace_None_Galerkin_AD_btest_build
[ 55%] Linking CXX executable IntegrandBoundaryTrace_None_Galerkin_AD_btest
[ 55%] Built target IntegrandBoundaryTrace_None_Galerkin_AD_btest_build
Scanning dependencies of target AlgebraicEquationSet_Galerkin_Stabilized_Triangle_AD_btest_OBJECT
[ 55%] Building CXX object test/unit/Discretization/Galerkin/CMakeFiles/AlgebraicEquationSet_Galerkin_Stabilized_Triangle_AD_btest_OBJECT.dir/AlgebraicEquationSet_Galerkin_Stabilized_Triangle_AD_btest.cpp.o
[ 55%] Built target AlgebraicEquationSet_Galerkin_Stabilized_Triangle_AD_btest_OBJECT
Scanning dependencies of target AlgebraicEquationSet_Galerkin_Stabilized_Triangle_AD_btest_build_vera
[ 55%] Checking style of test/unit/Discretization/Galerkin/AlgebraicEquationSet_Galerkin_Stabilized_Triangle_AD_btest.cpp
[ 55%] Built target AlgebraicEquationSet_Galerkin_Stabilized_Triangle_AD_btest_build_vera
Scanning dependencies of target AlgebraicEquationSet_Galerkin_Stabilized_Triangle_AD_btest_build
[ 55%] Linking CXX executable AlgebraicEquationSet_Galerkin_Stabilized_Triangle_AD_btest
[ 55%] Built target AlgebraicEquationSet_Galerkin_Stabilized_Triangle_AD_btest_build
Scanning dependencies of target AlgebraicEquationSet_Local_Galerkin_Stabilized_Triangle_AD_btest_OBJECT
[ 55%] Building CXX object test/unit/Discretization/Galerkin/CMakeFiles/AlgebraicEquationSet_Local_Galerkin_Stabilized_Triangle_AD_btest_OBJECT.dir/AlgebraicEquationSet_Local_Galerkin_Stabilized_Triangle_AD_btest.cpp.o
[ 55%] Built target AlgebraicEquationSet_Local_Galerkin_Stabilized_Triangle_AD_btest_OBJECT
Scanning dependencies of target AlgebraicEquationSet_Local_Galerkin_Stabilized_Triangle_AD_btest_build_vera
[ 55%] Checking style of test/unit/Discretization/Galerkin/AlgebraicEquationSet_Local_Galerkin_Stabilized_Triangle_AD_btest.cpp
[ 55%] Built target AlgebraicEquationSet_Local_Galerkin_Stabilized_Triangle_AD_btest_build_vera
Scanning dependencies of target AlgebraicEquationSet_Local_Galerkin_Stabilized_Triangle_AD_btest_build
[ 55%] Linking CXX executable AlgebraicEquationSet_Local_Galerkin_Stabilized_Triangle_AD_btest
[ 55%] Built target AlgebraicEquationSet_Local_Galerkin_Stabilized_Triangle_AD_btest_build
Scanning dependencies of target AlgebraicEquationSet_Local_Galerkin_Stabilized_Triangle_Euler_btest_build_vera
[ 55%] Checking style of test/unit/Discretization/Galerkin/AlgebraicEquationSet_Local_Galerkin_Stabilized_Triangle_Euler_btest.cpp
[ 55%] Built target AlgebraicEquationSet_Local_Galerkin_Stabilized_Triangle_Euler_btest_build_vera
Scanning dependencies of target AlgebraicEquationSet_Local_Galerkin_Stabilized_Triangle_Euler_btest_OBJECT
[ 55%] Building CXX object test/unit/Discretization/Galerkin/CMakeFiles/AlgebraicEquationSet_Local_Galerkin_Stabilized_Triangle_Euler_btest_OBJECT.dir/AlgebraicEquationSet_Local_Galerkin_Stabilized_Triangle_Euler_btest.cpp.o
[ 55%] Built target AlgebraicEquationSet_Local_Galerkin_Stabilized_Triangle_Euler_btest_OBJECT
Scanning dependencies of target AlgebraicEquationSet_Local_Galerkin_Stabilized_Triangle_Euler_btest_build
[ 55%] Linking CXX executable AlgebraicEquationSet_Local_Galerkin_Stabilized_Triangle_Euler_btest
[ 55%] Built target AlgebraicEquationSet_Local_Galerkin_Stabilized_Triangle_Euler_btest_build
Scanning dependencies of target AlgebraicEquationSet_ProjectFunction_btest_OBJECT
[ 55%] Building CXX object test/unit/Discretization/Galerkin/CMakeFiles/AlgebraicEquationSet_ProjectFunction_btest_OBJECT.dir/AlgebraicEquationSet_ProjectFunction_btest.cpp.o
[ 55%] Built target AlgebraicEquationSet_ProjectFunction_btest_OBJECT
Scanning dependencies of target AlgebraicEquationSet_ProjectFunction_btest_build_vera
[ 55%] Checking style of test/unit/Discretization/Galerkin/AlgebraicEquationSet_ProjectFunction_btest.cpp
[ 55%] Built target AlgebraicEquationSet_ProjectFunction_btest_build_vera
Scanning dependencies of target AlgebraicEquationSet_ProjectFunction_btest_build
[ 55%] Linking CXX executable AlgebraicEquationSet_ProjectFunction_btest
[ 55%] Built target AlgebraicEquationSet_ProjectFunction_btest_build
Scanning dependencies of target IntegrandCell_Galerkin_AD_btest_OBJECT
[ 55%] Building CXX object test/unit/Discretization/Galerkin/CMakeFiles/IntegrandCell_Galerkin_AD_btest_OBJECT.dir/IntegrandCell_Galerkin_AD_btest.cpp.o
[ 55%] Built target IntegrandCell_Galerkin_AD_btest_OBJECT
Scanning dependencies of target IntegrandCell_Galerkin_AD_btest_build_vera
[ 55%] Checking style of test/unit/Discretization/Galerkin/IntegrandCell_Galerkin_AD_btest.cpp
[ 55%] Built target IntegrandCell_Galerkin_AD_btest_build_vera
Scanning dependencies of target IntegrandCell_Galerkin_AD_btest_build
[ 55%] Linking CXX executable IntegrandCell_Galerkin_AD_btest
[ 55%] Built target IntegrandCell_Galerkin_AD_btest_build
Scanning dependencies of target ResidualInteriorTrace_Galerkin_AD_btest_OBJECT
[ 55%] Building CXX object test/unit/Discretization/Galerkin/CMakeFiles/ResidualInteriorTrace_Galerkin_AD_btest_OBJECT.dir/ResidualInteriorTrace_Galerkin_AD_btest.cpp.o
[ 55%] Built target ResidualInteriorTrace_Galerkin_AD_btest_OBJECT
Scanning dependencies of target ResidualInteriorTrace_Galerkin_AD_btest_build_vera
[ 55%] Checking style of test/unit/Discretization/Galerkin/ResidualInteriorTrace_Galerkin_AD_btest.cpp
[ 55%] Built target ResidualInteriorTrace_Galerkin_AD_btest_build_vera
Scanning dependencies of target ResidualInteriorTrace_Galerkin_AD_btest_build
[ 55%] Linking CXX executable ResidualInteriorTrace_Galerkin_AD_btest
[ 55%] Built target ResidualInteriorTrace_Galerkin_AD_btest_build
Scanning dependencies of target JacobianTranspose_Galerkin_Triangle_AD_btest_OBJECT
[ 55%] Building CXX object test/unit/Discretization/Galerkin/CMakeFiles/JacobianTranspose_Galerkin_Triangle_AD_btest_OBJECT.dir/JacobianTranspose_Galerkin_Triangle_AD_btest.cpp.o
[ 55%] Built target JacobianTranspose_Galerkin_Triangle_AD_btest_OBJECT
Scanning dependencies of target JacobianTranspose_Galerkin_Triangle_AD_btest_build_vera
[ 55%] Checking style of test/unit/Discretization/Galerkin/JacobianTranspose_Galerkin_Triangle_AD_btest.cpp
[ 55%] Built target JacobianTranspose_Galerkin_Triangle_AD_btest_build_vera
Scanning dependencies of target JacobianTranspose_Galerkin_Triangle_AD_btest_build
[ 55%] Linking CXX executable JacobianTranspose_Galerkin_Triangle_AD_btest
[ 55%] Built target JacobianTranspose_Galerkin_Triangle_AD_btest_build
Scanning dependencies of target JacobianBoundaryTrace_LinearScalar_sansLG_Galerkin_AD_btest_OBJECT
[ 55%] Building CXX object test/unit/Discretization/Galerkin/CMakeFiles/JacobianBoundaryTrace_LinearScalar_sansLG_Galerkin_AD_btest_OBJECT.dir/JacobianBoundaryTrace_LinearScalar_sansLG_Galerkin_AD_btest.cpp.o
[ 55%] Built target JacobianBoundaryTrace_LinearScalar_sansLG_Galerkin_AD_btest_OBJECT
Scanning dependencies of target JacobianBoundaryTrace_LinearScalar_sansLG_Galerkin_AD_btest_build_vera
[ 55%] Checking style of test/unit/Discretization/Galerkin/JacobianBoundaryTrace_LinearScalar_sansLG_Galerkin_AD_btest.cpp
[ 55%] Built target JacobianBoundaryTrace_LinearScalar_sansLG_Galerkin_AD_btest_build_vera
Scanning dependencies of target JacobianBoundaryTrace_LinearScalar_sansLG_Galerkin_AD_btest_build
[ 55%] Linking CXX executable JacobianBoundaryTrace_LinearScalar_sansLG_Galerkin_AD_btest
[ 55%] Built target JacobianBoundaryTrace_LinearScalar_sansLG_Galerkin_AD_btest_build
Scanning dependencies of target AlgebraicEquationSet_Galerkin_Stabilized_Triangle_SA_btest_build_vera
[ 55%] Checking style of test/unit/Discretization/Galerkin/AlgebraicEquationSet_Galerkin_Stabilized_Triangle_SA_btest.cpp
[ 55%] Built target AlgebraicEquationSet_Galerkin_Stabilized_Triangle_SA_btest_build_vera
Scanning dependencies of target AlgebraicEquationSet_Galerkin_Stabilized_Triangle_SA_btest_OBJECT
[ 55%] Building CXX object test/unit/Discretization/Galerkin/CMakeFiles/AlgebraicEquationSet_Galerkin_Stabilized_Triangle_SA_btest_OBJECT.dir/AlgebraicEquationSet_Galerkin_Stabilized_Triangle_SA_btest.cpp.o
[ 55%] Built target AlgebraicEquationSet_Galerkin_Stabilized_Triangle_SA_btest_OBJECT
Scanning dependencies of target AlgebraicEquationSet_Galerkin_Stabilized_Triangle_SA_btest_build
[ 55%] Linking CXX executable AlgebraicEquationSet_Galerkin_Stabilized_Triangle_SA_btest
[ 55%] Built target AlgebraicEquationSet_Galerkin_Stabilized_Triangle_SA_btest_build
Scanning dependencies of target JacobianBoundaryTrace_LinearScalar_mitLG_Galerkin_AD_btest_build_vera
[ 55%] Checking style of test/unit/Discretization/Galerkin/JacobianBoundaryTrace_LinearScalar_mitLG_Galerkin_AD_btest.cpp
[ 55%] Built target JacobianBoundaryTrace_LinearScalar_mitLG_Galerkin_AD_btest_build_vera
Scanning dependencies of target JacobianBoundaryTrace_LinearScalar_mitLG_Galerkin_AD_btest_OBJECT
[ 55%] Building CXX object test/unit/Discretization/Galerkin/CMakeFiles/JacobianBoundaryTrace_LinearScalar_mitLG_Galerkin_AD_btest_OBJECT.dir/JacobianBoundaryTrace_LinearScalar_mitLG_Galerkin_AD_btest.cpp.o
[ 55%] Built target JacobianBoundaryTrace_LinearScalar_mitLG_Galerkin_AD_btest_OBJECT
Scanning dependencies of target JacobianBoundaryTrace_LinearScalar_mitLG_Galerkin_AD_btest_build
[ 55%] Linking CXX executable JacobianBoundaryTrace_LinearScalar_mitLG_Galerkin_AD_btest
[ 55%] Built target JacobianBoundaryTrace_LinearScalar_mitLG_Galerkin_AD_btest_build
Scanning dependencies of target IntegrandCell_Galerkin_Stabilized_NS_btest_build_vera
[ 55%] Checking style of test/unit/Discretization/Galerkin/IntegrandCell_Galerkin_Stabilized_NS_btest.cpp
[ 55%] Built target IntegrandCell_Galerkin_Stabilized_NS_btest_build_vera
Scanning dependencies of target IntegrandCell_Galerkin_Stabilized_NS_btest_OBJECT
[ 56%] Building CXX object test/unit/Discretization/Galerkin/CMakeFiles/IntegrandCell_Galerkin_Stabilized_NS_btest_OBJECT.dir/IntegrandCell_Galerkin_Stabilized_NS_btest.cpp.o
[ 56%] Built target IntegrandCell_Galerkin_Stabilized_NS_btest_OBJECT
Scanning dependencies of target IntegrandCell_Galerkin_Stabilized_NS_btest_build
[ 56%] Linking CXX executable IntegrandCell_Galerkin_Stabilized_NS_btest
[ 56%] Built target IntegrandCell_Galerkin_Stabilized_NS_btest_build
Scanning dependencies of target IntegrandInteriorTrace_SIP_Galerkin_AD_btest_OBJECT
[ 56%] Building CXX object test/unit/Discretization/Galerkin/CMakeFiles/IntegrandInteriorTrace_SIP_Galerkin_AD_btest_OBJECT.dir/IntegrandInteriorTrace_SIP_Galerkin_AD_btest.cpp.o
[ 56%] Built target IntegrandInteriorTrace_SIP_Galerkin_AD_btest_OBJECT
Scanning dependencies of target IntegrandInteriorTrace_SIP_Galerkin_AD_btest_build_vera
[ 56%] Checking style of test/unit/Discretization/Galerkin/IntegrandInteriorTrace_SIP_Galerkin_AD_btest.cpp
[ 56%] Built target IntegrandInteriorTrace_SIP_Galerkin_AD_btest_build_vera
Scanning dependencies of target IntegrandInteriorTrace_SIP_Galerkin_AD_btest_build
[ 56%] Linking CXX executable IntegrandInteriorTrace_SIP_Galerkin_AD_btest
[ 56%] Built target IntegrandInteriorTrace_SIP_Galerkin_AD_btest_build
Scanning dependencies of target IntegrandCell_Galerkin_HSMKL_btest_OBJECT
[ 56%] Building CXX object test/unit/Discretization/Galerkin/CMakeFiles/IntegrandCell_Galerkin_HSMKL_btest_OBJECT.dir/IntegrandCell_Galerkin_HSMKL_btest.cpp.o
[ 56%] Built target IntegrandCell_Galerkin_HSMKL_btest_OBJECT
Scanning dependencies of target IntegrandCell_Galerkin_HSMKL_btest_build_vera
[ 56%] Checking style of test/unit/Discretization/Galerkin/IntegrandCell_Galerkin_HSMKL_btest.cpp
[ 56%] Built target IntegrandCell_Galerkin_HSMKL_btest_build_vera
Scanning dependencies of target IntegrandCell_Galerkin_HSMKL_btest_build
[ 56%] Linking CXX executable IntegrandCell_Galerkin_HSMKL_btest
[ 56%] Built target IntegrandCell_Galerkin_HSMKL_btest_build
Scanning dependencies of target IntegrandBoundaryTrace_Dirichlet_mitState_Galerkin_Euler_btest_OBJECT
[ 56%] Building CXX object test/unit/Discretization/Galerkin/CMakeFiles/IntegrandBoundaryTrace_Dirichlet_mitState_Galerkin_Euler_btest_OBJECT.dir/IntegrandBoundaryTrace_Dirichlet_mitState_Galerkin_Euler_btest.cpp.o
[ 56%] Built target IntegrandBoundaryTrace_Dirichlet_mitState_Galerkin_Euler_btest_OBJECT
Scanning dependencies of target IntegrandBoundaryTrace_Dirichlet_mitState_Galerkin_Euler_btest_build_vera
[ 56%] Checking style of test/unit/Discretization/Galerkin/IntegrandBoundaryTrace_Dirichlet_mitState_Galerkin_Euler_btest.cpp
[ 56%] Built target IntegrandBoundaryTrace_Dirichlet_mitState_Galerkin_Euler_btest_build_vera
Scanning dependencies of target IntegrandBoundaryTrace_Dirichlet_mitState_Galerkin_Euler_btest_build
[ 56%] Linking CXX executable IntegrandBoundaryTrace_Dirichlet_mitState_Galerkin_Euler_btest
[ 56%] Built target IntegrandBoundaryTrace_Dirichlet_mitState_Galerkin_Euler_btest_build
Scanning dependencies of target IntegrandCell_Galerkin_CR_btest_OBJECT
[ 56%] Building CXX object test/unit/Discretization/Galerkin/CMakeFiles/IntegrandCell_Galerkin_CR_btest_OBJECT.dir/IntegrandCell_Galerkin_CR_btest.cpp.o
[ 56%] Built target IntegrandCell_Galerkin_CR_btest_OBJECT
Scanning dependencies of target IntegrandCell_Galerkin_CR_btest_build_vera
[ 56%] Checking style of test/unit/Discretization/Galerkin/IntegrandCell_Galerkin_CR_btest.cpp
[ 56%] Built target IntegrandCell_Galerkin_CR_btest_build_vera
Scanning dependencies of target IntegrandCell_Galerkin_CR_btest_build
[ 56%] Linking CXX executable IntegrandCell_Galerkin_CR_btest
[ 56%] Built target IntegrandCell_Galerkin_CR_btest_build
Scanning dependencies of target ElementIntegral_Galerkin_2D_Triangle_AD_btest_build_vera
[ 56%] Checking style of test/unit/Discretization/Galerkin/ElementIntegral_Galerkin_2D_Triangle_AD_btest.cpp
[ 56%] Built target ElementIntegral_Galerkin_2D_Triangle_AD_btest_build_vera
Scanning dependencies of target ElementIntegral_Galerkin_2D_Triangle_AD_btest_OBJECT
[ 56%] Building CXX object test/unit/Discretization/Galerkin/CMakeFiles/ElementIntegral_Galerkin_2D_Triangle_AD_btest_OBJECT.dir/ElementIntegral_Galerkin_2D_Triangle_AD_btest.cpp.o
[ 56%] Built target ElementIntegral_Galerkin_2D_Triangle_AD_btest_OBJECT
Scanning dependencies of target ElementIntegral_Galerkin_2D_Triangle_AD_btest_build
[ 56%] Linking CXX executable ElementIntegral_Galerkin_2D_Triangle_AD_btest
[ 56%] Built target ElementIntegral_Galerkin_2D_Triangle_AD_btest_build
Scanning dependencies of target ResidualCell_Galerkin_BDF_AD_btest_OBJECT
[ 56%] Building CXX object test/unit/Discretization/Galerkin/CMakeFiles/ResidualCell_Galerkin_BDF_AD_btest_OBJECT.dir/ResidualCell_Galerkin_BDF_AD_btest.cpp.o
[ 56%] Built target ResidualCell_Galerkin_BDF_AD_btest_OBJECT
Scanning dependencies of target ResidualCell_Galerkin_BDF_AD_btest_build_vera
[ 56%] Checking style of test/unit/Discretization/Galerkin/ResidualCell_Galerkin_BDF_AD_btest.cpp
[ 56%] Built target ResidualCell_Galerkin_BDF_AD_btest_build_vera
Scanning dependencies of target ResidualCell_Galerkin_BDF_AD_btest_build
[ 56%] Linking CXX executable ResidualCell_Galerkin_BDF_AD_btest
[ 56%] Built target ResidualCell_Galerkin_BDF_AD_btest_build
Scanning dependencies of target JacobianNonZeroPattern_Galerkin_Triangle_AD_btest_OBJECT
[ 56%] Building CXX object test/unit/Discretization/Galerkin/CMakeFiles/JacobianNonZeroPattern_Galerkin_Triangle_AD_btest_OBJECT.dir/JacobianNonZeroPattern_Galerkin_Triangle_AD_btest.cpp.o
[ 56%] Built target JacobianNonZeroPattern_Galerkin_Triangle_AD_btest_OBJECT
Scanning dependencies of target JacobianNonZeroPattern_Galerkin_Triangle_AD_btest_build_vera
[ 56%] Checking style of test/unit/Discretization/Galerkin/JacobianNonZeroPattern_Galerkin_Triangle_AD_btest.cpp
[ 56%] Built target JacobianNonZeroPattern_Galerkin_Triangle_AD_btest_build_vera
Scanning dependencies of target JacobianNonZeroPattern_Galerkin_Triangle_AD_btest_build
[ 56%] Linking CXX executable JacobianNonZeroPattern_Galerkin_Triangle_AD_btest
[ 56%] Built target JacobianNonZeroPattern_Galerkin_Triangle_AD_btest_build
Scanning dependencies of target ResidualBoundaryTrace_None_Galerkin_AD_btest_build_vera
[ 56%] Checking style of test/unit/Discretization/Galerkin/ResidualBoundaryTrace_None_Galerkin_AD_btest.cpp
[ 56%] Built target ResidualBoundaryTrace_None_Galerkin_AD_btest_build_vera
Scanning dependencies of target ResidualBoundaryTrace_None_Galerkin_AD_btest_OBJECT
[ 56%] Building CXX object test/unit/Discretization/Galerkin/CMakeFiles/ResidualBoundaryTrace_None_Galerkin_AD_btest_OBJECT.dir/ResidualBoundaryTrace_None_Galerkin_AD_btest.cpp.o
[ 56%] Built target ResidualBoundaryTrace_None_Galerkin_AD_btest_OBJECT
Scanning dependencies of target ResidualBoundaryTrace_None_Galerkin_AD_btest_build
[ 56%] Linking CXX executable ResidualBoundaryTrace_None_Galerkin_AD_btest
[ 56%] Built target ResidualBoundaryTrace_None_Galerkin_AD_btest_build
Scanning dependencies of target IntegrandCell_ProjectFunction_btest_OBJECT
[ 56%] Building CXX object test/unit/Discretization/Galerkin/CMakeFiles/IntegrandCell_ProjectFunction_btest_OBJECT.dir/IntegrandCell_ProjectFunction_btest.cpp.o
[ 56%] Built target IntegrandCell_ProjectFunction_btest_OBJECT
Scanning dependencies of target IntegrandCell_ProjectFunction_btest_build_vera
[ 56%] Checking style of test/unit/Discretization/Galerkin/IntegrandCell_ProjectFunction_btest.cpp
[ 56%] Built target IntegrandCell_ProjectFunction_btest_build_vera
Scanning dependencies of target IntegrandCell_ProjectFunction_btest_build
[ 56%] Linking CXX executable IntegrandCell_ProjectFunction_btest
[ 56%] Built target IntegrandCell_ProjectFunction_btest_build
Scanning dependencies of target JacobianCell_Galerkin_CR_btest_OBJECT
[ 56%] Building CXX object test/unit/Discretization/Galerkin/CMakeFiles/JacobianCell_Galerkin_CR_btest_OBJECT.dir/JacobianCell_Galerkin_CR_btest.cpp.o
[ 56%] Built target JacobianCell_Galerkin_CR_btest_OBJECT
Scanning dependencies of target JacobianCell_Galerkin_CR_btest_build_vera
[ 56%] Checking style of test/unit/Discretization/Galerkin/JacobianCell_Galerkin_CR_btest.cpp
[ 56%] Built target JacobianCell_Galerkin_CR_btest_build_vera
Scanning dependencies of target JacobianCell_Galerkin_CR_btest_build
[ 56%] Linking CXX executable JacobianCell_Galerkin_CR_btest
[ 56%] Built target JacobianCell_Galerkin_CR_btest_build
Scanning dependencies of target JacobianFunctionalBoundaryTrace_Galerkin_HSM2D_btest_OBJECT
[ 56%] Building CXX object test/unit/Discretization/Galerkin/CMakeFiles/JacobianFunctionalBoundaryTrace_Galerkin_HSM2D_btest_OBJECT.dir/JacobianFunctionalBoundaryTrace_Galerkin_HSM2D_btest.cpp.o
[ 56%] Built target JacobianFunctionalBoundaryTrace_Galerkin_HSM2D_btest_OBJECT
Scanning dependencies of target JacobianFunctionalBoundaryTrace_Galerkin_HSM2D_btest_build_vera
[ 56%] Checking style of test/unit/Discretization/Galerkin/JacobianFunctionalBoundaryTrace_Galerkin_HSM2D_btest.cpp
[ 56%] Built target JacobianFunctionalBoundaryTrace_Galerkin_HSM2D_btest_build_vera
Scanning dependencies of target JacobianFunctionalBoundaryTrace_Galerkin_HSM2D_btest_build
[ 56%] Linking CXX executable JacobianFunctionalBoundaryTrace_Galerkin_HSM2D_btest
[ 56%] Built target JacobianFunctionalBoundaryTrace_Galerkin_HSM2D_btest_build
Scanning dependencies of target IntegrandBoundaryTrace_Dirichlet_sansLG_Galerkin_Euler_btest_OBJECT
[ 56%] Building CXX object test/unit/Discretization/Galerkin/CMakeFiles/IntegrandBoundaryTrace_Dirichlet_sansLG_Galerkin_Euler_btest_OBJECT.dir/IntegrandBoundaryTrace_Dirichlet_sansLG_Galerkin_Euler_btest.cpp.o
[ 56%] Built target IntegrandBoundaryTrace_Dirichlet_sansLG_Galerkin_Euler_btest_OBJECT
Scanning dependencies of target IntegrandBoundaryTrace_Dirichlet_sansLG_Galerkin_Euler_btest_build_vera
[ 56%] Checking style of test/unit/Discretization/Galerkin/IntegrandBoundaryTrace_Dirichlet_sansLG_Galerkin_Euler_btest.cpp
[ 56%] Built target IntegrandBoundaryTrace_Dirichlet_sansLG_Galerkin_Euler_btest_build_vera
Scanning dependencies of target IntegrandBoundaryTrace_Dirichlet_sansLG_Galerkin_Euler_btest_build
[ 56%] Linking CXX executable IntegrandBoundaryTrace_Dirichlet_sansLG_Galerkin_Euler_btest
[ 56%] Built target IntegrandBoundaryTrace_Dirichlet_sansLG_Galerkin_Euler_btest_build
Scanning dependencies of target FunctionalBoundaryTrace_Dispatch_Galerkin_AD_btest_OBJECT
[ 56%] Building CXX object test/unit/Discretization/Galerkin/CMakeFiles/FunctionalBoundaryTrace_Dispatch_Galerkin_AD_btest_OBJECT.dir/FunctionalBoundaryTrace_Dispatch_Galerkin_AD_btest.cpp.o
[ 56%] Built target FunctionalBoundaryTrace_Dispatch_Galerkin_AD_btest_OBJECT
Scanning dependencies of target FunctionalBoundaryTrace_Dispatch_Galerkin_AD_btest_build_vera
[ 56%] Checking style of test/unit/Discretization/Galerkin/FunctionalBoundaryTrace_Dispatch_Galerkin_AD_btest.cpp
[ 56%] Built target FunctionalBoundaryTrace_Dispatch_Galerkin_AD_btest_build_vera
Scanning dependencies of target FunctionalBoundaryTrace_Dispatch_Galerkin_AD_btest_build
[ 56%] Linking CXX executable FunctionalBoundaryTrace_Dispatch_Galerkin_AD_btest
[ 56%] Built target FunctionalBoundaryTrace_Dispatch_Galerkin_AD_btest_build
Scanning dependencies of target IntegrandBoundaryTrace_LinearScalar_mitLG_Galerkin_AD_btest_build_vera
[ 56%] Checking style of test/unit/Discretization/Galerkin/IntegrandBoundaryTrace_LinearScalar_mitLG_Galerkin_AD_btest.cpp
[ 56%] Built target IntegrandBoundaryTrace_LinearScalar_mitLG_Galerkin_AD_btest_build_vera
Scanning dependencies of target IntegrandBoundaryTrace_LinearScalar_mitLG_Galerkin_AD_btest_OBJECT
[ 56%] Building CXX object test/unit/Discretization/Galerkin/CMakeFiles/IntegrandBoundaryTrace_LinearScalar_mitLG_Galerkin_AD_btest_OBJECT.dir/IntegrandBoundaryTrace_LinearScalar_mitLG_Galerkin_AD_btest.cpp.o
[ 56%] Built target IntegrandBoundaryTrace_LinearScalar_mitLG_Galerkin_AD_btest_OBJECT
Scanning dependencies of target IntegrandBoundaryTrace_LinearScalar_mitLG_Galerkin_AD_btest_build
[ 56%] Linking CXX executable IntegrandBoundaryTrace_LinearScalar_mitLG_Galerkin_AD_btest
[ 56%] Built target IntegrandBoundaryTrace_LinearScalar_mitLG_Galerkin_AD_btest_build
Scanning dependencies of target IntegrandCell_Galerkin_BDF_AD_btest_build_vera
[ 56%] Checking style of test/unit/Discretization/Galerkin/IntegrandCell_Galerkin_BDF_AD_btest.cpp
[ 56%] Built target IntegrandCell_Galerkin_BDF_AD_btest_build_vera
Scanning dependencies of target IntegrandCell_Galerkin_BDF_AD_btest_OBJECT
[ 56%] Building CXX object test/unit/Discretization/Galerkin/CMakeFiles/IntegrandCell_Galerkin_BDF_AD_btest_OBJECT.dir/IntegrandCell_Galerkin_BDF_AD_btest.cpp.o
[ 56%] Built target IntegrandCell_Galerkin_BDF_AD_btest_OBJECT
Scanning dependencies of target IntegrandCell_Galerkin_BDF_AD_btest_build
[ 56%] Linking CXX executable IntegrandCell_Galerkin_BDF_AD_btest
[ 56%] Built target IntegrandCell_Galerkin_BDF_AD_btest_build
Scanning dependencies of target AlgebraicEquationSet_Galerkin_Triangle_AD_btest_build_vera
[ 56%] Checking style of test/unit/Discretization/Galerkin/AlgebraicEquationSet_Galerkin_Triangle_AD_btest.cpp
[ 56%] Built target AlgebraicEquationSet_Galerkin_Triangle_AD_btest_build_vera
Scanning dependencies of target AlgebraicEquationSet_Galerkin_Triangle_AD_btest_OBJECT
[ 56%] Building CXX object test/unit/Discretization/Galerkin/CMakeFiles/AlgebraicEquationSet_Galerkin_Triangle_AD_btest_OBJECT.dir/AlgebraicEquationSet_Galerkin_Triangle_AD_btest.cpp.o
[ 56%] Built target AlgebraicEquationSet_Galerkin_Triangle_AD_btest_OBJECT
Scanning dependencies of target AlgebraicEquationSet_Galerkin_Triangle_AD_btest_build
[ 56%] Linking CXX executable AlgebraicEquationSet_Galerkin_Triangle_AD_btest
[ 56%] Built target AlgebraicEquationSet_Galerkin_Triangle_AD_btest_build
Scanning dependencies of target IntegrandCell_Galerkin_HSM2D_btest_build_vera
[ 56%] Checking style of test/unit/Discretization/Galerkin/IntegrandCell_Galerkin_HSM2D_btest.cpp
[ 56%] Built target IntegrandCell_Galerkin_HSM2D_btest_build_vera
Scanning dependencies of target IntegrandCell_Galerkin_HSM2D_btest_OBJECT
[ 56%] Building CXX object test/unit/Discretization/Galerkin/CMakeFiles/IntegrandCell_Galerkin_HSM2D_btest_OBJECT.dir/IntegrandCell_Galerkin_HSM2D_btest.cpp.o
[ 56%] Built target IntegrandCell_Galerkin_HSM2D_btest_OBJECT
Scanning dependencies of target IntegrandCell_Galerkin_HSM2D_btest_build
[ 56%] Linking CXX executable IntegrandCell_Galerkin_HSM2D_btest
[ 56%] Built target IntegrandCell_Galerkin_HSM2D_btest_build
Scanning dependencies of target IntegrandCell_Galerkin_Conservative_btest_build_vera
[ 56%] Checking style of test/unit/Discretization/Galerkin/IntegrandCell_Galerkin_Conservative_btest.cpp
[ 56%] Built target IntegrandCell_Galerkin_Conservative_btest_build_vera
Scanning dependencies of target IntegrandCell_Galerkin_Conservative_btest_OBJECT
[ 56%] Building CXX object test/unit/Discretization/Galerkin/CMakeFiles/IntegrandCell_Galerkin_Conservative_btest_OBJECT.dir/IntegrandCell_Galerkin_Conservative_btest.cpp.o
[ 56%] Built target IntegrandCell_Galerkin_Conservative_btest_OBJECT
Scanning dependencies of target IntegrandCell_Galerkin_Conservative_btest_build
[ 56%] Linking CXX executable IntegrandCell_Galerkin_Conservative_btest
[ 56%] Built target IntegrandCell_Galerkin_Conservative_btest_build
Scanning dependencies of target IntegrandCell_Galerkin_HB_AD_btest_OBJECT
[ 56%] Building CXX object test/unit/Discretization/Galerkin/CMakeFiles/IntegrandCell_Galerkin_HB_AD_btest_OBJECT.dir/IntegrandCell_Galerkin_HB_AD_btest.cpp.o
[ 56%] Built target IntegrandCell_Galerkin_HB_AD_btest_OBJECT
Scanning dependencies of target IntegrandCell_Galerkin_HB_AD_btest_build_vera
[ 56%] Checking style of test/unit/Discretization/Galerkin/IntegrandCell_Galerkin_HB_AD_btest.cpp
[ 56%] Built target IntegrandCell_Galerkin_HB_AD_btest_build_vera
Scanning dependencies of target IntegrandCell_Galerkin_HB_AD_btest_build
[ 56%] Linking CXX executable IntegrandCell_Galerkin_HB_AD_btest
[ 56%] Built target IntegrandCell_Galerkin_HB_AD_btest_build
Scanning dependencies of target IntegrandCell_Galerkin_ShallowWater1D_btest_OBJECT
[ 56%] Building CXX object test/unit/Discretization/Galerkin/CMakeFiles/IntegrandCell_Galerkin_ShallowWater1D_btest_OBJECT.dir/IntegrandCell_Galerkin_ShallowWater1D_btest.cpp.o
[ 56%] Built target IntegrandCell_Galerkin_ShallowWater1D_btest_OBJECT
Scanning dependencies of target IntegrandCell_Galerkin_ShallowWater1D_btest_build_vera
[ 56%] Checking style of test/unit/Discretization/Galerkin/IntegrandCell_Galerkin_ShallowWater1D_btest.cpp
[ 56%] Built target IntegrandCell_Galerkin_ShallowWater1D_btest_build_vera
Scanning dependencies of target IntegrandCell_Galerkin_ShallowWater1D_btest_build
[ 56%] Linking CXX executable IntegrandCell_Galerkin_ShallowWater1D_btest
[ 56%] Built target IntegrandCell_Galerkin_ShallowWater1D_btest_build
Scanning dependencies of target AlgebraicEquationSet_GloballyConstrained_btest_build_vera
[ 56%] Checking style of test/unit/Discretization/GloballyConstrained/AlgebraicEquationSet_GloballyConstrained_btest.cpp
[ 56%] Built target AlgebraicEquationSet_GloballyConstrained_btest_build_vera
Scanning dependencies of target AlgebraicEquationSet_GloballyConstrained_btest_OBJECT
[ 56%] Building CXX object test/unit/Discretization/GloballyConstrained/CMakeFiles/AlgebraicEquationSet_GloballyConstrained_btest_OBJECT.dir/AlgebraicEquationSet_GloballyConstrained_btest.cpp.o
[ 56%] Built target AlgebraicEquationSet_GloballyConstrained_btest_OBJECT
Scanning dependencies of target AlgebraicEquationSet_GloballyConstrained_btest_build
[ 56%] Linking CXX executable AlgebraicEquationSet_GloballyConstrained_btest
[ 56%] Built target AlgebraicEquationSet_GloballyConstrained_btest_build
Scanning dependencies of target Ping_Euler_RotorSource_btest_OBJECT
[ 56%] Building CXX object test/unit/Discretization/GloballyConstrained/CMakeFiles/Ping_Euler_RotorSource_btest_OBJECT.dir/Ping_Euler_RotorSource_btest.cpp.o
[ 56%] Built target Ping_Euler_RotorSource_btest_OBJECT
Scanning dependencies of target Ping_Euler_RotorSource_btest_build_vera
[ 56%] Checking style of test/unit/Discretization/GloballyConstrained/Ping_Euler_RotorSource_btest.cpp
[ 56%] Built target Ping_Euler_RotorSource_btest_build_vera
Scanning dependencies of target Ping_Euler_RotorSource_btest_build
[ 56%] Linking CXX executable Ping_Euler_RotorSource_btest
[ 56%] Built target Ping_Euler_RotorSource_btest_build
[ 56%] Generating CXX unity source src/Discretization/cotire/HDGLib_CXX_unity.cxx
[ 56%] Generating CXX prefix source src/Discretization/cotire/HDGLib_CXX_prefix.cxx
[ 56%] Generating CXX prefix header src/Discretization/cotire/HDGLib_CXX_prefix.hxx
[ 56%] Building CXX precompiled header src/Discretization/cotire/HDGLib_CXX_prefix.hxx.gch
Scanning dependencies of target HDGLib
[ 56%] Building CXX object src/Discretization/CMakeFiles/HDGLib.dir/HDG/Instantiate/AlgebraicEquationSet_HDG_AdvectionDiffusion1D_ALaxDUSU.cpp.o
[ 56%] Building CXX object src/Discretization/CMakeFiles/HDGLib.dir/HDG/Instantiate/AlgebraicEquationSet_HDG_AdvectionDiffusion1D_AUDUSUG.cpp.o
[ 56%] Building CXX object src/Discretization/CMakeFiles/HDGLib.dir/HDG/Instantiate/AlgebraicEquationSet_HDG_AdvectionDiffusion2D_AUDUSUG.cpp.o
[ 56%] Building CXX object src/Discretization/CMakeFiles/HDGLib.dir/HDG/Instantiate/AlgebraicEquationSet_HDG_AdvectionDiffusion3D_AUDUSUG.cpp.o
[ 56%] Building CXX object src/Discretization/CMakeFiles/HDGLib.dir/HDG/Instantiate/AlgebraicEquationSet_HDG_BuckleyLeverett1D.cpp.o
[ 56%] Building CXX object src/Discretization/CMakeFiles/HDGLib.dir/HDG/Instantiate/AlgebraicEquationSet_HDG_Burgers1D_Conservative_DUSU.cpp.o
[ 56%] Building CXX object src/Discretization/CMakeFiles/HDGLib.dir/HDG/Instantiate/AlgebraicEquationSet_HDG_Euler1D_Conservative.cpp.o
[ 56%] Building CXX object src/Discretization/CMakeFiles/HDGLib.dir/HDG/Instantiate/AlgebraicEquationSet_HDG_Euler1D_Entropy.cpp.o
[ 56%] Building CXX object src/Discretization/CMakeFiles/HDGLib.dir/HDG/Instantiate/AlgebraicEquationSet_HDG_Euler1D_PrimitiveRhoPressure.cpp.o
[ 56%] Building CXX object src/Discretization/CMakeFiles/HDGLib.dir/HDG/Instantiate/AlgebraicEquationSet_HDG_Euler2D_PrimitiveRhoPressure.cpp.o
[ 56%] Building CXX object src/Discretization/CMakeFiles/HDGLib.dir/HDG/Instantiate/AlgebraicEquationSet_HDG_NavierStokes2D_Conservative_ConstantViscosity.cpp.o
[ 56%] Building CXX object src/Discretization/CMakeFiles/HDGLib.dir/HDG/Instantiate/AlgebraicEquationSet_HDG_NavierStokes2D_Primitive_ConstantViscosity.cpp.o
[ 56%] Building CXX object src/Discretization/CMakeFiles/HDGLib.dir/HDG/Instantiate/AlgebraicEquationSet_HDG_RANSSA2D_Primitive_ConstantViscosity.cpp.o
[ 56%] Building CXX object src/Discretization/CMakeFiles/HDGLib.dir/HDG/Instantiate/AlgebraicEquationSet_HDG_Stokes2D.cpp.o
[ 56%] Building CXX object src/Discretization/CMakeFiles/HDGLib.dir/HDG/Instantiate/AlgebraicEquationSet_HDGAdvective_Advection1D_AUSU.cpp.o
[ 56%] Linking CXX static library libHDGLib.a
[ 56%] Built target HDGLib
Scanning dependencies of target IntegrandBoundaryTrace_None_HDG_AD_btest_OBJECT
[ 56%] Building CXX object test/unit/Discretization/HDG/CMakeFiles/IntegrandBoundaryTrace_None_HDG_AD_btest_OBJECT.dir/IntegrandBoundaryTrace_None_HDG_AD_btest.cpp.o
[ 56%] Built target IntegrandBoundaryTrace_None_HDG_AD_btest_OBJECT
Scanning dependencies of target IntegrandBoundaryTrace_None_HDG_AD_btest_build_vera
[ 56%] Checking style of test/unit/Discretization/HDG/IntegrandBoundaryTrace_None_HDG_AD_btest.cpp
[ 56%] Built target IntegrandBoundaryTrace_None_HDG_AD_btest_build_vera
Scanning dependencies of target IntegrandBoundaryTrace_None_HDG_AD_btest_build
[ 56%] Linking CXX executable IntegrandBoundaryTrace_None_HDG_AD_btest
[ 56%] Built target IntegrandBoundaryTrace_None_HDG_AD_btest_build
Scanning dependencies of target AlgebraicEquationSet_HDG_Triangle_AD_btest_build_vera
[ 56%] Checking style of test/unit/Discretization/HDG/AlgebraicEquationSet_HDG_Triangle_AD_btest.cpp
[ 56%] Built target AlgebraicEquationSet_HDG_Triangle_AD_btest_build_vera
Scanning dependencies of target AlgebraicEquationSet_HDG_Triangle_AD_btest_OBJECT
[ 56%] Building CXX object test/unit/Discretization/HDG/CMakeFiles/AlgebraicEquationSet_HDG_Triangle_AD_btest_OBJECT.dir/AlgebraicEquationSet_HDG_Triangle_AD_btest.cpp.o
[ 56%] Built target AlgebraicEquationSet_HDG_Triangle_AD_btest_OBJECT
Scanning dependencies of target AlgebraicEquationSet_HDG_Triangle_AD_btest_build
[ 56%] Linking CXX executable AlgebraicEquationSet_HDG_Triangle_AD_btest
[ 56%] Built target AlgebraicEquationSet_HDG_Triangle_AD_btest_build
Scanning dependencies of target IntegrandCell_HDG_NS_btest_OBJECT
[ 56%] Building CXX object test/unit/Discretization/HDG/CMakeFiles/IntegrandCell_HDG_NS_btest_OBJECT.dir/IntegrandCell_HDG_NS_btest.cpp.o
[ 56%] Built target IntegrandCell_HDG_NS_btest_OBJECT
Scanning dependencies of target IntegrandCell_HDG_NS_btest_build_vera
[ 56%] Checking style of test/unit/Discretization/HDG/IntegrandCell_HDG_NS_btest.cpp
[ 56%] Built target IntegrandCell_HDG_NS_btest_build_vera
Scanning dependencies of target IntegrandCell_HDG_NS_btest_build
[ 56%] Linking CXX executable IntegrandCell_HDG_NS_btest
[ 56%] Built target IntegrandCell_HDG_NS_btest_build
Scanning dependencies of target IntegrandFunctor_HDG_HB_AD_btest_OBJECT
[ 56%] Building CXX object test/unit/Discretization/HDG/CMakeFiles/IntegrandFunctor_HDG_HB_AD_btest_OBJECT.dir/IntegrandFunctor_HDG_HB_AD_btest.cpp.o
[ 56%] Built target IntegrandFunctor_HDG_HB_AD_btest_OBJECT
Scanning dependencies of target IntegrandFunctor_HDG_HB_AD_btest_build_vera
[ 56%] Checking style of test/unit/Discretization/HDG/IntegrandFunctor_HDG_HB_AD_btest.cpp
[ 56%] Built target IntegrandFunctor_HDG_HB_AD_btest_build_vera
Scanning dependencies of target IntegrandFunctor_HDG_HB_AD_btest_build
[ 56%] Linking CXX executable IntegrandFunctor_HDG_HB_AD_btest
[ 56%] Built target IntegrandFunctor_HDG_HB_AD_btest_build
Scanning dependencies of target JacobianBoundaryTrace_LinearScalar_sansLG_HDG_AD_btest_build_vera
[ 56%] Checking style of test/unit/Discretization/HDG/JacobianBoundaryTrace_LinearScalar_sansLG_HDG_AD_btest.cpp
[ 56%] Built target JacobianBoundaryTrace_LinearScalar_sansLG_HDG_AD_btest_build_vera
Scanning dependencies of target JacobianBoundaryTrace_LinearScalar_sansLG_HDG_AD_btest_OBJECT
[ 58%] Building CXX object test/unit/Discretization/HDG/CMakeFiles/JacobianBoundaryTrace_LinearScalar_sansLG_HDG_AD_btest_OBJECT.dir/JacobianBoundaryTrace_LinearScalar_sansLG_HDG_AD_btest.cpp.o
[ 58%] Built target JacobianBoundaryTrace_LinearScalar_sansLG_HDG_AD_btest_OBJECT
Scanning dependencies of target JacobianBoundaryTrace_LinearScalar_sansLG_HDG_AD_btest_build
[ 58%] Linking CXX executable JacobianBoundaryTrace_LinearScalar_sansLG_HDG_AD_btest
[ 58%] Built target JacobianBoundaryTrace_LinearScalar_sansLG_HDG_AD_btest_build
Scanning dependencies of target JacobianBoundaryTrace_Flux_mitState_HDG_AD_btest_OBJECT
[ 58%] Building CXX object test/unit/Discretization/HDG/CMakeFiles/JacobianBoundaryTrace_Flux_mitState_HDG_AD_btest_OBJECT.dir/JacobianBoundaryTrace_Flux_mitState_HDG_AD_btest.cpp.o
[ 58%] Built target JacobianBoundaryTrace_Flux_mitState_HDG_AD_btest_OBJECT
Scanning dependencies of target JacobianBoundaryTrace_Flux_mitState_HDG_AD_btest_build_vera
[ 58%] Checking style of test/unit/Discretization/HDG/JacobianBoundaryTrace_Flux_mitState_HDG_AD_btest.cpp
[ 58%] Built target JacobianBoundaryTrace_Flux_mitState_HDG_AD_btest_build_vera
Scanning dependencies of target JacobianBoundaryTrace_Flux_mitState_HDG_AD_btest_build
[ 58%] Linking CXX executable JacobianBoundaryTrace_Flux_mitState_HDG_AD_btest
[ 58%] Built target JacobianBoundaryTrace_Flux_mitState_HDG_AD_btest_build
Scanning dependencies of target AlgebraicEquationSet_HDGAdvective_Line_IBL_airfoilOnly_btest_build_vera
[ 58%] Checking style of test/unit/Discretization/HDG/AlgebraicEquationSet_HDGAdvective_Line_IBL_airfoilOnly_btest.cpp
[ 58%] Built target AlgebraicEquationSet_HDGAdvective_Line_IBL_airfoilOnly_btest_build_vera
Scanning dependencies of target AlgebraicEquationSet_HDGAdvective_Line_IBL_airfoilOnly_btest_OBJECT
[ 58%] Building CXX object test/unit/Discretization/HDG/CMakeFiles/AlgebraicEquationSet_HDGAdvective_Line_IBL_airfoilOnly_btest_OBJECT.dir/AlgebraicEquationSet_HDGAdvective_Line_IBL_airfoilOnly_btest.cpp.o
[ 58%] Built target AlgebraicEquationSet_HDGAdvective_Line_IBL_airfoilOnly_btest_OBJECT
Scanning dependencies of target AlgebraicEquationSet_HDGAdvective_Line_IBL_airfoilOnly_btest_build
[ 58%] Linking CXX executable AlgebraicEquationSet_HDGAdvective_Line_IBL_airfoilOnly_btest
[ 58%] Built target AlgebraicEquationSet_HDGAdvective_Line_IBL_airfoilOnly_btest_build
Scanning dependencies of target IntegrandBoundaryTrace_Output_HDG_btest_build_vera
[ 58%] Checking style of test/unit/Discretization/HDG/IntegrandBoundaryTrace_Output_HDG_btest.cpp
[ 58%] Built target IntegrandBoundaryTrace_Output_HDG_btest_build_vera
Scanning dependencies of target IntegrandBoundaryTrace_Output_HDG_btest_OBJECT
[ 58%] Building CXX object test/unit/Discretization/HDG/CMakeFiles/IntegrandBoundaryTrace_Output_HDG_btest_OBJECT.dir/IntegrandBoundaryTrace_Output_HDG_btest.cpp.o
[ 58%] Built target IntegrandBoundaryTrace_Output_HDG_btest_OBJECT
Scanning dependencies of target IntegrandBoundaryTrace_Output_HDG_btest_build
[ 58%] Linking CXX executable IntegrandBoundaryTrace_Output_HDG_btest
[ 58%] Built target IntegrandBoundaryTrace_Output_HDG_btest_build
Scanning dependencies of target FunctionalBoundaryTrace_HDG_sansLG_btest_build_vera
[ 58%] Checking style of test/unit/Discretization/HDG/FunctionalBoundaryTrace_HDG_sansLG_btest.cpp
[ 58%] Built target FunctionalBoundaryTrace_HDG_sansLG_btest_build_vera
Scanning dependencies of target FunctionalBoundaryTrace_HDG_sansLG_btest_OBJECT
[ 58%] Building CXX object test/unit/Discretization/HDG/CMakeFiles/FunctionalBoundaryTrace_HDG_sansLG_btest_OBJECT.dir/FunctionalBoundaryTrace_HDG_sansLG_btest.cpp.o
[ 58%] Built target FunctionalBoundaryTrace_HDG_sansLG_btest_OBJECT
Scanning dependencies of target FunctionalBoundaryTrace_HDG_sansLG_btest_build
[ 58%] Linking CXX executable FunctionalBoundaryTrace_HDG_sansLG_btest
[ 58%] Built target FunctionalBoundaryTrace_HDG_sansLG_btest_build
Scanning dependencies of target JacobianInteriorTrace_HDG_AD_btest_build_vera
[ 58%] Checking style of test/unit/Discretization/HDG/JacobianInteriorTrace_HDG_AD_btest.cpp
[ 58%] Built target JacobianInteriorTrace_HDG_AD_btest_build_vera
Scanning dependencies of target JacobianInteriorTrace_HDG_AD_btest_OBJECT
[ 58%] Building CXX object test/unit/Discretization/HDG/CMakeFiles/JacobianInteriorTrace_HDG_AD_btest_OBJECT.dir/JacobianInteriorTrace_HDG_AD_btest.cpp.o
[ 58%] Built target JacobianInteriorTrace_HDG_AD_btest_OBJECT
Scanning dependencies of target JacobianInteriorTrace_HDG_AD_btest_build
[ 58%] Linking CXX executable JacobianInteriorTrace_HDG_AD_btest
[ 58%] Built target JacobianInteriorTrace_HDG_AD_btest_build
Scanning dependencies of target IntegrandInteriorTrace_HDG_AD_btest_build_vera
[ 58%] Checking style of test/unit/Discretization/HDG/IntegrandInteriorTrace_HDG_AD_btest.cpp
[ 58%] Built target IntegrandInteriorTrace_HDG_AD_btest_build_vera
Scanning dependencies of target IntegrandInteriorTrace_HDG_AD_btest_OBJECT
[ 58%] Building CXX object test/unit/Discretization/HDG/CMakeFiles/IntegrandInteriorTrace_HDG_AD_btest_OBJECT.dir/IntegrandInteriorTrace_HDG_AD_btest.cpp.o
[ 58%] Built target IntegrandInteriorTrace_HDG_AD_btest_OBJECT
Scanning dependencies of target IntegrandInteriorTrace_HDG_AD_btest_build
[ 58%] Linking CXX executable IntegrandInteriorTrace_HDG_AD_btest
[ 58%] Built target IntegrandInteriorTrace_HDG_AD_btest_build
Scanning dependencies of target IntegrandCell_HDG_AD_btest_build_vera
[ 58%] Checking style of test/unit/Discretization/HDG/IntegrandCell_HDG_AD_btest.cpp
[ 58%] Built target IntegrandCell_HDG_AD_btest_build_vera
Scanning dependencies of target IntegrandCell_HDG_AD_btest_OBJECT
[ 58%] Building CXX object test/unit/Discretization/HDG/CMakeFiles/IntegrandCell_HDG_AD_btest_OBJECT.dir/IntegrandCell_HDG_AD_btest.cpp.o
[ 58%] Built target IntegrandCell_HDG_AD_btest_OBJECT
Scanning dependencies of target IntegrandCell_HDG_AD_btest_build
[ 58%] Linking CXX executable IntegrandCell_HDG_AD_btest
[ 58%] Built target IntegrandCell_HDG_AD_btest_build
Scanning dependencies of target JacobianFunctionalCell_HDG_btest_OBJECT
[ 58%] Building CXX object test/unit/Discretization/HDG/CMakeFiles/JacobianFunctionalCell_HDG_btest_OBJECT.dir/JacobianFunctionalCell_HDG_btest.cpp.o
[ 58%] Built target JacobianFunctionalCell_HDG_btest_OBJECT
Scanning dependencies of target JacobianFunctionalCell_HDG_btest_build_vera
[ 58%] Checking style of test/unit/Discretization/HDG/JacobianFunctionalCell_HDG_btest.cpp
[ 58%] Built target JacobianFunctionalCell_HDG_btest_build_vera
Scanning dependencies of target JacobianFunctionalCell_HDG_btest_build
[ 58%] Linking CXX executable JacobianFunctionalCell_HDG_btest
[ 58%] Built target JacobianFunctionalCell_HDG_btest_build
Scanning dependencies of target isValidStateInteriorTrace_HDG_Euler_btest_OBJECT
[ 58%] Building CXX object test/unit/Discretization/HDG/CMakeFiles/isValidStateInteriorTrace_HDG_Euler_btest_OBJECT.dir/isValidStateInteriorTrace_HDG_Euler_btest.cpp.o
[ 58%] Built target isValidStateInteriorTrace_HDG_Euler_btest_OBJECT
Scanning dependencies of target isValidStateInteriorTrace_HDG_Euler_btest_build_vera
[ 58%] Checking style of test/unit/Discretization/HDG/isValidStateInteriorTrace_HDG_Euler_btest.cpp
[ 58%] Built target isValidStateInteriorTrace_HDG_Euler_btest_build_vera
Scanning dependencies of target isValidStateInteriorTrace_HDG_Euler_btest_build
[ 58%] Linking CXX executable isValidStateInteriorTrace_HDG_Euler_btest
[ 58%] Built target isValidStateInteriorTrace_HDG_Euler_btest_build
Scanning dependencies of target ResidualBoundaryTrace_Dirichlet_mitState_HDG_AD_btest_build_vera
[ 58%] Checking style of test/unit/Discretization/HDG/ResidualBoundaryTrace_Dirichlet_mitState_HDG_AD_btest.cpp
[ 58%] Built target ResidualBoundaryTrace_Dirichlet_mitState_HDG_AD_btest_build_vera
Scanning dependencies of target ResidualBoundaryTrace_Dirichlet_mitState_HDG_AD_btest_OBJECT
[ 58%] Building CXX object test/unit/Discretization/HDG/CMakeFiles/ResidualBoundaryTrace_Dirichlet_mitState_HDG_AD_btest_OBJECT.dir/ResidualBoundaryTrace_Dirichlet_mitState_HDG_AD_btest.cpp.o
[ 58%] Built target ResidualBoundaryTrace_Dirichlet_mitState_HDG_AD_btest_OBJECT
Scanning dependencies of target ResidualBoundaryTrace_Dirichlet_mitState_HDG_AD_btest_build
[ 58%] Linking CXX executable ResidualBoundaryTrace_Dirichlet_mitState_HDG_AD_btest
[ 58%] Built target ResidualBoundaryTrace_Dirichlet_mitState_HDG_AD_btest_build
Scanning dependencies of target ResidualInteriorTrace_HDG_AD_btest_OBJECT
[ 58%] Building CXX object test/unit/Discretization/HDG/CMakeFiles/ResidualInteriorTrace_HDG_AD_btest_OBJECT.dir/ResidualInteriorTrace_HDG_AD_btest.cpp.o
[ 58%] Built target ResidualInteriorTrace_HDG_AD_btest_OBJECT
Scanning dependencies of target ResidualInteriorTrace_HDG_AD_btest_build_vera
[ 58%] Checking style of test/unit/Discretization/HDG/ResidualInteriorTrace_HDG_AD_btest.cpp
[ 58%] Built target ResidualInteriorTrace_HDG_AD_btest_build_vera
Scanning dependencies of target ResidualInteriorTrace_HDG_AD_btest_build
[ 58%] Linking CXX executable ResidualInteriorTrace_HDG_AD_btest
[ 58%] Built target ResidualInteriorTrace_HDG_AD_btest_build
Scanning dependencies of target FunctionalCellwise_HDG_btest_build_vera
[ 58%] Checking style of test/unit/Discretization/HDG/FunctionalCellwise_HDG_btest.cpp
[ 58%] Built target FunctionalCellwise_HDG_btest_build_vera
Scanning dependencies of target FunctionalCellwise_HDG_btest_OBJECT
[ 58%] Building CXX object test/unit/Discretization/HDG/CMakeFiles/FunctionalCellwise_HDG_btest_OBJECT.dir/FunctionalCellwise_HDG_btest.cpp.o
[ 58%] Built target FunctionalCellwise_HDG_btest_OBJECT
Scanning dependencies of target FunctionalCellwise_HDG_btest_build
[ 58%] Linking CXX executable FunctionalCellwise_HDG_btest
[ 58%] Built target FunctionalCellwise_HDG_btest_build
Scanning dependencies of target AuxiliaryAdjoint_HDG_AD_btest_OBJECT
[ 58%] Building CXX object test/unit/Discretization/HDG/CMakeFiles/AuxiliaryAdjoint_HDG_AD_btest_OBJECT.dir/AuxiliaryAdjoint_HDG_AD_btest.cpp.o
[ 58%] Built target AuxiliaryAdjoint_HDG_AD_btest_OBJECT
Scanning dependencies of target AuxiliaryAdjoint_HDG_AD_btest_build_vera
[ 58%] Checking style of test/unit/Discretization/HDG/AuxiliaryAdjoint_HDG_AD_btest.cpp
[ 58%] Built target AuxiliaryAdjoint_HDG_AD_btest_build_vera
Scanning dependencies of target AuxiliaryAdjoint_HDG_AD_btest_build
[ 58%] Linking CXX executable AuxiliaryAdjoint_HDG_AD_btest
[ 58%] Built target AuxiliaryAdjoint_HDG_AD_btest_build
Scanning dependencies of target IntegrandBoundaryTrace_LinearScalar_sansLG_HDG_AD_btest_build_vera
[ 58%] Checking style of test/unit/Discretization/HDG/IntegrandBoundaryTrace_LinearScalar_sansLG_HDG_AD_btest.cpp
[ 58%] Built target IntegrandBoundaryTrace_LinearScalar_sansLG_HDG_AD_btest_build_vera
Scanning dependencies of target IntegrandBoundaryTrace_LinearScalar_sansLG_HDG_AD_btest_OBJECT
[ 58%] Building CXX object test/unit/Discretization/HDG/CMakeFiles/IntegrandBoundaryTrace_LinearScalar_sansLG_HDG_AD_btest_OBJECT.dir/IntegrandBoundaryTrace_LinearScalar_sansLG_HDG_AD_btest.cpp.o
[ 58%] Built target IntegrandBoundaryTrace_LinearScalar_sansLG_HDG_AD_btest_OBJECT
Scanning dependencies of target IntegrandBoundaryTrace_LinearScalar_sansLG_HDG_AD_btest_build
[ 58%] Linking CXX executable IntegrandBoundaryTrace_LinearScalar_sansLG_HDG_AD_btest
[ 58%] Built target IntegrandBoundaryTrace_LinearScalar_sansLG_HDG_AD_btest_build
Scanning dependencies of target IntegrandBoundaryTrace_Flux_mitState_HDG_AD_btest_build_vera
[ 58%] Checking style of test/unit/Discretization/HDG/IntegrandBoundaryTrace_Flux_mitState_HDG_AD_btest.cpp
[ 58%] Built target IntegrandBoundaryTrace_Flux_mitState_HDG_AD_btest_build_vera
Scanning dependencies of target IntegrandBoundaryTrace_Flux_mitState_HDG_AD_btest_OBJECT
[ 60%] Building CXX object test/unit/Discretization/HDG/CMakeFiles/IntegrandBoundaryTrace_Flux_mitState_HDG_AD_btest_OBJECT.dir/IntegrandBoundaryTrace_Flux_mitState_HDG_AD_btest.cpp.o
[ 60%] Built target IntegrandBoundaryTrace_Flux_mitState_HDG_AD_btest_OBJECT
Scanning dependencies of target IntegrandBoundaryTrace_Flux_mitState_HDG_AD_btest_build
[ 60%] Linking CXX executable IntegrandBoundaryTrace_Flux_mitState_HDG_AD_btest
[ 60%] Built target IntegrandBoundaryTrace_Flux_mitState_HDG_AD_btest_build
Scanning dependencies of target DiscretizationHDG_btest_OBJECT
[ 60%] Building CXX object test/unit/Discretization/HDG/CMakeFiles/DiscretizationHDG_btest_OBJECT.dir/DiscretizationHDG_btest.cpp.o
[ 60%] Built target DiscretizationHDG_btest_OBJECT
Scanning dependencies of target DiscretizationHDG_btest_build_vera
[ 60%] Checking style of test/unit/Discretization/HDG/DiscretizationHDG_btest.cpp
[ 60%] Built target DiscretizationHDG_btest_build_vera
Scanning dependencies of target DiscretizationHDG_btest_build
[ 60%] Linking CXX executable DiscretizationHDG_btest
[ 60%] Built target DiscretizationHDG_btest_build
Scanning dependencies of target JacobianBoundaryTrace_Flux_mitState_HDG_Euler_btest_build_vera
[ 60%] Checking style of test/unit/Discretization/HDG/JacobianBoundaryTrace_Flux_mitState_HDG_Euler_btest.cpp
[ 60%] Built target JacobianBoundaryTrace_Flux_mitState_HDG_Euler_btest_build_vera
Scanning dependencies of target JacobianBoundaryTrace_Flux_mitState_HDG_Euler_btest_OBJECT
[ 60%] Building CXX object test/unit/Discretization/HDG/CMakeFiles/JacobianBoundaryTrace_Flux_mitState_HDG_Euler_btest_OBJECT.dir/JacobianBoundaryTrace_Flux_mitState_HDG_Euler_btest.cpp.o
[ 60%] Built target JacobianBoundaryTrace_Flux_mitState_HDG_Euler_btest_OBJECT
Scanning dependencies of target JacobianBoundaryTrace_Flux_mitState_HDG_Euler_btest_build
[ 60%] Linking CXX executable JacobianBoundaryTrace_Flux_mitState_HDG_Euler_btest
[ 60%] Built target JacobianBoundaryTrace_Flux_mitState_HDG_Euler_btest_build
Scanning dependencies of target AlgebraicEquationSet_Local_HDG_Line_AD_btest_build_vera
[ 60%] Checking style of test/unit/Discretization/HDG/AlgebraicEquationSet_Local_HDG_Line_AD_btest.cpp
[ 60%] Built target AlgebraicEquationSet_Local_HDG_Line_AD_btest_build_vera
Scanning dependencies of target AlgebraicEquationSet_Local_HDG_Line_AD_btest_OBJECT
[ 60%] Building CXX object test/unit/Discretization/HDG/CMakeFiles/AlgebraicEquationSet_Local_HDG_Line_AD_btest_OBJECT.dir/AlgebraicEquationSet_Local_HDG_Line_AD_btest.cpp.o
[ 60%] Built target AlgebraicEquationSet_Local_HDG_Line_AD_btest_OBJECT
Scanning dependencies of target AlgebraicEquationSet_Local_HDG_Line_AD_btest_build
[ 60%] Linking CXX executable AlgebraicEquationSet_Local_HDG_Line_AD_btest
[ 60%] Built target AlgebraicEquationSet_Local_HDG_Line_AD_btest_build
Scanning dependencies of target JacobianBoundaryTrace_Dirichlet_mitState_HDG_AD_btest_OBJECT
[ 60%] Building CXX object test/unit/Discretization/HDG/CMakeFiles/JacobianBoundaryTrace_Dirichlet_mitState_HDG_AD_btest_OBJECT.dir/JacobianBoundaryTrace_Dirichlet_mitState_HDG_AD_btest.cpp.o
[ 60%] Built target JacobianBoundaryTrace_Dirichlet_mitState_HDG_AD_btest_OBJECT
Scanning dependencies of target JacobianBoundaryTrace_Dirichlet_mitState_HDG_AD_btest_build_vera
[ 60%] Checking style of test/unit/Discretization/HDG/JacobianBoundaryTrace_Dirichlet_mitState_HDG_AD_btest.cpp
[ 60%] Built target JacobianBoundaryTrace_Dirichlet_mitState_HDG_AD_btest_build_vera
Scanning dependencies of target JacobianBoundaryTrace_Dirichlet_mitState_HDG_AD_btest_build
[ 60%] Linking CXX executable JacobianBoundaryTrace_Dirichlet_mitState_HDG_AD_btest
[ 60%] Built target JacobianBoundaryTrace_Dirichlet_mitState_HDG_AD_btest_build
Scanning dependencies of target AlgebraicEquationSet_Local_HDG_Triangle_AD_btest_OBJECT
[ 60%] Building CXX object test/unit/Discretization/HDG/CMakeFiles/AlgebraicEquationSet_Local_HDG_Triangle_AD_btest_OBJECT.dir/AlgebraicEquationSet_Local_HDG_Triangle_AD_btest.cpp.o
[ 60%] Built target AlgebraicEquationSet_Local_HDG_Triangle_AD_btest_OBJECT
Scanning dependencies of target AlgebraicEquationSet_Local_HDG_Triangle_AD_btest_build_vera
[ 60%] Checking style of test/unit/Discretization/HDG/AlgebraicEquationSet_Local_HDG_Triangle_AD_btest.cpp
[ 60%] Built target AlgebraicEquationSet_Local_HDG_Triangle_AD_btest_build_vera
Scanning dependencies of target AlgebraicEquationSet_Local_HDG_Triangle_AD_btest_build
[ 60%] Linking CXX executable AlgebraicEquationSet_Local_HDG_Triangle_AD_btest
[ 60%] Built target AlgebraicEquationSet_Local_HDG_Triangle_AD_btest_build
Scanning dependencies of target AuxiliaryAdjoint_HDG_NS_btest_OBJECT
[ 60%] Building CXX object test/unit/Discretization/HDG/CMakeFiles/AuxiliaryAdjoint_HDG_NS_btest_OBJECT.dir/AuxiliaryAdjoint_HDG_NS_btest.cpp.o
[ 60%] Built target AuxiliaryAdjoint_HDG_NS_btest_OBJECT
Scanning dependencies of target AuxiliaryAdjoint_HDG_NS_btest_build_vera
[ 60%] Checking style of test/unit/Discretization/HDG/AuxiliaryAdjoint_HDG_NS_btest.cpp
[ 60%] Built target AuxiliaryAdjoint_HDG_NS_btest_build_vera
Scanning dependencies of target AuxiliaryAdjoint_HDG_NS_btest_build
[ 60%] Linking CXX executable AuxiliaryAdjoint_HDG_NS_btest
[ 60%] Built target AuxiliaryAdjoint_HDG_NS_btest_build
Scanning dependencies of target IntegrandFunctor_HDG_ST_AD_btest_build_vera
[ 60%] Checking style of test/unit/Discretization/HDG/IntegrandFunctor_HDG_ST_AD_btest.cpp
[ 60%] Built target IntegrandFunctor_HDG_ST_AD_btest_build_vera
Scanning dependencies of target IntegrandFunctor_HDG_ST_AD_btest_OBJECT
[ 60%] Building CXX object test/unit/Discretization/HDG/CMakeFiles/IntegrandFunctor_HDG_ST_AD_btest_OBJECT.dir/IntegrandFunctor_HDG_ST_AD_btest.cpp.o
[ 60%] Built target IntegrandFunctor_HDG_ST_AD_btest_OBJECT
Scanning dependencies of target IntegrandFunctor_HDG_ST_AD_btest_build
[ 60%] Linking CXX executable IntegrandFunctor_HDG_ST_AD_btest
[ 60%] Built target IntegrandFunctor_HDG_ST_AD_btest_build
Scanning dependencies of target JacobianCell_HDG_HB_AD_btest_build_vera
[ 60%] Checking style of test/unit/Discretization/HDG/JacobianCell_HDG_HB_AD_btest.cpp
[ 60%] Built target JacobianCell_HDG_HB_AD_btest_build_vera
Scanning dependencies of target JacobianCell_HDG_HB_AD_btest_OBJECT
[ 60%] Building CXX object test/unit/Discretization/HDG/CMakeFiles/JacobianCell_HDG_HB_AD_btest_OBJECT.dir/JacobianCell_HDG_HB_AD_btest.cpp.o
[ 60%] Built target JacobianCell_HDG_HB_AD_btest_OBJECT
Scanning dependencies of target JacobianCell_HDG_HB_AD_btest_build
[ 60%] Linking CXX executable JacobianCell_HDG_HB_AD_btest
[ 60%] Built target JacobianCell_HDG_HB_AD_btest_build
Scanning dependencies of target JacobianFunctionalBoundaryTrace_HDG_sansLG_btest_build_vera
[ 60%] Checking style of test/unit/Discretization/HDG/JacobianFunctionalBoundaryTrace_HDG_sansLG_btest.cpp
[ 60%] Built target JacobianFunctionalBoundaryTrace_HDG_sansLG_btest_build_vera
Scanning dependencies of target JacobianFunctionalBoundaryTrace_HDG_sansLG_btest_OBJECT
[ 60%] Building CXX object test/unit/Discretization/HDG/CMakeFiles/JacobianFunctionalBoundaryTrace_HDG_sansLG_btest_OBJECT.dir/JacobianFunctionalBoundaryTrace_HDG_sansLG_btest.cpp.o
[ 60%] Built target JacobianFunctionalBoundaryTrace_HDG_sansLG_btest_OBJECT
Scanning dependencies of target JacobianFunctionalBoundaryTrace_HDG_sansLG_btest_build
[ 60%] Linking CXX executable JacobianFunctionalBoundaryTrace_HDG_sansLG_btest
[ 60%] Built target JacobianFunctionalBoundaryTrace_HDG_sansLG_btest_build
Scanning dependencies of target ResidualCell_HDG_AD_btest_OBJECT
[ 60%] Building CXX object test/unit/Discretization/HDG/CMakeFiles/ResidualCell_HDG_AD_btest_OBJECT.dir/ResidualCell_HDG_AD_btest.cpp.o
[ 60%] Built target ResidualCell_HDG_AD_btest_OBJECT
Scanning dependencies of target ResidualCell_HDG_AD_btest_build_vera
[ 60%] Checking style of test/unit/Discretization/HDG/ResidualCell_HDG_AD_btest.cpp
[ 60%] Built target ResidualCell_HDG_AD_btest_build_vera
Scanning dependencies of target ResidualCell_HDG_AD_btest_build
[ 60%] Linking CXX executable ResidualCell_HDG_AD_btest
[ 60%] Built target ResidualCell_HDG_AD_btest_build
Scanning dependencies of target ResidualBoundaryTrace_Flux_mitState_HDG_AD_btest_build_vera
[ 60%] Checking style of test/unit/Discretization/HDG/ResidualBoundaryTrace_Flux_mitState_HDG_AD_btest.cpp
[ 60%] Built target ResidualBoundaryTrace_Flux_mitState_HDG_AD_btest_build_vera
Scanning dependencies of target ResidualBoundaryTrace_Flux_mitState_HDG_AD_btest_OBJECT
[ 60%] Building CXX object test/unit/Discretization/HDG/CMakeFiles/ResidualBoundaryTrace_Flux_mitState_HDG_AD_btest_OBJECT.dir/ResidualBoundaryTrace_Flux_mitState_HDG_AD_btest.cpp.o
[ 60%] Built target ResidualBoundaryTrace_Flux_mitState_HDG_AD_btest_OBJECT
Scanning dependencies of target ResidualBoundaryTrace_Flux_mitState_HDG_AD_btest_build
[ 60%] Linking CXX executable ResidualBoundaryTrace_Flux_mitState_HDG_AD_btest
[ 60%] Built target ResidualBoundaryTrace_Flux_mitState_HDG_AD_btest_build
Scanning dependencies of target JacobianCell_HDG_AD_btest_OBJECT
[ 60%] Building CXX object test/unit/Discretization/HDG/CMakeFiles/JacobianCell_HDG_AD_btest_OBJECT.dir/JacobianCell_HDG_AD_btest.cpp.o
[ 60%] Built target JacobianCell_HDG_AD_btest_OBJECT
Scanning dependencies of target JacobianCell_HDG_AD_btest_build_vera
[ 60%] Checking style of test/unit/Discretization/HDG/JacobianCell_HDG_AD_btest.cpp
[ 60%] Built target JacobianCell_HDG_AD_btest_build_vera
Scanning dependencies of target JacobianCell_HDG_AD_btest_build
[ 60%] Linking CXX executable JacobianCell_HDG_AD_btest
[ 60%] Built target JacobianCell_HDG_AD_btest_build
Scanning dependencies of target IntegrandInteriorTrace_HDG_NS_btest_OBJECT
[ 60%] Building CXX object test/unit/Discretization/HDG/CMakeFiles/IntegrandInteriorTrace_HDG_NS_btest_OBJECT.dir/IntegrandInteriorTrace_HDG_NS_btest.cpp.o
[ 60%] Built target IntegrandInteriorTrace_HDG_NS_btest_OBJECT
Scanning dependencies of target IntegrandInteriorTrace_HDG_NS_btest_build_vera
[ 60%] Checking style of test/unit/Discretization/HDG/IntegrandInteriorTrace_HDG_NS_btest.cpp
[ 60%] Built target IntegrandInteriorTrace_HDG_NS_btest_build_vera
Scanning dependencies of target IntegrandInteriorTrace_HDG_NS_btest_build
[ 60%] Linking CXX executable IntegrandInteriorTrace_HDG_NS_btest
[ 60%] Built target IntegrandInteriorTrace_HDG_NS_btest_build
Scanning dependencies of target AlgebraicEquationSet_Hubtrace_HDGAdvective_IBL_btest_OBJECT
[ 60%] Building CXX object test/unit/Discretization/HDG/CMakeFiles/AlgebraicEquationSet_Hubtrace_HDGAdvective_IBL_btest_OBJECT.dir/AlgebraicEquationSet_Hubtrace_HDGAdvective_IBL_btest.cpp.o
[ 60%] Built target AlgebraicEquationSet_Hubtrace_HDGAdvective_IBL_btest_OBJECT
Scanning dependencies of target AlgebraicEquationSet_Hubtrace_HDGAdvective_IBL_btest_build_vera
[ 60%] Checking style of test/unit/Discretization/HDG/AlgebraicEquationSet_Hubtrace_HDGAdvective_IBL_btest.cpp
[ 60%] Built target AlgebraicEquationSet_Hubtrace_HDGAdvective_IBL_btest_build_vera
Scanning dependencies of target AlgebraicEquationSet_Hubtrace_HDGAdvective_IBL_btest_build
[ 60%] Linking CXX executable AlgebraicEquationSet_Hubtrace_HDGAdvective_IBL_btest
[ 60%] Built target AlgebraicEquationSet_Hubtrace_HDGAdvective_IBL_btest_build
Scanning dependencies of target AlgebraicEquationSet_HDGAdvective_Advection_btest_build_vera
[ 60%] Checking style of test/unit/Discretization/HDG/AlgebraicEquationSet_HDGAdvective_Advection_btest.cpp
[ 60%] Built target AlgebraicEquationSet_HDGAdvective_Advection_btest_build_vera
Scanning dependencies of target AlgebraicEquationSet_HDGAdvective_Advection_btest_OBJECT
[ 60%] Building CXX object test/unit/Discretization/HDG/CMakeFiles/AlgebraicEquationSet_HDGAdvective_Advection_btest_OBJECT.dir/AlgebraicEquationSet_HDGAdvective_Advection_btest.cpp.o
[ 60%] Built target AlgebraicEquationSet_HDGAdvective_Advection_btest_OBJECT
Scanning dependencies of target AlgebraicEquationSet_HDGAdvective_Advection_btest_build
[ 60%] Linking CXX executable AlgebraicEquationSet_HDGAdvective_Advection_btest
[ 60%] Built target AlgebraicEquationSet_HDGAdvective_Advection_btest_build
Scanning dependencies of target IntegrandBoundaryTrace_LinearScalar_mitLG_HDG_AD_btest_OBJECT
[ 60%] Building CXX object test/unit/Discretization/HDG/CMakeFiles/IntegrandBoundaryTrace_LinearScalar_mitLG_HDG_AD_btest_OBJECT.dir/IntegrandBoundaryTrace_LinearScalar_mitLG_HDG_AD_btest.cpp.o
[ 60%] Built target IntegrandBoundaryTrace_LinearScalar_mitLG_HDG_AD_btest_OBJECT
Scanning dependencies of target IntegrandBoundaryTrace_LinearScalar_mitLG_HDG_AD_btest_build_vera
[ 60%] Checking style of test/unit/Discretization/HDG/IntegrandBoundaryTrace_LinearScalar_mitLG_HDG_AD_btest.cpp
[ 60%] Built target IntegrandBoundaryTrace_LinearScalar_mitLG_HDG_AD_btest_build_vera
Scanning dependencies of target IntegrandBoundaryTrace_LinearScalar_mitLG_HDG_AD_btest_build
[ 60%] Linking CXX executable IntegrandBoundaryTrace_LinearScalar_mitLG_HDG_AD_btest
[ 60%] Built target IntegrandBoundaryTrace_LinearScalar_mitLG_HDG_AD_btest_build
Scanning dependencies of target IntegrandBoundaryTrace_Dirichlet_mitState_HDG_AD_btest_build_vera
[ 60%] Checking style of test/unit/Discretization/HDG/IntegrandBoundaryTrace_Dirichlet_mitState_HDG_AD_btest.cpp
[ 60%] Built target IntegrandBoundaryTrace_Dirichlet_mitState_HDG_AD_btest_build_vera
Scanning dependencies of target IntegrandBoundaryTrace_Dirichlet_mitState_HDG_AD_btest_OBJECT
[ 60%] Building CXX object test/unit/Discretization/HDG/CMakeFiles/IntegrandBoundaryTrace_Dirichlet_mitState_HDG_AD_btest_OBJECT.dir/IntegrandBoundaryTrace_Dirichlet_mitState_HDG_AD_btest.cpp.o
[ 60%] Built target IntegrandBoundaryTrace_Dirichlet_mitState_HDG_AD_btest_OBJECT
Scanning dependencies of target IntegrandBoundaryTrace_Dirichlet_mitState_HDG_AD_btest_build
[ 60%] Linking CXX executable IntegrandBoundaryTrace_Dirichlet_mitState_HDG_AD_btest
[ 60%] Built target IntegrandBoundaryTrace_Dirichlet_mitState_HDG_AD_btest_build
Scanning dependencies of target FunctionalCell_HDG_btest_OBJECT
[ 60%] Building CXX object test/unit/Discretization/HDG/CMakeFiles/FunctionalCell_HDG_btest_OBJECT.dir/FunctionalCell_HDG_btest.cpp.o
[ 60%] Built target FunctionalCell_HDG_btest_OBJECT
Scanning dependencies of target FunctionalCell_HDG_btest_build_vera
[ 60%] Checking style of test/unit/Discretization/HDG/FunctionalCell_HDG_btest.cpp
[ 60%] Built target FunctionalCell_HDG_btest_build_vera
Scanning dependencies of target FunctionalCell_HDG_btest_build
[ 60%] Linking CXX executable FunctionalCell_HDG_btest
[ 60%] Built target FunctionalCell_HDG_btest_build
Scanning dependencies of target SetFieldCell_HDG_AuxiliaryVariable_AD_btest_build_vera
[ 60%] Checking style of test/unit/Discretization/HDG/SetFieldCell_HDG_AuxiliaryVariable_AD_btest.cpp
[ 60%] Built target SetFieldCell_HDG_AuxiliaryVariable_AD_btest_build_vera
Scanning dependencies of target SetFieldCell_HDG_AuxiliaryVariable_AD_btest_OBJECT
[ 60%] Building CXX object test/unit/Discretization/HDG/CMakeFiles/SetFieldCell_HDG_AuxiliaryVariable_AD_btest_OBJECT.dir/SetFieldCell_HDG_AuxiliaryVariable_AD_btest.cpp.o
[ 60%] Built target SetFieldCell_HDG_AuxiliaryVariable_AD_btest_OBJECT
Scanning dependencies of target SetFieldCell_HDG_AuxiliaryVariable_AD_btest_build
[ 60%] Linking CXX executable SetFieldCell_HDG_AuxiliaryVariable_AD_btest
[ 60%] Built target SetFieldCell_HDG_AuxiliaryVariable_AD_btest_build
Scanning dependencies of target AlgebraicEquationSet_HDG_BuckleyLeverett_ST_btest_OBJECT
[ 60%] Building CXX object test/unit/Discretization/HDG/CMakeFiles/AlgebraicEquationSet_HDG_BuckleyLeverett_ST_btest_OBJECT.dir/AlgebraicEquationSet_HDG_BuckleyLeverett_ST_btest.cpp.o
[ 60%] Built target AlgebraicEquationSet_HDG_BuckleyLeverett_ST_btest_OBJECT
Scanning dependencies of target AlgebraicEquationSet_HDG_BuckleyLeverett_ST_btest_build_vera
[ 60%] Checking style of test/unit/Discretization/HDG/AlgebraicEquationSet_HDG_BuckleyLeverett_ST_btest.cpp
[ 60%] Built target AlgebraicEquationSet_HDG_BuckleyLeverett_ST_btest_build_vera
Scanning dependencies of target AlgebraicEquationSet_HDG_BuckleyLeverett_ST_btest_build
[ 60%] Linking CXX executable AlgebraicEquationSet_HDG_BuckleyLeverett_ST_btest
[ 60%] Built target AlgebraicEquationSet_HDG_BuckleyLeverett_ST_btest_build
Scanning dependencies of target ResidualCell_HDG_HB_AD_btest_OBJECT
[ 60%] Building CXX object test/unit/Discretization/HDG/CMakeFiles/ResidualCell_HDG_HB_AD_btest_OBJECT.dir/ResidualCell_HDG_HB_AD_btest.cpp.o
[ 60%] Built target ResidualCell_HDG_HB_AD_btest_OBJECT
Scanning dependencies of target ResidualCell_HDG_HB_AD_btest_build_vera
[ 60%] Checking style of test/unit/Discretization/HDG/ResidualCell_HDG_HB_AD_btest.cpp
[ 60%] Built target ResidualCell_HDG_HB_AD_btest_build_vera
Scanning dependencies of target ResidualCell_HDG_HB_AD_btest_build
[ 60%] Linking CXX executable ResidualCell_HDG_HB_AD_btest
[ 60%] Built target ResidualCell_HDG_HB_AD_btest_build
Scanning dependencies of target AlgebraicEquationSet_EDG_Triangle_AD_btest_build_vera
[ 60%] Checking style of test/unit/Discretization/HDG/AlgebraicEquationSet_EDG_Triangle_AD_btest.cpp
[ 60%] Built target AlgebraicEquationSet_EDG_Triangle_AD_btest_build_vera
Scanning dependencies of target AlgebraicEquationSet_EDG_Triangle_AD_btest_OBJECT
[ 60%] Building CXX object test/unit/Discretization/HDG/CMakeFiles/AlgebraicEquationSet_EDG_Triangle_AD_btest_OBJECT.dir/AlgebraicEquationSet_EDG_Triangle_AD_btest.cpp.o
[ 60%] Built target AlgebraicEquationSet_EDG_Triangle_AD_btest_OBJECT
Scanning dependencies of target AlgebraicEquationSet_EDG_Triangle_AD_btest_build
[ 60%] Linking CXX executable AlgebraicEquationSet_EDG_Triangle_AD_btest
[ 60%] Built target AlgebraicEquationSet_EDG_Triangle_AD_btest_build
Scanning dependencies of target IntegrandBoundaryTrace_Flux_mitState_VMSD_AD_btest_build_vera
[ 60%] Checking style of test/unit/Discretization/VMSD/IntegrandBoundaryTrace_Flux_mitState_VMSD_AD_btest.cpp
[ 60%] Built target IntegrandBoundaryTrace_Flux_mitState_VMSD_AD_btest_build_vera
Scanning dependencies of target IntegrandBoundaryTrace_Flux_mitState_VMSD_AD_btest_OBJECT
[ 60%] Building CXX object test/unit/Discretization/VMSD/CMakeFiles/IntegrandBoundaryTrace_Flux_mitState_VMSD_AD_btest_OBJECT.dir/IntegrandBoundaryTrace_Flux_mitState_VMSD_AD_btest.cpp.o
[ 60%] Built target IntegrandBoundaryTrace_Flux_mitState_VMSD_AD_btest_OBJECT
Scanning dependencies of target IntegrandBoundaryTrace_Flux_mitState_VMSD_AD_btest_build
[ 60%] Linking CXX executable IntegrandBoundaryTrace_Flux_mitState_VMSD_AD_btest
[ 60%] Built target IntegrandBoundaryTrace_Flux_mitState_VMSD_AD_btest_build
Scanning dependencies of target IntegrandTrace_VMSD_NL_AD_btest_build_vera
[ 60%] Checking style of test/unit/Discretization/VMSD/IntegrandTrace_VMSD_NL_AD_btest.cpp
[ 60%] Built target IntegrandTrace_VMSD_NL_AD_btest_build_vera
Scanning dependencies of target IntegrandTrace_VMSD_NL_AD_btest_OBJECT
[ 60%] Building CXX object test/unit/Discretization/VMSD/CMakeFiles/IntegrandTrace_VMSD_NL_AD_btest_OBJECT.dir/IntegrandTrace_VMSD_NL_AD_btest.cpp.o
[ 60%] Built target IntegrandTrace_VMSD_NL_AD_btest_OBJECT
Scanning dependencies of target IntegrandTrace_VMSD_NL_AD_btest_build
[ 60%] Linking CXX executable IntegrandTrace_VMSD_NL_AD_btest
[ 60%] Built target IntegrandTrace_VMSD_NL_AD_btest_build
Scanning dependencies of target ResidualCell_VMSD_AD_btest_OBJECT
[ 60%] Building CXX object test/unit/Discretization/VMSD/CMakeFiles/ResidualCell_VMSD_AD_btest_OBJECT.dir/ResidualCell_VMSD_AD_btest.cpp.o
[ 60%] Built target ResidualCell_VMSD_AD_btest_OBJECT
Scanning dependencies of target ResidualCell_VMSD_AD_btest_build_vera
[ 60%] Checking style of test/unit/Discretization/VMSD/ResidualCell_VMSD_AD_btest.cpp
[ 60%] Built target ResidualCell_VMSD_AD_btest_build_vera
Scanning dependencies of target ResidualCell_VMSD_AD_btest_build
[ 60%] Linking CXX executable ResidualCell_VMSD_AD_btest
[ 60%] Built target ResidualCell_VMSD_AD_btest_build
Scanning dependencies of target IntegrandCell_VMSD_AD_btest_build_vera
[ 60%] Checking style of test/unit/Discretization/VMSD/IntegrandCell_VMSD_AD_btest.cpp
[ 60%] Built target IntegrandCell_VMSD_AD_btest_build_vera
Scanning dependencies of target IntegrandCell_VMSD_AD_btest_OBJECT
[ 60%] Building CXX object test/unit/Discretization/VMSD/CMakeFiles/IntegrandCell_VMSD_AD_btest_OBJECT.dir/IntegrandCell_VMSD_AD_btest.cpp.o
[ 60%] Built target IntegrandCell_VMSD_AD_btest_OBJECT
Scanning dependencies of target IntegrandCell_VMSD_AD_btest_build
[ 60%] Linking CXX executable IntegrandCell_VMSD_AD_btest
[ 60%] Built target IntegrandCell_VMSD_AD_btest_build
Scanning dependencies of target IntegrandBoundaryTrace_Output_VMSD_btest_OBJECT
[ 60%] Building CXX object test/unit/Discretization/VMSD/CMakeFiles/IntegrandBoundaryTrace_Output_VMSD_btest_OBJECT.dir/IntegrandBoundaryTrace_Output_VMSD_btest.cpp.o
[ 60%] Built target IntegrandBoundaryTrace_Output_VMSD_btest_OBJECT
Scanning dependencies of target IntegrandBoundaryTrace_Output_VMSD_btest_build_vera
[ 60%] Checking style of test/unit/Discretization/VMSD/IntegrandBoundaryTrace_Output_VMSD_btest.cpp
[ 60%] Built target IntegrandBoundaryTrace_Output_VMSD_btest_build_vera
Scanning dependencies of target IntegrandBoundaryTrace_Output_VMSD_btest_build
[ 60%] Linking CXX executable IntegrandBoundaryTrace_Output_VMSD_btest
[ 60%] Built target IntegrandBoundaryTrace_Output_VMSD_btest_build
Scanning dependencies of target JacobianFunctionalCell_VMSD_AD_btest_OBJECT
[ 60%] Building CXX object test/unit/Discretization/VMSD/CMakeFiles/JacobianFunctionalCell_VMSD_AD_btest_OBJECT.dir/JacobianFunctionalCell_VMSD_AD_btest.cpp.o
[ 60%] Built target JacobianFunctionalCell_VMSD_AD_btest_OBJECT
Scanning dependencies of target JacobianFunctionalCell_VMSD_AD_btest_build_vera
[ 60%] Checking style of test/unit/Discretization/VMSD/JacobianFunctionalCell_VMSD_AD_btest.cpp
[ 60%] Built target JacobianFunctionalCell_VMSD_AD_btest_build_vera
Scanning dependencies of target JacobianFunctionalCell_VMSD_AD_btest_build
[ 60%] Linking CXX executable JacobianFunctionalCell_VMSD_AD_btest
[ 60%] Built target JacobianFunctionalCell_VMSD_AD_btest_build
Scanning dependencies of target IntegrandCell_VMSD_Output_AD_btest_build_vera
[ 60%] Checking style of test/unit/Discretization/VMSD/IntegrandCell_VMSD_Output_AD_btest.cpp
[ 60%] Built target IntegrandCell_VMSD_Output_AD_btest_build_vera
Scanning dependencies of target IntegrandCell_VMSD_Output_AD_btest_OBJECT
[ 60%] Building CXX object test/unit/Discretization/VMSD/CMakeFiles/IntegrandCell_VMSD_Output_AD_btest_OBJECT.dir/IntegrandCell_VMSD_Output_AD_btest.cpp.o
[ 60%] Built target IntegrandCell_VMSD_Output_AD_btest_OBJECT
Scanning dependencies of target IntegrandCell_VMSD_Output_AD_btest_build
[ 60%] Linking CXX executable IntegrandCell_VMSD_Output_AD_btest
[ 60%] Built target IntegrandCell_VMSD_Output_AD_btest_build
Scanning dependencies of target JacobianCell_VMSD_AD_btest_build_vera
[ 60%] Checking style of test/unit/Discretization/VMSD/JacobianCell_VMSD_AD_btest.cpp
[ 60%] Built target JacobianCell_VMSD_AD_btest_build_vera
Scanning dependencies of target JacobianCell_VMSD_AD_btest_OBJECT
[ 60%] Building CXX object test/unit/Discretization/VMSD/CMakeFiles/JacobianCell_VMSD_AD_btest_OBJECT.dir/JacobianCell_VMSD_AD_btest.cpp.o
[ 60%] Built target JacobianCell_VMSD_AD_btest_OBJECT
Scanning dependencies of target JacobianCell_VMSD_AD_btest_build
[ 60%] Linking CXX executable JacobianCell_VMSD_AD_btest
[ 60%] Built target JacobianCell_VMSD_AD_btest_build
Scanning dependencies of target IntegrandCell_VMSD_NL_AD_btest_OBJECT
[ 60%] Building CXX object test/unit/Discretization/VMSD/CMakeFiles/IntegrandCell_VMSD_NL_AD_btest_OBJECT.dir/IntegrandCell_VMSD_NL_AD_btest.cpp.o
[ 60%] Built target IntegrandCell_VMSD_NL_AD_btest_OBJECT
Scanning dependencies of target IntegrandCell_VMSD_NL_AD_btest_build_vera
[ 60%] Checking style of test/unit/Discretization/VMSD/IntegrandCell_VMSD_NL_AD_btest.cpp
[ 60%] Built target IntegrandCell_VMSD_NL_AD_btest_build_vera
Scanning dependencies of target IntegrandCell_VMSD_NL_AD_btest_build
[ 60%] Linking CXX executable IntegrandCell_VMSD_NL_AD_btest
[ 60%] Built target IntegrandCell_VMSD_NL_AD_btest_build
Scanning dependencies of target IntegrandTrace_VMSD_AD_btest_OBJECT
[ 60%] Building CXX object test/unit/Discretization/VMSD/CMakeFiles/IntegrandTrace_VMSD_AD_btest_OBJECT.dir/IntegrandTrace_VMSD_AD_btest.cpp.o
[ 60%] Built target IntegrandTrace_VMSD_AD_btest_OBJECT
Scanning dependencies of target IntegrandTrace_VMSD_AD_btest_build_vera
[ 60%] Checking style of test/unit/Discretization/VMSD/IntegrandTrace_VMSD_AD_btest.cpp
[ 60%] Built target IntegrandTrace_VMSD_AD_btest_build_vera
Scanning dependencies of target IntegrandTrace_VMSD_AD_btest_build
[ 60%] Linking CXX executable IntegrandTrace_VMSD_AD_btest
[ 60%] Built target IntegrandTrace_VMSD_AD_btest_build
Scanning dependencies of target AlgebraicEquationSet_VMSD_Triangle_AD_btest_build_vera
[ 60%] Checking style of test/unit/Discretization/VMSD/AlgebraicEquationSet_VMSD_Triangle_AD_btest.cpp
[ 60%] Built target AlgebraicEquationSet_VMSD_Triangle_AD_btest_build_vera
Scanning dependencies of target AlgebraicEquationSet_VMSD_Triangle_AD_btest_OBJECT
[ 60%] Building CXX object test/unit/Discretization/VMSD/CMakeFiles/AlgebraicEquationSet_VMSD_Triangle_AD_btest_OBJECT.dir/AlgebraicEquationSet_VMSD_Triangle_AD_btest.cpp.o
[ 60%] Built target AlgebraicEquationSet_VMSD_Triangle_AD_btest_OBJECT
Scanning dependencies of target AlgebraicEquationSet_VMSD_Triangle_AD_btest_build
[ 60%] Linking CXX executable AlgebraicEquationSet_VMSD_Triangle_AD_btest
[ 60%] Built target AlgebraicEquationSet_VMSD_Triangle_AD_btest_build
Scanning dependencies of target AlgebraicEquationSet_VMSD_Triangle_SA_btest_OBJECT
[ 60%] Building CXX object test/unit/Discretization/VMSD/CMakeFiles/AlgebraicEquationSet_VMSD_Triangle_SA_btest_OBJECT.dir/AlgebraicEquationSet_VMSD_Triangle_SA_btest.cpp.o
[ 60%] Built target AlgebraicEquationSet_VMSD_Triangle_SA_btest_OBJECT
Scanning dependencies of target AlgebraicEquationSet_VMSD_Triangle_SA_btest_build_vera
[ 60%] Checking style of test/unit/Discretization/VMSD/AlgebraicEquationSet_VMSD_Triangle_SA_btest.cpp
[ 60%] Built target AlgebraicEquationSet_VMSD_Triangle_SA_btest_build_vera
Scanning dependencies of target AlgebraicEquationSet_VMSD_Triangle_SA_btest_build
[ 60%] Linking CXX executable AlgebraicEquationSet_VMSD_Triangle_SA_btest
[ 60%] Built target AlgebraicEquationSet_VMSD_Triangle_SA_btest_build
Scanning dependencies of target ProjectL2_VMSD_BR2_Source_btest_build_vera
[ 60%] Checking style of test/unit/Discretization/VMSDBR2/ProjectL2_VMSD_BR2_Source_btest.cpp
[ 60%] Built target ProjectL2_VMSD_BR2_Source_btest_build_vera
Scanning dependencies of target ProjectL2_VMSD_BR2_Source_btest_OBJECT
[ 60%] Building CXX object test/unit/Discretization/VMSDBR2/CMakeFiles/ProjectL2_VMSD_BR2_Source_btest_OBJECT.dir/ProjectL2_VMSD_BR2_Source_btest.cpp.o
[ 60%] Built target ProjectL2_VMSD_BR2_Source_btest_OBJECT
Scanning dependencies of target ProjectL2_VMSD_BR2_Source_btest_build
[ 60%] Linking CXX executable ProjectL2_VMSD_BR2_Source_btest
[ 60%] Built target ProjectL2_VMSD_BR2_Source_btest_build
Scanning dependencies of target SetFieldBoundaryTrace_VMSDBR2_LO_AD_Dirichlet_mitState_btest_OBJECT
[ 60%] Building CXX object test/unit/Discretization/VMSDBR2/CMakeFiles/SetFieldBoundaryTrace_VMSDBR2_LO_AD_Dirichlet_mitState_btest_OBJECT.dir/SetFieldBoundaryTrace_VMSDBR2_LO_AD_Dirichlet_mitState_btest.cpp.o
[ 60%] Built target SetFieldBoundaryTrace_VMSDBR2_LO_AD_Dirichlet_mitState_btest_OBJECT
Scanning dependencies of target SetFieldBoundaryTrace_VMSDBR2_LO_AD_Dirichlet_mitState_btest_build_vera
[ 60%] Checking style of test/unit/Discretization/VMSDBR2/SetFieldBoundaryTrace_VMSDBR2_LO_AD_Dirichlet_mitState_btest.cpp
[ 60%] Built target SetFieldBoundaryTrace_VMSDBR2_LO_AD_Dirichlet_mitState_btest_build_vera
Scanning dependencies of target SetFieldBoundaryTrace_VMSDBR2_LO_AD_Dirichlet_mitState_btest_build
[ 60%] Linking CXX executable SetFieldBoundaryTrace_VMSDBR2_LO_AD_Dirichlet_mitState_btest
[ 60%] Built target SetFieldBoundaryTrace_VMSDBR2_LO_AD_Dirichlet_mitState_btest_build
Scanning dependencies of target IntegrandCell_VMSD_BR2_AD_btest_OBJECT
[ 60%] Building CXX object test/unit/Discretization/VMSDBR2/CMakeFiles/IntegrandCell_VMSD_BR2_AD_btest_OBJECT.dir/IntegrandCell_VMSD_BR2_AD_btest.cpp.o
[ 60%] Built target IntegrandCell_VMSD_BR2_AD_btest_OBJECT
Scanning dependencies of target IntegrandCell_VMSD_BR2_AD_btest_build_vera
[ 60%] Checking style of test/unit/Discretization/VMSDBR2/IntegrandCell_VMSD_BR2_AD_btest.cpp
[ 60%] Built target IntegrandCell_VMSD_BR2_AD_btest_build_vera
Scanning dependencies of target IntegrandCell_VMSD_BR2_AD_btest_build
[ 60%] Linking CXX executable IntegrandCell_VMSD_BR2_AD_btest
[ 60%] Built target IntegrandCell_VMSD_BR2_AD_btest_build
Scanning dependencies of target JacobianCell_VMSD_BR2_AD_btest_OBJECT
[ 60%] Building CXX object test/unit/Discretization/VMSDBR2/CMakeFiles/JacobianCell_VMSD_BR2_AD_btest_OBJECT.dir/JacobianCell_VMSD_BR2_AD_btest.cpp.o
[ 60%] Built target JacobianCell_VMSD_BR2_AD_btest_OBJECT
Scanning dependencies of target JacobianCell_VMSD_BR2_AD_btest_build_vera
[ 60%] Checking style of test/unit/Discretization/VMSDBR2/JacobianCell_VMSD_BR2_AD_btest.cpp
[ 60%] Built target JacobianCell_VMSD_BR2_AD_btest_build_vera
Scanning dependencies of target JacobianCell_VMSD_BR2_AD_btest_build
[ 60%] Linking CXX executable JacobianCell_VMSD_BR2_AD_btest
[ 60%] Built target JacobianCell_VMSD_BR2_AD_btest_build
Scanning dependencies of target IntegrandTrace_VMSD_BR2_AD_btest_OBJECT
[ 60%] Building CXX object test/unit/Discretization/VMSDBR2/CMakeFiles/IntegrandTrace_VMSD_BR2_AD_btest_OBJECT.dir/IntegrandTrace_VMSD_BR2_AD_btest.cpp.o
[ 60%] Built target IntegrandTrace_VMSD_BR2_AD_btest_OBJECT
Scanning dependencies of target IntegrandTrace_VMSD_BR2_AD_btest_build_vera
[ 60%] Checking style of test/unit/Discretization/VMSDBR2/IntegrandTrace_VMSD_BR2_AD_btest.cpp
[ 60%] Built target IntegrandTrace_VMSD_BR2_AD_btest_build_vera
Scanning dependencies of target IntegrandTrace_VMSD_BR2_AD_btest_build
[ 60%] Linking CXX executable IntegrandTrace_VMSD_BR2_AD_btest
[ 60%] Built target IntegrandTrace_VMSD_BR2_AD_btest_build
Scanning dependencies of target JacobianBoundaryTrace_Dirichlet_mitState_VMSDBR2_AD_btest_OBJECT
[ 60%] Building CXX object test/unit/Discretization/VMSDBR2/CMakeFiles/JacobianBoundaryTrace_Dirichlet_mitState_VMSDBR2_AD_btest_OBJECT.dir/JacobianBoundaryTrace_Dirichlet_mitState_VMSDBR2_AD_btest.cpp.o
[ 60%] Built target JacobianBoundaryTrace_Dirichlet_mitState_VMSDBR2_AD_btest_OBJECT
Scanning dependencies of target JacobianBoundaryTrace_Dirichlet_mitState_VMSDBR2_AD_btest_build_vera
[ 60%] Checking style of test/unit/Discretization/VMSDBR2/JacobianBoundaryTrace_Dirichlet_mitState_VMSDBR2_AD_btest.cpp
[ 60%] Built target JacobianBoundaryTrace_Dirichlet_mitState_VMSDBR2_AD_btest_build_vera
Scanning dependencies of target JacobianBoundaryTrace_Dirichlet_mitState_VMSDBR2_AD_btest_build
[ 60%] Linking CXX executable JacobianBoundaryTrace_Dirichlet_mitState_VMSDBR2_AD_btest
[ 60%] Built target JacobianBoundaryTrace_Dirichlet_mitState_VMSDBR2_AD_btest_build
Scanning dependencies of target JacobianFunctionalBoundaryTrace_VMSDBR2_btest_OBJECT
[ 60%] Building CXX object test/unit/Discretization/VMSDBR2/CMakeFiles/JacobianFunctionalBoundaryTrace_VMSDBR2_btest_OBJECT.dir/JacobianFunctionalBoundaryTrace_VMSDBR2_btest.cpp.o
[ 60%] Built target JacobianFunctionalBoundaryTrace_VMSDBR2_btest_OBJECT
Scanning dependencies of target JacobianFunctionalBoundaryTrace_VMSDBR2_btest_build_vera
[ 60%] Checking style of test/unit/Discretization/VMSDBR2/JacobianFunctionalBoundaryTrace_VMSDBR2_btest.cpp
[ 60%] Built target JacobianFunctionalBoundaryTrace_VMSDBR2_btest_build_vera
Scanning dependencies of target JacobianFunctionalBoundaryTrace_VMSDBR2_btest_build
[ 60%] Linking CXX executable JacobianFunctionalBoundaryTrace_VMSDBR2_btest
[ 60%] Built target JacobianFunctionalBoundaryTrace_VMSDBR2_btest_build
Scanning dependencies of target AlgebraicEquationSet_VMSDBR2_Triangle_AD_btest_OBJECT
[ 60%] Building CXX object test/unit/Discretization/VMSDBR2/CMakeFiles/AlgebraicEquationSet_VMSDBR2_Triangle_AD_btest_OBJECT.dir/AlgebraicEquationSet_VMSDBR2_Triangle_AD_btest.cpp.o
[ 60%] Built target AlgebraicEquationSet_VMSDBR2_Triangle_AD_btest_OBJECT
Scanning dependencies of target AlgebraicEquationSet_VMSDBR2_Triangle_AD_btest_build_vera
[ 60%] Checking style of test/unit/Discretization/VMSDBR2/AlgebraicEquationSet_VMSDBR2_Triangle_AD_btest.cpp
[ 60%] Built target AlgebraicEquationSet_VMSDBR2_Triangle_AD_btest_build_vera
Scanning dependencies of target AlgebraicEquationSet_VMSDBR2_Triangle_AD_btest_build
[ 60%] Linking CXX executable AlgebraicEquationSet_VMSDBR2_Triangle_AD_btest
[ 60%] Built target AlgebraicEquationSet_VMSDBR2_Triangle_AD_btest_build
Scanning dependencies of target JacobianInteriorTrace_FV_TPFA_AD_btest_OBJECT
[ 60%] Building CXX object test/unit/Discretization/FV_TPFA/CMakeFiles/JacobianInteriorTrace_FV_TPFA_AD_btest_OBJECT.dir/JacobianInteriorTrace_FV_TPFA_AD_btest.cpp.o
[ 60%] Built target JacobianInteriorTrace_FV_TPFA_AD_btest_OBJECT
Scanning dependencies of target JacobianInteriorTrace_FV_TPFA_AD_btest_build_vera
[ 60%] Checking style of test/unit/Discretization/FV_TPFA/JacobianInteriorTrace_FV_TPFA_AD_btest.cpp
[ 60%] Built target JacobianInteriorTrace_FV_TPFA_AD_btest_build_vera
Scanning dependencies of target JacobianInteriorTrace_FV_TPFA_AD_btest_build
[ 60%] Linking CXX executable JacobianInteriorTrace_FV_TPFA_AD_btest
[ 60%] Built target JacobianInteriorTrace_FV_TPFA_AD_btest_build
Scanning dependencies of target JacobianCell_FV_TPFA_AD_btest_build_vera
[ 60%] Checking style of test/unit/Discretization/FV_TPFA/JacobianCell_FV_TPFA_AD_btest.cpp
[ 60%] Built target JacobianCell_FV_TPFA_AD_btest_build_vera
Scanning dependencies of target JacobianCell_FV_TPFA_AD_btest_OBJECT
[ 60%] Building CXX object test/unit/Discretization/FV_TPFA/CMakeFiles/JacobianCell_FV_TPFA_AD_btest_OBJECT.dir/JacobianCell_FV_TPFA_AD_btest.cpp.o
[ 60%] Built target JacobianCell_FV_TPFA_AD_btest_OBJECT
Scanning dependencies of target JacobianCell_FV_TPFA_AD_btest_build
[ 60%] Linking CXX executable JacobianCell_FV_TPFA_AD_btest
[ 60%] Built target JacobianCell_FV_TPFA_AD_btest_build
Scanning dependencies of target ErrorEstimateLib_vera
[ 60%] Checking style of src/ErrorEstimate/HDG/ErrorEstimate_HDG.h
[ 60%] Checking style of src/ErrorEstimate/HDG/ErrorEstimateInteriorTrace_HDG.h
[ 60%] Checking style of src/ErrorEstimate/HDG/ErrorEstimateBoundaryTrace_FieldTrace_HDG.h
[ 60%] Checking style of src/ErrorEstimate/HDG/ErrorEstimateCell_HDG.h
[ 60%] Checking style of src/ErrorEstimate/HDG/ErrorEstimateBoundaryTrace_Dispatch_HDG.h
[ 60%] Checking style of src/ErrorEstimate/HDG/ErrorEstimateBoundaryTrace_HDG.h
[ 60%] Checking style of src/ErrorEstimate/Galerkin/ErrorEstimateInteriorTrace_PrimalStrongForm_Galerkin.h
[ 60%] Checking style of src/ErrorEstimate/Galerkin/OutputCorrection_Galerkin_Stabilized.h
[ 60%] Checking style of src/ErrorEstimate/Galerkin/ErrorEstimateBoundaryTrace_Galerkin_LiftedBoundary.h
[ 60%] Checking style of src/ErrorEstimate/Galerkin/ErrorEstimateBase_Galerkin.h
[ 60%] Checking style of src/ErrorEstimate/Galerkin/ErrorEstimateBoundaryTrace_FieldTrace_Galerkin.h
[ 60%] Checking style of src/ErrorEstimate/Galerkin/ErrorEstimateCell_Galerkin.h
[ 60%] Checking style of src/ErrorEstimate/Galerkin/ErrorEstimateCell_LO.h
[ 60%] Checking style of src/ErrorEstimate/Galerkin/ErrorEstimateInteriorTrace_Galerkin.h
[ 60%] Checking style of src/ErrorEstimate/Galerkin/ErrorEstimateBoundaryTrace_Dispatch_Galerkin.h
[ 60%] Checking style of src/ErrorEstimate/Galerkin/ErrorEstimateNodal_Galerkin.h
[ 60%] Checking style of src/ErrorEstimate/Galerkin/ErrorEstimateNodalBase_Galerkin.h
[ 60%] Checking style of src/ErrorEstimate/Galerkin/ErrorEstimateInteriorTrace_SIP_Galerkin.h
[ 60%] Checking style of src/ErrorEstimate/Galerkin/ErrorEstimateBoundaryTrace_Galerkin.h
[ 60%] Checking style of src/ErrorEstimate/Galerkin/ErrorEstimateCell_PrimalStrongForm_Galerkin.h
[ 60%] Checking style of src/ErrorEstimate/Galerkin/ErrorEstimateBoundaryTrace_Dirichlet_mitLG_Galerkin.h
[ 60%] Checking style of src/ErrorEstimate/Galerkin/ErrorEstimate_Galerkin_Stabilized.h
[ 60%] Checking style of src/ErrorEstimate/Galerkin/ErrorEstimate_StrongForm_Galerkin.h
[ 60%] Checking style of src/ErrorEstimate/Galerkin/ErrorEstimateNodal_Galerkin_LiftedBoundary.h
[ 60%] Checking style of src/ErrorEstimate/VMSD/ErrorEstimateBoundaryTrace_VMSD.h
[ 60%] Checking style of src/ErrorEstimate/VMSD/ErrorEstimateInteriorTrace_VMSD.h
[ 60%] Checking style of src/ErrorEstimate/VMSD/ErrorEstimateInteriorTrace_VMSD_BR2.h
[ 60%] Checking style of src/ErrorEstimate/VMSD/ErrorEstimateCell_VMSD_BR2.h
[ 60%] Checking style of src/ErrorEstimate/VMSD/ErrorEstimateBase_VMSD_BR2.h
[ 60%] Checking style of src/ErrorEstimate/VMSD/ErrorEstimate_VMSD.h
[ 60%] Checking style of src/ErrorEstimate/VMSD/ErrorEstimateBase_VMSD.h
[ 60%] Checking style of src/ErrorEstimate/VMSD/ErrorEstimateInteriorTrace_onBoundary_VMSD_BR2.h
[ 60%] Checking style of src/ErrorEstimate/VMSD/ErrorEstimate_VMSD_BR2.h
[ 60%] Checking style of src/ErrorEstimate/VMSD/ErrorEstimateBoundaryTrace_Dispatch_VMSD.h
[ 60%] Checking style of src/ErrorEstimate/VMSD/ErrorEstimateCell_VMSD.h
[ 60%] Checking style of src/ErrorEstimate/VMSD/ErrorEstimate_InnerBoundaryTrace_VMSD.h
[ 60%] Checking style of src/ErrorEstimate/VMSD/ErrorEstimate_VMSD_Linear.h
[ 60%] Checking style of src/ErrorEstimate/VMSD/ErrorEstimateBoundaryTrace_VMSD_BR2.h
[ 60%] Checking style of src/ErrorEstimate/ErrorEstimate_Common.h
[ 60%] Checking style of src/ErrorEstimate/DG/ErrorEstimateBoundaryTrace_DGBR2.h
[ 60%] Checking style of src/ErrorEstimate/DG/ErrorEstimate_DGBR2.h
[ 60%] Checking style of src/ErrorEstimate/DG/ErrorEstimate_DGBR2_impl.h
[ 60%] Checking style of src/ErrorEstimate/DG/ErrorEstimateCell_DGBR2.h
[ 60%] Checking style of src/ErrorEstimate/DG/ErrorEstimate_DGAdvective.h
[ 60%] Checking style of src/ErrorEstimate/DG/ErrorEstimateInteriorTrace_DGBR2.h
[ 60%] Checking style of src/ErrorEstimate/DG/ErrorEstimateBoundaryTrace_Dispatch_DGBR2.h
[ 60%] Checking style of src/ErrorEstimate/ErrorEstimate_L2.h
[ 60%] Checking style of src/ErrorEstimate/ErrorEstimate_fwd.h
[ 60%] Checking style of src/ErrorEstimate/DistributeBoundaryTraceGroups.h
[ 60%] Checking style of src/ErrorEstimate/Galerkin/ErrorEstimateNodalBase_Galerkin.cpp
[ 60%] Checking style of src/ErrorEstimate/VMSD/ErrorEstimateBase_VMSD.cpp
[ 60%] Checking style of src/ErrorEstimate/VMSD/ErrorEstimateBase_VMSD_BR2.cpp
[ 60%] Checking style of src/ErrorEstimate/DG/Instantiate/ErrorEstimate_DGBR2_RANSSA2D_PrimitiveConstVisc.cpp
[ 60%] Checking style of src/ErrorEstimate/DG/Instantiate/ErrorEstimate_DGBR2_NavierStokes3D_PrimitiveConstVisc.cpp
[ 60%] Checking style of src/ErrorEstimate/DG/Instantiate/ErrorEstimate_DGBR2_TwoPhase2D_LogpnSw.cpp
[ 60%] Checking style of src/ErrorEstimate/DG/Instantiate/ErrorEstimate_DGBR2_TwoPhase2D_Surrogate_pnSw.cpp
[ 60%] Checking style of src/ErrorEstimate/DG/Instantiate/ErrorEstimate_DGBR2_NavierStokes3D_PrimitiveSutherland.cpp
[ 60%] Checking style of src/ErrorEstimate/DG/Instantiate/ErrorEstimate_DGBR2_ArtificialViscosity_RANSSA3D_PrimitiveSutherland.cpp
[ 60%] Checking style of src/ErrorEstimate/DG/Instantiate/ErrorEstimate_DGBR2_Burgers2D_Conservative_DUSN.cpp
[ 60%] Checking style of src/ErrorEstimate/DG/Instantiate/ErrorEstimate_DGBR2_AdvectionDiffusion1D_AUDUSUG.cpp
[ 60%] Checking style of src/ErrorEstimate/DG/Instantiate/ErrorEstimate_DGBR2_AdvectionDiffusion2D_AUDUSUG.cpp
[ 61%] Checking style of src/ErrorEstimate/DG/Instantiate/ErrorEstimate_DGBR2_Sensor2D_AUSJump_AD.cpp
[ 61%] Checking style of src/ErrorEstimate/DG/Instantiate/ErrorEstimate_DGBR2_AD_AV2D_AUDUSUG.cpp
[ 61%] Checking style of src/ErrorEstimate/DG/Instantiate/ErrorEstimate_DGBR2_Burgers_AV2D_DUSN.cpp
[ 61%] Checking style of src/ErrorEstimate/DG/Instantiate/ErrorEstimate_DGBR2_TwoPhase1D.cpp
[ 61%] Checking style of src/ErrorEstimate/DG/Instantiate/ErrorEstimate_DGBR2_Sensor2D_AUSJump_Euler1D_Conservative.cpp
[ 61%] Checking style of src/ErrorEstimate/DG/Instantiate/ErrorEstimate_DGBR2_BuckleyLeverett_AV1D_Sensor_AUSJump.cpp
[ 61%] Checking style of src/ErrorEstimate/DG/Instantiate/ErrorEstimate_DGBR2_Euler1D_AV1D_Conservative.cpp
[ 61%] Checking style of src/ErrorEstimate/DG/Instantiate/ErrorEstimate_DGBR2_NavierStokes2D_PrimitiveSutherland.cpp
[ 61%] Checking style of src/ErrorEstimate/DG/Instantiate/ErrorEstimate_DGBR2_NavierStokes2D_PrimitiveConstVisc.cpp
[ 61%] Checking style of src/ErrorEstimate/DG/Instantiate/ErrorEstimate_DGBR2_Sensor1D_AUSJump_AD.cpp
[ 61%] Checking style of src/ErrorEstimate/DG/Instantiate/ErrorEstimate_DGBR2_ArtificialViscosity_BuckleyLeverett1D.cpp
[ 61%] Checking style of src/ErrorEstimate/DG/Instantiate/ErrorEstimate_DGBR2_Lorenz.cpp
[ 61%] Checking style of src/ErrorEstimate/DG/Instantiate/ErrorEstimate_DGBR2_RANSSA3D_PrimitiveConstVisc.cpp
[ 61%] Checking style of src/ErrorEstimate/DG/Instantiate/ErrorEstimate_DGBR2_Burgers1D_Conservative_DUSN.cpp
[ 61%] Checking style of src/ErrorEstimate/DG/Instantiate/ErrorEstimate_DGBR2_RANSSA3D_PrimitiveSutherland.cpp
[ 61%] Checking style of src/ErrorEstimate/DG/Instantiate/ErrorEstimate_DGBR2_ArtificialViscosity_TwoPhase2D_LogpnSw.cpp
[ 61%] Checking style of src/ErrorEstimate/DG/Instantiate/ErrorEstimate_DGBR2_NavierStokes3D_SurrogateSutherland.cpp
[ 61%] Checking style of src/ErrorEstimate/DG/Instantiate/ErrorEstimate_DGBR2_Burgers_AV1D_DUSUG.cpp
[ 61%] Checking style of src/ErrorEstimate/DG/Instantiate/ErrorEstimate_DGBR2_RANSSA3D_SurrogateSutherland.cpp
[ 61%] Checking style of src/ErrorEstimate/DG/Instantiate/ErrorEstimate_DGBR2_BuckleyLeverett1D.cpp
[ 61%] Checking style of src/ErrorEstimate/DG/Instantiate/ErrorEstimate_DGBR2_TwoPhase2D.cpp
[ 61%] Checking style of src/ErrorEstimate/DG/Instantiate/ErrorEstimate_DGBR2_AdvectionDiffusion3D_AUDUSUG.cpp
[ 61%] Checking style of src/ErrorEstimate/DG/Instantiate/ErrorEstimate_DGBR2_RANSSA2D_PrimitiveSutherland.cpp
[ 61%] Checking style of src/ErrorEstimate/DG/Instantiate/ErrorEstimate_DGBR2_ArtificialViscosity_TwoPhase2D.cpp
[ 61%] Checking style of src/ErrorEstimate/DG/Instantiate/ErrorEstimate_DGBR2_ArtificialViscosity_TwoPhase1D.cpp
[ 61%] Built target ErrorEstimateLib_vera
[ 61%] Generating CXX unity source src/ErrorEstimate/cotire/ErrorEstimateLib_CXX_unity.cxx
[ 63%] Generating CXX prefix source src/ErrorEstimate/cotire/ErrorEstimateLib_CXX_prefix.cxx
[ 63%] Generating CXX prefix header src/ErrorEstimate/cotire/ErrorEstimateLib_CXX_prefix.hxx
[ 63%] Building CXX precompiled header src/ErrorEstimate/cotire/ErrorEstimateLib_CXX_prefix.hxx.gch
Scanning dependencies of target ErrorEstimateLib
[ 63%] Building CXX object src/ErrorEstimate/CMakeFiles/ErrorEstimateLib.dir/DG/Instantiate/ErrorEstimate_DGBR2_AdvectionDiffusion1D_AUDUSUG.cpp.o
[ 63%] Building CXX object src/ErrorEstimate/CMakeFiles/ErrorEstimateLib.dir/DG/Instantiate/ErrorEstimate_DGBR2_AdvectionDiffusion2D_AUDUSUG.cpp.o
[ 63%] Building CXX object src/ErrorEstimate/CMakeFiles/ErrorEstimateLib.dir/DG/Instantiate/ErrorEstimate_DGBR2_AdvectionDiffusion3D_AUDUSUG.cpp.o
[ 63%] Building CXX object src/ErrorEstimate/CMakeFiles/ErrorEstimateLib.dir/DG/Instantiate/ErrorEstimate_DGBR2_Sensor1D_AUSJump_AD.cpp.o
[ 63%] Building CXX object src/ErrorEstimate/CMakeFiles/ErrorEstimateLib.dir/DG/Instantiate/ErrorEstimate_DGBR2_Sensor2D_AUSJump_AD.cpp.o
[ 63%] Building CXX object src/ErrorEstimate/CMakeFiles/ErrorEstimateLib.dir/DG/Instantiate/ErrorEstimate_DGBR2_Sensor2D_AUSJump_Euler1D_Conservative.cpp.o
[ 63%] Building CXX object src/ErrorEstimate/CMakeFiles/ErrorEstimateLib.dir/DG/Instantiate/ErrorEstimate_DGBR2_AD_AV2D_AUDUSUG.cpp.o
[ 63%] Building CXX object src/ErrorEstimate/CMakeFiles/ErrorEstimateLib.dir/DG/Instantiate/ErrorEstimate_DGBR2_Burgers_AV1D_DUSUG.cpp.o
[ 63%] Building CXX object src/ErrorEstimate/CMakeFiles/ErrorEstimateLib.dir/DG/Instantiate/ErrorEstimate_DGBR2_Burgers_AV2D_DUSN.cpp.o
[ 63%] Building CXX object src/ErrorEstimate/CMakeFiles/ErrorEstimateLib.dir/DG/Instantiate/ErrorEstimate_DGBR2_BuckleyLeverett1D.cpp.o
[ 63%] Building CXX object src/ErrorEstimate/CMakeFiles/ErrorEstimateLib.dir/DG/Instantiate/ErrorEstimate_DGBR2_BuckleyLeverett_AV1D_Sensor_AUSJump.cpp.o
[ 63%] Building CXX object src/ErrorEstimate/CMakeFiles/ErrorEstimateLib.dir/DG/Instantiate/ErrorEstimate_DGBR2_TwoPhase1D.cpp.o
[ 63%] Building CXX object src/ErrorEstimate/CMakeFiles/ErrorEstimateLib.dir/DG/Instantiate/ErrorEstimate_DGBR2_TwoPhase2D.cpp.o
[ 63%] Building CXX object src/ErrorEstimate/CMakeFiles/ErrorEstimateLib.dir/DG/Instantiate/ErrorEstimate_DGBR2_TwoPhase2D_LogpnSw.cpp.o
[ 63%] Building CXX object src/ErrorEstimate/CMakeFiles/ErrorEstimateLib.dir/DG/Instantiate/ErrorEstimate_DGBR2_TwoPhase2D_Surrogate_pnSw.cpp.o
[ 63%] Building CXX object src/ErrorEstimate/CMakeFiles/ErrorEstimateLib.dir/DG/Instantiate/ErrorEstimate_DGBR2_Burgers1D_Conservative_DUSN.cpp.o
[ 63%] Building CXX object src/ErrorEstimate/CMakeFiles/ErrorEstimateLib.dir/DG/Instantiate/ErrorEstimate_DGBR2_Burgers2D_Conservative_DUSN.cpp.o
[ 63%] Building CXX object src/ErrorEstimate/CMakeFiles/ErrorEstimateLib.dir/DG/Instantiate/ErrorEstimate_DGBR2_Euler1D_AV1D_Conservative.cpp.o
[ 63%] Building CXX object src/ErrorEstimate/CMakeFiles/ErrorEstimateLib.dir/DG/Instantiate/ErrorEstimate_DGBR2_NavierStokes2D_PrimitiveConstVisc.cpp.o
[ 63%] Building CXX object src/ErrorEstimate/CMakeFiles/ErrorEstimateLib.dir/DG/Instantiate/ErrorEstimate_DGBR2_NavierStokes2D_PrimitiveSutherland.cpp.o
[ 63%] Building CXX object src/ErrorEstimate/CMakeFiles/ErrorEstimateLib.dir/DG/Instantiate/ErrorEstimate_DGBR2_NavierStokes3D_PrimitiveConstVisc.cpp.o
[ 63%] Building CXX object src/ErrorEstimate/CMakeFiles/ErrorEstimateLib.dir/DG/Instantiate/ErrorEstimate_DGBR2_NavierStokes3D_PrimitiveSutherland.cpp.o
[ 63%] Building CXX object src/ErrorEstimate/CMakeFiles/ErrorEstimateLib.dir/DG/Instantiate/ErrorEstimate_DGBR2_NavierStokes3D_SurrogateSutherland.cpp.o
[ 63%] Building CXX object src/ErrorEstimate/CMakeFiles/ErrorEstimateLib.dir/DG/Instantiate/ErrorEstimate_DGBR2_RANSSA2D_PrimitiveConstVisc.cpp.o
[ 63%] Building CXX object src/ErrorEstimate/CMakeFiles/ErrorEstimateLib.dir/DG/Instantiate/ErrorEstimate_DGBR2_RANSSA2D_PrimitiveSutherland.cpp.o
[ 63%] Building CXX object src/ErrorEstimate/CMakeFiles/ErrorEstimateLib.dir/DG/Instantiate/ErrorEstimate_DGBR2_RANSSA3D_PrimitiveConstVisc.cpp.o
[ 63%] Building CXX object src/ErrorEstimate/CMakeFiles/ErrorEstimateLib.dir/DG/Instantiate/ErrorEstimate_DGBR2_RANSSA3D_PrimitiveSutherland.cpp.o
[ 63%] Building CXX object src/ErrorEstimate/CMakeFiles/ErrorEstimateLib.dir/DG/Instantiate/ErrorEstimate_DGBR2_RANSSA3D_SurrogateSutherland.cpp.o
[ 63%] Building CXX object src/ErrorEstimate/CMakeFiles/ErrorEstimateLib.dir/DG/Instantiate/ErrorEstimate_DGBR2_ArtificialViscosity_BuckleyLeverett1D.cpp.o
[ 63%] Building CXX object src/ErrorEstimate/CMakeFiles/ErrorEstimateLib.dir/DG/Instantiate/ErrorEstimate_DGBR2_ArtificialViscosity_TwoPhase1D.cpp.o
[ 63%] Building CXX object src/ErrorEstimate/CMakeFiles/ErrorEstimateLib.dir/DG/Instantiate/ErrorEstimate_DGBR2_ArtificialViscosity_TwoPhase2D.cpp.o
[ 63%] Building CXX object src/ErrorEstimate/CMakeFiles/ErrorEstimateLib.dir/DG/Instantiate/ErrorEstimate_DGBR2_ArtificialViscosity_TwoPhase2D_LogpnSw.cpp.o
[ 63%] Building CXX object src/ErrorEstimate/CMakeFiles/ErrorEstimateLib.dir/DG/Instantiate/ErrorEstimate_DGBR2_ArtificialViscosity_RANSSA3D_PrimitiveSutherland.cpp.o
[ 63%] Building CXX object src/ErrorEstimate/CMakeFiles/ErrorEstimateLib.dir/DG/Instantiate/ErrorEstimate_DGBR2_Lorenz.cpp.o
[ 63%] Building CXX object src/ErrorEstimate/CMakeFiles/ErrorEstimateLib.dir/Galerkin/ErrorEstimateNodalBase_Galerkin.cpp.o
[ 63%] Building CXX object src/ErrorEstimate/CMakeFiles/ErrorEstimateLib.dir/VMSD/ErrorEstimateBase_VMSD.cpp.o
[ 63%] Building CXX object src/ErrorEstimate/CMakeFiles/ErrorEstimateLib.dir/VMSD/ErrorEstimateBase_VMSD_BR2.cpp.o
[ 63%] Linking CXX static library libErrorEstimateLib.a
[ 63%] Built target ErrorEstimateLib
Scanning dependencies of target ErrorEstimateCell_VMSD_AD_btest_OBJECT
[ 63%] Building CXX object test/unit/ErrorEstimate/CMakeFiles/ErrorEstimateCell_VMSD_AD_btest_OBJECT.dir/ErrorEstimateCell_VMSD_AD_btest.cpp.o
[ 63%] Built target ErrorEstimateCell_VMSD_AD_btest_OBJECT
Scanning dependencies of target ErrorEstimateCell_VMSD_AD_btest_build_vera
[ 63%] Checking style of test/unit/ErrorEstimate/ErrorEstimateCell_VMSD_AD_btest.cpp
[ 63%] Built target ErrorEstimateCell_VMSD_AD_btest_build_vera
Scanning dependencies of target ErrorEstimateCell_VMSD_AD_btest_build
[ 63%] Linking CXX executable ErrorEstimateCell_VMSD_AD_btest
[ 63%] Built target ErrorEstimateCell_VMSD_AD_btest_build
Scanning dependencies of target ErrorEstimate_DGBR2_AD_btest_build_vera
[ 63%] Checking style of test/unit/ErrorEstimate/ErrorEstimate_DGBR2_AD_btest.cpp
[ 63%] Built target ErrorEstimate_DGBR2_AD_btest_build_vera
Scanning dependencies of target ErrorEstimate_DGBR2_AD_btest_OBJECT
[ 63%] Building CXX object test/unit/ErrorEstimate/CMakeFiles/ErrorEstimate_DGBR2_AD_btest_OBJECT.dir/ErrorEstimate_DGBR2_AD_btest.cpp.o
[ 63%] Built target ErrorEstimate_DGBR2_AD_btest_OBJECT
Scanning dependencies of target ErrorEstimate_DGBR2_AD_btest_build
[ 63%] Linking CXX executable ErrorEstimate_DGBR2_AD_btest
[ 63%] Built target ErrorEstimate_DGBR2_AD_btest_build
Scanning dependencies of target ErrorEstimate_Common_btest_OBJECT
[ 63%] Building CXX object test/unit/ErrorEstimate/CMakeFiles/ErrorEstimate_Common_btest_OBJECT.dir/ErrorEstimate_Common_btest.cpp.o
[ 63%] Built target ErrorEstimate_Common_btest_OBJECT
Scanning dependencies of target ErrorEstimate_Common_btest_build_vera
[ 63%] Checking style of test/unit/ErrorEstimate/ErrorEstimate_Common_btest.cpp
[ 63%] Built target ErrorEstimate_Common_btest_build_vera
Scanning dependencies of target ErrorEstimate_Common_btest_build
[ 63%] Linking CXX executable ErrorEstimate_Common_btest
[ 63%] Built target ErrorEstimate_Common_btest_build
Scanning dependencies of target ErrorEstimateBoundaryTrace_HDG_AD_btest_OBJECT
[ 63%] Building CXX object test/unit/ErrorEstimate/CMakeFiles/ErrorEstimateBoundaryTrace_HDG_AD_btest_OBJECT.dir/ErrorEstimateBoundaryTrace_HDG_AD_btest.cpp.o
[ 63%] Built target ErrorEstimateBoundaryTrace_HDG_AD_btest_OBJECT
Scanning dependencies of target ErrorEstimateBoundaryTrace_HDG_AD_btest_build_vera
[ 63%] Checking style of test/unit/ErrorEstimate/ErrorEstimateBoundaryTrace_HDG_AD_btest.cpp
[ 63%] Built target ErrorEstimateBoundaryTrace_HDG_AD_btest_build_vera
Scanning dependencies of target ErrorEstimateBoundaryTrace_HDG_AD_btest_build
[ 63%] Linking CXX executable ErrorEstimateBoundaryTrace_HDG_AD_btest
[ 63%] Built target ErrorEstimateBoundaryTrace_HDG_AD_btest_build
Scanning dependencies of target ErrorEstimateCell_DGBR2_LiftedQuantity_TwoPhaseAV_btest_build_vera
[ 63%] Checking style of test/unit/ErrorEstimate/ErrorEstimateCell_DGBR2_LiftedQuantity_TwoPhaseAV_btest.cpp
[ 63%] Built target ErrorEstimateCell_DGBR2_LiftedQuantity_TwoPhaseAV_btest_build_vera
Scanning dependencies of target ErrorEstimateCell_DGBR2_LiftedQuantity_TwoPhaseAV_btest_OBJECT
[ 63%] Building CXX object test/unit/ErrorEstimate/CMakeFiles/ErrorEstimateCell_DGBR2_LiftedQuantity_TwoPhaseAV_btest_OBJECT.dir/ErrorEstimateCell_DGBR2_LiftedQuantity_TwoPhaseAV_btest.cpp.o
[ 63%] Built target ErrorEstimateCell_DGBR2_LiftedQuantity_TwoPhaseAV_btest_OBJECT
Scanning dependencies of target ErrorEstimateCell_DGBR2_LiftedQuantity_TwoPhaseAV_btest_build
[ 63%] Linking CXX executable ErrorEstimateCell_DGBR2_LiftedQuantity_TwoPhaseAV_btest
[ 63%] Built target ErrorEstimateCell_DGBR2_LiftedQuantity_TwoPhaseAV_btest_build
Scanning dependencies of target ErrorEstimateCell_DGBR2_AD_btest_build_vera
[ 63%] Checking style of test/unit/ErrorEstimate/ErrorEstimateCell_DGBR2_AD_btest.cpp
[ 63%] Built target ErrorEstimateCell_DGBR2_AD_btest_build_vera
Scanning dependencies of target ErrorEstimateCell_DGBR2_AD_btest_OBJECT
[ 63%] Building CXX object test/unit/ErrorEstimate/CMakeFiles/ErrorEstimateCell_DGBR2_AD_btest_OBJECT.dir/ErrorEstimateCell_DGBR2_AD_btest.cpp.o
[ 63%] Built target ErrorEstimateCell_DGBR2_AD_btest_OBJECT
Scanning dependencies of target ErrorEstimateCell_DGBR2_AD_btest_build
[ 63%] Linking CXX executable ErrorEstimateCell_DGBR2_AD_btest
[ 63%] Built target ErrorEstimateCell_DGBR2_AD_btest_build
Scanning dependencies of target ErrorEstimate_L2_AD_btest_build_vera
[ 63%] Checking style of test/unit/ErrorEstimate/ErrorEstimate_L2_AD_btest.cpp
[ 63%] Built target ErrorEstimate_L2_AD_btest_build_vera
Scanning dependencies of target ErrorEstimate_L2_AD_btest_OBJECT
[ 63%] Building CXX object test/unit/ErrorEstimate/CMakeFiles/ErrorEstimate_L2_AD_btest_OBJECT.dir/ErrorEstimate_L2_AD_btest.cpp.o
[ 63%] Built target ErrorEstimate_L2_AD_btest_OBJECT
Scanning dependencies of target ErrorEstimate_L2_AD_btest_build
[ 63%] Linking CXX executable ErrorEstimate_L2_AD_btest
[ 63%] Built target ErrorEstimate_L2_AD_btest_build
Scanning dependencies of target ErrorEstimateInteriorTrace_HDG_AD_btest_OBJECT
[ 63%] Building CXX object test/unit/ErrorEstimate/CMakeFiles/ErrorEstimateInteriorTrace_HDG_AD_btest_OBJECT.dir/ErrorEstimateInteriorTrace_HDG_AD_btest.cpp.o
[ 63%] Built target ErrorEstimateInteriorTrace_HDG_AD_btest_OBJECT
Scanning dependencies of target ErrorEstimateInteriorTrace_HDG_AD_btest_build_vera
[ 63%] Checking style of test/unit/ErrorEstimate/ErrorEstimateInteriorTrace_HDG_AD_btest.cpp
[ 63%] Built target ErrorEstimateInteriorTrace_HDG_AD_btest_build_vera
Scanning dependencies of target ErrorEstimateInteriorTrace_HDG_AD_btest_build
[ 63%] Linking CXX executable ErrorEstimateInteriorTrace_HDG_AD_btest
[ 63%] Built target ErrorEstimateInteriorTrace_HDG_AD_btest_build
Scanning dependencies of target ErrorEstimateInteriorTrace_Galerkin_AD_btest_build_vera
[ 63%] Checking style of test/unit/ErrorEstimate/ErrorEstimateInteriorTrace_Galerkin_AD_btest.cpp
[ 63%] Built target ErrorEstimateInteriorTrace_Galerkin_AD_btest_build_vera
Scanning dependencies of target ErrorEstimateInteriorTrace_Galerkin_AD_btest_OBJECT
[ 63%] Building CXX object test/unit/ErrorEstimate/CMakeFiles/ErrorEstimateInteriorTrace_Galerkin_AD_btest_OBJECT.dir/ErrorEstimateInteriorTrace_Galerkin_AD_btest.cpp.o
[ 63%] Built target ErrorEstimateInteriorTrace_Galerkin_AD_btest_OBJECT
Scanning dependencies of target ErrorEstimateInteriorTrace_Galerkin_AD_btest_build
[ 63%] Linking CXX executable ErrorEstimateInteriorTrace_Galerkin_AD_btest
[ 63%] Built target ErrorEstimateInteriorTrace_Galerkin_AD_btest_build
Scanning dependencies of target ErrorEstimateCell_PrimalStrongForm_Galerkin_AD_btest_build_vera
[ 63%] Checking style of test/unit/ErrorEstimate/ErrorEstimateCell_PrimalStrongForm_Galerkin_AD_btest.cpp
[ 63%] Built target ErrorEstimateCell_PrimalStrongForm_Galerkin_AD_btest_build_vera
Scanning dependencies of target ErrorEstimateCell_PrimalStrongForm_Galerkin_AD_btest_OBJECT
[ 63%] Building CXX object test/unit/ErrorEstimate/CMakeFiles/ErrorEstimateCell_PrimalStrongForm_Galerkin_AD_btest_OBJECT.dir/ErrorEstimateCell_PrimalStrongForm_Galerkin_AD_btest.cpp.o
[ 63%] Built target ErrorEstimateCell_PrimalStrongForm_Galerkin_AD_btest_OBJECT
Scanning dependencies of target ErrorEstimateCell_PrimalStrongForm_Galerkin_AD_btest_build
[ 63%] Linking CXX executable ErrorEstimateCell_PrimalStrongForm_Galerkin_AD_btest
[ 63%] Built target ErrorEstimateCell_PrimalStrongForm_Galerkin_AD_btest_build
Scanning dependencies of target ErrorEstimate_Galerkin_AD_btest_OBJECT
[ 63%] Building CXX object test/unit/ErrorEstimate/CMakeFiles/ErrorEstimate_Galerkin_AD_btest_OBJECT.dir/ErrorEstimate_Galerkin_AD_btest.cpp.o
[ 63%] Built target ErrorEstimate_Galerkin_AD_btest_OBJECT
Scanning dependencies of target ErrorEstimate_Galerkin_AD_btest_build_vera
[ 63%] Checking style of test/unit/ErrorEstimate/ErrorEstimate_Galerkin_AD_btest.cpp
[ 63%] Built target ErrorEstimate_Galerkin_AD_btest_build_vera
Scanning dependencies of target ErrorEstimate_Galerkin_AD_btest_build
[ 63%] Linking CXX executable ErrorEstimate_Galerkin_AD_btest
[ 63%] Built target ErrorEstimate_Galerkin_AD_btest_build
Scanning dependencies of target ErrorEstimateNodal_Galerkin_AD_btest_OBJECT
[ 63%] Building CXX object test/unit/ErrorEstimate/CMakeFiles/ErrorEstimateNodal_Galerkin_AD_btest_OBJECT.dir/ErrorEstimateNodal_Galerkin_AD_btest.cpp.o
[ 63%] Built target ErrorEstimateNodal_Galerkin_AD_btest_OBJECT
Scanning dependencies of target ErrorEstimateNodal_Galerkin_AD_btest_build_vera
[ 63%] Checking style of test/unit/ErrorEstimate/ErrorEstimateNodal_Galerkin_AD_btest.cpp
[ 63%] Built target ErrorEstimateNodal_Galerkin_AD_btest_build_vera
Scanning dependencies of target ErrorEstimateNodal_Galerkin_AD_btest_build
[ 63%] Linking CXX executable ErrorEstimateNodal_Galerkin_AD_btest
[ 63%] Built target ErrorEstimateNodal_Galerkin_AD_btest_build
Scanning dependencies of target ErrorEstimateBoundaryTrace_DGBR2_AD_btest_build_vera
[ 63%] Checking style of test/unit/ErrorEstimate/ErrorEstimateBoundaryTrace_DGBR2_AD_btest.cpp
[ 63%] Built target ErrorEstimateBoundaryTrace_DGBR2_AD_btest_build_vera
Scanning dependencies of target ErrorEstimateBoundaryTrace_DGBR2_AD_btest_OBJECT
[ 63%] Building CXX object test/unit/ErrorEstimate/CMakeFiles/ErrorEstimateBoundaryTrace_DGBR2_AD_btest_OBJECT.dir/ErrorEstimateBoundaryTrace_DGBR2_AD_btest.cpp.o
[ 63%] Built target ErrorEstimateBoundaryTrace_DGBR2_AD_btest_OBJECT
Scanning dependencies of target ErrorEstimateBoundaryTrace_DGBR2_AD_btest_build
[ 63%] Linking CXX executable ErrorEstimateBoundaryTrace_DGBR2_AD_btest
[ 63%] Built target ErrorEstimateBoundaryTrace_DGBR2_AD_btest_build
Scanning dependencies of target ErrorEstimateInteriorTrace_DGBR2_AD_btest_OBJECT
[ 63%] Building CXX object test/unit/ErrorEstimate/CMakeFiles/ErrorEstimateInteriorTrace_DGBR2_AD_btest_OBJECT.dir/ErrorEstimateInteriorTrace_DGBR2_AD_btest.cpp.o
[ 63%] Built target ErrorEstimateInteriorTrace_DGBR2_AD_btest_OBJECT
Scanning dependencies of target ErrorEstimateInteriorTrace_DGBR2_AD_btest_build_vera
[ 63%] Checking style of test/unit/ErrorEstimate/ErrorEstimateInteriorTrace_DGBR2_AD_btest.cpp
[ 63%] Built target ErrorEstimateInteriorTrace_DGBR2_AD_btest_build_vera
Scanning dependencies of target ErrorEstimateInteriorTrace_DGBR2_AD_btest_build
[ 63%] Linking CXX executable ErrorEstimateInteriorTrace_DGBR2_AD_btest
[ 63%] Built target ErrorEstimateInteriorTrace_DGBR2_AD_btest_build
Scanning dependencies of target ErrorEstimate_HDG_AD_btest_build_vera
[ 63%] Checking style of test/unit/ErrorEstimate/ErrorEstimate_HDG_AD_btest.cpp
[ 63%] Built target ErrorEstimate_HDG_AD_btest_build_vera
Scanning dependencies of target ErrorEstimate_HDG_AD_btest_OBJECT
[ 63%] Building CXX object test/unit/ErrorEstimate/CMakeFiles/ErrorEstimate_HDG_AD_btest_OBJECT.dir/ErrorEstimate_HDG_AD_btest.cpp.o
[ 63%] Built target ErrorEstimate_HDG_AD_btest_OBJECT
Scanning dependencies of target ErrorEstimate_HDG_AD_btest_build
[ 63%] Linking CXX executable ErrorEstimate_HDG_AD_btest
[ 63%] Built target ErrorEstimate_HDG_AD_btest_build
Scanning dependencies of target ErrorEstimateInteriorTrace_PrimalStrongForm_Galerkin_AD_btest_OBJECT
[ 63%] Building CXX object test/unit/ErrorEstimate/CMakeFiles/ErrorEstimateInteriorTrace_PrimalStrongForm_Galerkin_AD_btest_OBJECT.dir/ErrorEstimateInteriorTrace_PrimalStrongForm_Galerkin_AD_btest.cpp.o
[ 63%] Built target ErrorEstimateInteriorTrace_PrimalStrongForm_Galerkin_AD_btest_OBJECT
Scanning dependencies of target ErrorEstimateInteriorTrace_PrimalStrongForm_Galerkin_AD_btest_build_vera
[ 63%] Checking style of test/unit/ErrorEstimate/ErrorEstimateInteriorTrace_PrimalStrongForm_Galerkin_AD_btest.cpp
[ 63%] Built target ErrorEstimateInteriorTrace_PrimalStrongForm_Galerkin_AD_btest_build_vera
Scanning dependencies of target ErrorEstimateInteriorTrace_PrimalStrongForm_Galerkin_AD_btest_build
[ 63%] Linking CXX executable ErrorEstimateInteriorTrace_PrimalStrongForm_Galerkin_AD_btest
[ 63%] Built target ErrorEstimateInteriorTrace_PrimalStrongForm_Galerkin_AD_btest_build
Scanning dependencies of target ErrorEstimateCell_HDG_AD_btest_OBJECT
[ 63%] Building CXX object test/unit/ErrorEstimate/CMakeFiles/ErrorEstimateCell_HDG_AD_btest_OBJECT.dir/ErrorEstimateCell_HDG_AD_btest.cpp.o
[ 63%] Built target ErrorEstimateCell_HDG_AD_btest_OBJECT
Scanning dependencies of target ErrorEstimateCell_HDG_AD_btest_build_vera
[ 63%] Checking style of test/unit/ErrorEstimate/ErrorEstimateCell_HDG_AD_btest.cpp
[ 63%] Built target ErrorEstimateCell_HDG_AD_btest_build_vera
Scanning dependencies of target ErrorEstimateCell_HDG_AD_btest_build
[ 63%] Linking CXX executable ErrorEstimateCell_HDG_AD_btest
[ 63%] Built target ErrorEstimateCell_HDG_AD_btest_build
Scanning dependencies of target ErrorEstimateCell_Galerkin_AD_btest_build_vera
[ 63%] Checking style of test/unit/ErrorEstimate/ErrorEstimateCell_Galerkin_AD_btest.cpp
[ 63%] Built target ErrorEstimateCell_Galerkin_AD_btest_build_vera
Scanning dependencies of target ErrorEstimateCell_Galerkin_AD_btest_OBJECT
[ 63%] Building CXX object test/unit/ErrorEstimate/CMakeFiles/ErrorEstimateCell_Galerkin_AD_btest_OBJECT.dir/ErrorEstimateCell_Galerkin_AD_btest.cpp.o
[ 63%] Built target ErrorEstimateCell_Galerkin_AD_btest_OBJECT
Scanning dependencies of target ErrorEstimateCell_Galerkin_AD_btest_build
[ 63%] Linking CXX executable ErrorEstimateCell_Galerkin_AD_btest
[ 63%] Built target ErrorEstimateCell_Galerkin_AD_btest_build
Scanning dependencies of target OutputCorrection_Galerkin_Stabilized_AD_btest_OBJECT
[ 63%] Building CXX object test/unit/ErrorEstimate/CMakeFiles/OutputCorrection_Galerkin_Stabilized_AD_btest_OBJECT.dir/OutputCorrection_Galerkin_Stabilized_AD_btest.cpp.o
[ 63%] Built target OutputCorrection_Galerkin_Stabilized_AD_btest_OBJECT
Scanning dependencies of target OutputCorrection_Galerkin_Stabilized_AD_btest_build_vera
[ 63%] Checking style of test/unit/ErrorEstimate/OutputCorrection_Galerkin_Stabilized_AD_btest.cpp
[ 63%] Built target OutputCorrection_Galerkin_Stabilized_AD_btest_build_vera
Scanning dependencies of target OutputCorrection_Galerkin_Stabilized_AD_btest_build
[ 63%] Linking CXX executable OutputCorrection_Galerkin_Stabilized_AD_btest
[ 63%] Built target OutputCorrection_Galerkin_Stabilized_AD_btest_build
Scanning dependencies of target ErrorEstimateBoundaryTrace_Galerkin_AD_btest_OBJECT
[ 63%] Building CXX object test/unit/ErrorEstimate/CMakeFiles/ErrorEstimateBoundaryTrace_Galerkin_AD_btest_OBJECT.dir/ErrorEstimateBoundaryTrace_Galerkin_AD_btest.cpp.o
[ 63%] Built target ErrorEstimateBoundaryTrace_Galerkin_AD_btest_OBJECT
Scanning dependencies of target ErrorEstimateBoundaryTrace_Galerkin_AD_btest_build_vera
[ 63%] Checking style of test/unit/ErrorEstimate/ErrorEstimateBoundaryTrace_Galerkin_AD_btest.cpp
[ 63%] Built target ErrorEstimateBoundaryTrace_Galerkin_AD_btest_build_vera
Scanning dependencies of target ErrorEstimateBoundaryTrace_Galerkin_AD_btest_build
[ 63%] Linking CXX executable ErrorEstimateBoundaryTrace_Galerkin_AD_btest
[ 63%] Built target ErrorEstimateBoundaryTrace_Galerkin_AD_btest_build
Scanning dependencies of target BCIncompressibleRANSSA1DChannel_btest_build_vera
[ 63%] Checking style of test/unit/pde/IncompressibleNS/BCIncompressibleRANSSA1DChannel_btest.cpp
[ 63%] Built target BCIncompressibleRANSSA1DChannel_btest_build_vera
Scanning dependencies of target BCIncompressibleRANSSA1DChannel_btest_OBJECT
[ 63%] Building CXX object test/unit/pde/IncompressibleNS/CMakeFiles/BCIncompressibleRANSSA1DChannel_btest_OBJECT.dir/BCIncompressibleRANSSA1DChannel_btest.cpp.o
[ 63%] Built target BCIncompressibleRANSSA1DChannel_btest_OBJECT
Scanning dependencies of target BCIncompressibleRANSSA1DChannel_btest_build
[ 63%] Linking CXX executable BCIncompressibleRANSSA1DChannel_btest
[ 63%] Built target BCIncompressibleRANSSA1DChannel_btest_build
Scanning dependencies of target XField2D_Triangle_btest_OBJECT
[ 63%] Building CXX object test/unit/Field/CMakeFiles/XField2D_Triangle_btest_OBJECT.dir/XField2D_Triangle_btest.cpp.o
test/unit/Field/CMakeFiles/XField2D_Triangle_btest_OBJECT.dir/build.make:63: recipe for target 'test/unit/Field/CMakeFiles/XField2D_Triangle_btest_OBJECT.dir/XField2D_Triangle_btest.cpp.o' failed
make[3]: *** [test/unit/Field/CMakeFiles/XField2D_Triangle_btest_OBJECT.dir/XField2D_Triangle_btest.cpp.o] Error 1
CMakeFiles/Makefile2:71060: recipe for target 'test/unit/Field/CMakeFiles/XField2D_Triangle_btest_OBJECT.dir/all' failed
make[2]: *** [test/unit/Field/CMakeFiles/XField2D_Triangle_btest_OBJECT.dir/all] Error 2
CMakeFiles/Makefile2:10973: recipe for target 'test/unit/CMakeFiles/memcheck_unit.dir/rule' failed
make[1]: *** [test/unit/CMakeFiles/memcheck_unit.dir/rule] Error 2
Makefile:3202: recipe for target 'memcheck_unit' failed
make: *** [memcheck_unit] Error 2

real	220m11.917s
user	197m19.012s
sys	9m35.408s
+ status=1
++ find /jenkins/workspace/SANS_Weekly/builddir/release_gnu9/buildnode/reynolds/build/release_gnu9 -name Test.xml
+ mv /jenkins/workspace/SANS_Weekly/builddir/release_gnu9/buildnode/reynolds/build/Test_unit_mpi_memcheck.xml
mv: missing destination file operand after '/jenkins/workspace/SANS_Weekly/builddir/release_gnu9/buildnode/reynolds/build/Test_unit_mpi_memcheck.xml'
Try 'mv --help' for more information.
Build step 'Execute shell' marked build as failure
[GNU C Compiler (gcc)Clang (LLVM based)Intel Compiler (C, Fortran)Vera++] Skipping execution of recorder since overall result is 'FAILURE'
[Valgrind] Files to copy:
[Valgrind] Analysing valgrind results
[Valgrind] Ending the valgrind analysis.
INFO: Starting to record.
INFO: Processing CTest-Version 3.x (default)
INFO: [CTest-Version 3.x (default)] - No test report file(s) were found with the pattern 'build/Test*.xml' relative to '/jenkins/workspace/SANS_Weekly/builddir/release_gnu9/buildnode/reynolds' for the testing framework 'CTest-Version 3.x (default)'.
Did you enter a pattern relative to (and within) the workspace directory?
Did you generate the result report(s) for 'CTest-Version 3.x (default)'?"
INFO: Skipping tests recording.
[PostBuildScript] - [INFO] Executing post build scripts.
[PostBuildScript] - [INFO] Build does not have any of the results []. Did not execute build step #0.
[Checks API] No suitable checks publisher found.
[WS-CLEANUP] Deleting project workspace...
[WS-CLEANUP] Deferred wipeout is used...
[WS-CLEANUP] done
Finished: FAILURE