Skip to content
Failed

Console Output

Started by upstream project "gpkit_ResearchModel_solar_PR" build number 124
originally caused by:
 GitHub pull request #36 of commit 3da6e85e84fcf169d9d14ff11d4d714ee0ee514a, no merge conflicts.
Building remotely on windows7x64 in workspace D:\jenkins\workspace\gpkit_ResearchModel_solar_PR\mosek
Wiping out workspace first.
Cloning the remote Git repository
Cloning repository https://github.com/convexengineering/solar
 > git init D:\jenkins\workspace\gpkit_ResearchModel_solar_PR\mosek # timeout=10
Fetching upstream changes from https://github.com/convexengineering/solar
 > git --version # timeout=10
 > git fetch --tags --progress https://github.com/convexengineering/solar +refs/heads/*:refs/remotes/origin/*
 > git config remote.origin.url https://github.com/convexengineering/solar # timeout=10
 > git config --add remote.origin.fetch +refs/heads/*:refs/remotes/origin/* # timeout=10
 > git config remote.origin.url https://github.com/convexengineering/solar # timeout=10
Fetching upstream changes from https://github.com/convexengineering/solar
 > git fetch --tags --progress https://github.com/convexengineering/solar +refs/pull/*:refs/remotes/origin/pr/* +refs/heads/master:refs/remotes/origin/master
Merging Revision fb8918d608a2930d2f7496a77c09926abbe40049 (refs/remotes/origin/pr/36/merge) to origin/master, UserMergeOptions{mergeRemote='origin', mergeTarget='master', mergeStrategy='default', fastForwardMode='--ff'}
 > git rev-parse "origin/master^{commit}" # timeout=10
 > git config core.sparsecheckout # timeout=10
 > git checkout -f origin/master # timeout=3
 > git merge --ff fb8918d608a2930d2f7496a77c09926abbe40049 # timeout=10
 > git rev-parse "HEAD^{commit}" # timeout=10
Seen branch in repository origin/boxspar
Seen branch in repository origin/figgen
Seen branch in repository origin/master
Seen branch in repository origin/motor
Seen branch in repository origin/multipropulsor
Seen branch in repository origin/ncrit
Seen branch in repository origin/pr/10/head
Seen branch in repository origin/pr/11/head
Seen branch in repository origin/pr/12/head
Seen branch in repository origin/pr/12/merge
Seen branch in repository origin/pr/13/head
Seen branch in repository origin/pr/14/head
Seen branch in repository origin/pr/15/head
Seen branch in repository origin/pr/16/head
Seen branch in repository origin/pr/17/head
Seen branch in repository origin/pr/18/head
Seen branch in repository origin/pr/19/head
Seen branch in repository origin/pr/2/head
Seen branch in repository origin/pr/20/head
Seen branch in repository origin/pr/20/merge
Seen branch in repository origin/pr/21/head
Seen branch in repository origin/pr/22/head
Seen branch in repository origin/pr/23/head
Seen branch in repository origin/pr/26/head
Seen branch in repository origin/pr/27/head
Seen branch in repository origin/pr/28/head
Seen branch in repository origin/pr/30/head
Seen branch in repository origin/pr/31/head
Seen branch in repository origin/pr/32/head
Seen branch in repository origin/pr/33/head
Seen branch in repository origin/pr/34/head
Seen branch in repository origin/pr/34/merge
Seen branch in repository origin/pr/36/head
Seen branch in repository origin/pr/36/merge
Seen branch in repository origin/pr/4/head
Seen branch in repository origin/pr/5/head
Seen branch in repository origin/pr/6/head
Seen branch in repository origin/pr/7/head
Seen branch in repository origin/pr/8/head
Seen branch in repository origin/pr/9/head
Seen branch in repository origin/revert-33-solartest
Seen branch in repository origin/wingfix
Seen 42 remote branches
 > git show-ref --tags -d # timeout=10
Checking out Revision fb8918d608a2930d2f7496a77c09926abbe40049 (origin/pr/36/merge, origin/master)
 > git config core.sparsecheckout # timeout=10
 > git checkout -f fb8918d608a2930d2f7496a77c09926abbe40049 # timeout=3
Commit message: "Merge 3da6e85e84fcf169d9d14ff11d4d714ee0ee514a into 7eef17a82acc1014a208f3d17f1a9672ea3705be"
Using 'Changelog to branch' strategy.
Run condition [Execution node ] enabling prebuild for step [Execute shell]
Run condition [Execution node ] enabling prebuild for step [Execute Windows batch command]
[Execution node] check if [windows7x64] is in [[macys, macys_VM, reynolds, reynolds-ubuntu16]]
Run condition [Execution node ] preventing perform for step [Execute shell]
[Execution node] check if [windows7x64] is in [[windows10x64, windows7x64]]
Run condition [Execution node ] enabling perform for step [Execute Windows batch command]
[mosek] $ cmd /c call C:\Users\jenkins\AppData\Local\Temp\jenkins8647905074570232965.bat

D:\jenkins\workspace\gpkit_ResearchModel_solar_PR\mosek>echo C:\Program Files (x86)\Common Files\Oracle\Java\javapath;C:\ProgramData\Oracle\Java\javapath;%CommonProgramFiles%\Microsoft Shared\Windows Live;C:\Windows\system32;C:\Windows;C:\Windows\System32\Wbem;C:\Windows\System32\WindowsPowerShell\v1.0\;C:\Windows\System32\WindowsPowerShell\v1.0\;C:\Program Files\Microsoft SQL Server\110\Tools\Binn\;C:\Program Files (x86)\Windows Kits\8.1\Windows Performance Toolkit\;C:\Program Files (x86)\Microsoft SDKs\TypeScript\1.0\;C:\Program Files\Microsoft\Web Platform Installer\;C:\Program Files\Mosek\7\tools\platform\win64x86\bin;D:\Anaconda2;D:\Anaconda2\Scripts;D:\Anaconda2\Library\bin;C:\Windows\System32\WindowsPowerShell\v1.0\;C:\Program Files\TortoiseSVN\bin;C:\Program Files (x86)\Intel\Compiler\Fortran\9.1\EM64T\Bin;C:\Program Files (x86)\Google\Chrome\Application;C:\Program Files\Common Files\Microsoft Shared\Windows Live;C:\Program Files\mingw-w64\x86_64-6.3.0-posix-seh-rt_v5-rev1\mingw64\bin;D:\Git\cmd 
C:\Program Files (x86)\Common Files\Oracle\Java\javapath;C:\ProgramData\Oracle\Java\javapath;%CommonProgramFiles%\Microsoft Shared\Windows Live;C:\Windows\system32;C:\Windows;C:\Windows\System32\Wbem;C:\Windows\System32\WindowsPowerShell\v1.0\;C:\Windows\System32\WindowsPowerShell\v1.0\;C:\Program Files\Microsoft SQL Server\110\Tools\Binn\;C:\Program Files (x86)\Windows Kits\8.1\Windows Performance Toolkit\;C:\Program Files (x86)\Microsoft SDKs\TypeScript\1.0\;C:\Program Files\Microsoft\Web Platform Installer\;C:\Program Files\Mosek\7\tools\platform\win64x86\bin;D:\Anaconda2;D:\Anaconda2\Scripts;D:\Anaconda2\Library\bin;C:\Windows\System32\WindowsPowerShell\v1.0\;C:\Program Files\TortoiseSVN\bin;C:\Program Files (x86)\Intel\Compiler\Fortran\9.1\EM64T\Bin;C:\Program Files (x86)\Google\Chrome\Application;C:\Program Files\Common Files\Microsoft Shared\Windows Live;C:\Program Files\mingw-w64\x86_64-6.3.0-posix-seh-rt_v5-rev1\mingw64\bin;D:\Git\cmd

D:\jenkins\workspace\gpkit_ResearchModel_solar_PR\mosek>REM turn on the anaconda console 

D:\jenkins\workspace\gpkit_ResearchModel_solar_PR\mosek>call activate.bat   || exit /b 666 

(base) D:\jenkins\workspace\gpkit_ResearchModel_solar_PR\mosek>REM Create a virtualenv to install everything into 

(base) D:\jenkins\workspace\gpkit_ResearchModel_solar_PR\mosek>set VENV=D:\jenkins\workspace\gpkit_ResearchModel_solar_PR\mosek\venv2_gpkit 

(base) D:\jenkins\workspace\gpkit_ResearchModel_solar_PR\mosek>virtualenv --system-site-packages D:\jenkins\workspace\gpkit_ResearchModel_solar_PR\mosek\venv2_gpkit    || exit /b 666 
New python executable in D:\jenkins\workspace\gpkit_ResearchModel_solar_PR\mosek\venv2_gpkit\Scripts\python.exe
Installing setuptools, pip, wheel...done.

(base) D:\jenkins\workspace\gpkit_ResearchModel_solar_PR\mosek>call D:\jenkins\workspace\gpkit_ResearchModel_solar_PR\mosek\venv2_gpkit\Scripts\activate.bat   || exit /b 666 

(venv2_gpkit) (base) D:\jenkins\workspace\gpkit_ResearchModel_solar_PR\mosek>set PATH=C:\mingw-w64\x86_64-6.4.0-posix-seh-rt_v5-rev0\mingw64\bin;D:\jenkins\workspace\gpkit_ResearchModel_solar_PR\mosek\venv2_gpkit\Scripts;D:\Anaconda2;D:\Anaconda2\Library\mingw-w64\bin;D:\Anaconda2\Library\usr\bin;D:\Anaconda2\Library\bin;D:\Anaconda2\Scripts;D:\Anaconda2\bin;C:\Program Files (x86)\Common Files\Oracle\Java\javapath;C:\ProgramData\Oracle\Java\javapath;C:\Program Files\Common Files\Microsoft Shared\Windows Live;C:\Windows\system32;C:\Windows;C:\Windows\System32\Wbem;C:\Windows\System32\WindowsPowerShell\v1.0\;C:\Windows\System32\WindowsPowerShell\v1.0\;C:\Program Files\Microsoft SQL Server\110\Tools\Binn\;C:\Program Files (x86)\Windows Kits\8.1\Windows Performance Toolkit\;C:\Program Files (x86)\Microsoft SDKs\TypeScript\1.0\;C:\Program Files\Microsoft\Web Platform Installer\;C:\Program Files\Mosek\7\tools\platform\win64x86\bin;D:\Anaconda2;D:\Anaconda2\Scripts;D:\Anaconda2\Library\bin;C:\Windows\System32\WindowsPowerShell\v1.0\;C:\Program Files\TortoiseSVN\bin;C:\Program Files (x86)\Intel\Compiler\Fortran\9.1\EM64T\Bin;C:\Program Files (x86)\Google\Chrome\Application;C:\Program Files\Common Files\Microsoft Shared\Windows Live;C:\Program Files\mingw-w64\x86_64-6.3.0-posix-seh-rt_v5-rev1\mingw64\bin;D:\Git\cmd 

(venv2_gpkit) (base) D:\jenkins\workspace\gpkit_ResearchModel_solar_PR\mosek>REM set PATH=C:\mingw-w64\x86_64-7.3.0-posix-seh-rt_v5-rev0\mingw64\bin;C:\mingw-w64\x86_64-6.4.0-posix-seh-rt_v5-rev0\mingw64\bin;D:\jenkins\workspace\gpkit_ResearchModel_solar_PR\mosek\venv2_gpkit\Scripts;D:\Anaconda2;D:\Anaconda2\Library\mingw-w64\bin;D:\Anaconda2\Library\usr\bin;D:\Anaconda2\Library\bin;D:\Anaconda2\Scripts;D:\Anaconda2\bin;C:\Program Files (x86)\Common Files\Oracle\Java\javapath;C:\ProgramData\Oracle\Java\javapath;C:\Program Files\Common Files\Microsoft Shared\Windows Live;C:\Windows\system32;C:\Windows;C:\Windows\System32\Wbem;C:\Windows\System32\WindowsPowerShell\v1.0\;C:\Windows\System32\WindowsPowerShell\v1.0\;C:\Program Files\Microsoft SQL Server\110\Tools\Binn\;C:\Program Files (x86)\Windows Kits\8.1\Windows Performance Toolkit\;C:\Program Files (x86)\Microsoft SDKs\TypeScript\1.0\;C:\Program Files\Microsoft\Web Platform Installer\;C:\Program Files\Mosek\7\tools\platform\win64x86\bin;D:\Anaconda2;D:\Anaconda2\Scripts;D:\Anaconda2\Library\bin;C:\Windows\System32\WindowsPowerShell\v1.0\;C:\Program Files\TortoiseSVN\bin;C:\Program Files (x86)\Intel\Compiler\Fortran\9.1\EM64T\Bin;C:\Program Files (x86)\Google\Chrome\Application;C:\Program Files\Common Files\Microsoft Shared\Windows Live;C:\Program Files\mingw-w64\x86_64-6.3.0-posix-seh-rt_v5-rev1\mingw64\bin;D:\Git\cmd 

(venv2_gpkit) (base) D:\jenkins\workspace\gpkit_ResearchModel_solar_PR\mosek>gcc --version   || exit /b 666 
gcc (x86_64-posix-seh-rev0, Built by MinGW-W64 project) 6.4.0
Copyright (C) 2017 Free Software Foundation, Inc.
This is free software; see the source for copying conditions.  There is NO
warranty; not even for MERCHANTABILITY or FITNESS FOR A PARTICULAR PURPOSE.


(venv2_gpkit) (base) D:\jenkins\workspace\gpkit_ResearchModel_solar_PR\mosek>REM upgrade pip 

(venv2_gpkit) (base) D:\jenkins\workspace\gpkit_ResearchModel_solar_PR\mosek>python -m pip install --upgrade pip   || exit /b 666 
Requirement already up-to-date: pip in d:\jenkins\workspace\gpkit_researchmodel_solar_pr\mosek\venv2_gpkit\lib\site-packages (10.0.1)
grin 1.2.1 requires argparse>=1.1, which is not installed.

(venv2_gpkit) (base) D:\jenkins\workspace\gpkit_ResearchModel_solar_PR\mosek>REM Install coverage into the virtualenv to the coverage command blow uses the virtualenv python 

(venv2_gpkit) (base) D:\jenkins\workspace\gpkit_ResearchModel_solar_PR\mosek>REM pip install --upgrade coverage || exit /b 666 

(venv2_gpkit) (base) D:\jenkins\workspace\gpkit_ResearchModel_solar_PR\mosek>set GPKITBUILD=D:\jenkins\workspace\gpkit_ResearchModel_solar_PR\mosek\build_gpkit 

(venv2_gpkit) (base) D:\jenkins\workspace\gpkit_ResearchModel_solar_PR\mosek>if mosek == mosek (
msktestlic   || exit /b 666  
 python -c "__import__('mosek').Env()"   || exit /b 666  
 set GPKITSOLVERS=mosek, mosek_cli 
) 
Computer
  Platform               : Windows/64-X86  

Problem
  Name                   :                 
  Objective sense        : min             
  Type                   : LO (linear optimization problem)
  Constraints            : 1               
  Cones                  : 0               
  Scalar variables       : 5000            
  Matrix variables       : 0               
  Integer variables      : 0               

Optimizer started.
Interior-point optimizer started.
Presolve started.
Linear dependency checker started.
Linear dependency checker terminated.
Eliminator - tries                  : 0                 time                   : 0.00            
Eliminator - elim's                 : 0               
Lin. dep.  - tries                  : 1                 time                   : 0.00            
Lin. dep.  - number                 : 0               
Presolve terminated. Time: 0.00    
Interior-point optimizer terminated. Time: 0.00. 

Optimizer terminated. Time: 0.08    
************************************
A license was checked out correctly.
************************************

(venv2_gpkit) (base) D:\jenkins\workspace\gpkit_ResearchModel_solar_PR\mosek>if mosek == cvxopt (
pip install --upgrade cvxopt   || exit /b 666  
 set GPKITSOLVERS=cvxopt 
) 

(venv2_gpkit) (base) D:\jenkins\workspace\gpkit_ResearchModel_solar_PR\mosek>REM Install packages needed for testing 

(venv2_gpkit) (base) D:\jenkins\workspace\gpkit_ResearchModel_solar_PR\mosek>pip install --upgrade xmlrunner   || exit /b 666 
Requirement already up-to-date: xmlrunner in d:\anaconda2\lib\site-packages (1.7.7)
grin 1.2.1 requires argparse>=1.1, which is not installed.

(venv2_gpkit) (base) D:\jenkins\workspace\gpkit_ResearchModel_solar_PR\mosek>pip install --upgrade pint   || exit /b 666 
Requirement already up-to-date: pint in d:\anaconda2\lib\site-packages (0.8.1)
grin 1.2.1 requires argparse>=1.1, which is not installed.

(venv2_gpkit) (base) D:\jenkins\workspace\gpkit_ResearchModel_solar_PR\mosek>pip install --upgrade numpy   || exit /b 666 
Requirement already up-to-date: numpy in d:\anaconda2\lib\site-packages (1.14.3)
grin 1.2.1 requires argparse>=1.1, which is not installed.

(venv2_gpkit) (base) D:\jenkins\workspace\gpkit_ResearchModel_solar_PR\mosek>pip install --upgrade scipy   || exit /b 666 
Requirement already up-to-date: scipy in d:\anaconda2\lib\site-packages (1.0.1)
Requirement not upgraded as not directly required: numpy>=1.8.2 in d:\anaconda2\lib\site-packages (from scipy) (1.14.3)
grin 1.2.1 requires argparse>=1.1, which is not installed.

(venv2_gpkit) (base) D:\jenkins\workspace\gpkit_ResearchModel_solar_PR\mosek>pip install --upgrade ctypesgen   || exit /b 666 
Requirement already up-to-date: ctypesgen in d:\anaconda2\lib\site-packages (0.post125)
grin 1.2.1 requires argparse>=1.1, which is not installed.

(venv2_gpkit) (base) D:\jenkins\workspace\gpkit_ResearchModel_solar_PR\mosek>pip install --upgrade matplotlib   || exit /b 666 
Requirement already up-to-date: matplotlib in d:\anaconda2\lib\site-packages (2.2.2)
Requirement not upgraded as not directly required: backports.functools-lru-cache in d:\anaconda2\lib\site-packages (from matplotlib) (1.4)
Requirement not upgraded as not directly required: six>=1.10 in d:\anaconda2\lib\site-packages (from matplotlib) (1.11.0)
Requirement not upgraded as not directly required: pytz in d:\anaconda2\lib\site-packages (from matplotlib) (2017.3)
Requirement not upgraded as not directly required: cycler>=0.10 in d:\anaconda2\lib\site-packages (from matplotlib) (0.10.0)
Requirement not upgraded as not directly required: kiwisolver>=1.0.1 in d:\anaconda2\lib\site-packages (from matplotlib) (1.0.1)
Requirement not upgraded as not directly required: python-dateutil>=2.1 in d:\anaconda2\lib\site-packages (from matplotlib) (2.6.1)
Requirement not upgraded as not directly required: pyparsing!=2.0.4,!=2.1.2,!=2.1.6,>=2.0.1 in d:\anaconda2\lib\site-packages (from matplotlib) (2.2.0)
Requirement not upgraded as not directly required: numpy>=1.7.1 in d:\anaconda2\lib\site-packages (from matplotlib) (1.14.3)
Requirement not upgraded as not directly required: setuptools in d:\jenkins\workspace\gpkit_researchmodel_solar_pr\mosek\venv2_gpkit\lib\site-packages (from kiwisolver>=1.0.1->matplotlib) (39.1.0)
grin 1.2.1 requires argparse>=1.1, which is not installed.

(venv2_gpkit) (base) D:\jenkins\workspace\gpkit_ResearchModel_solar_PR\mosek>if mosek == cvxopt python -c "import cvxopt; print cvxopt.__version__" 

(venv2_gpkit) (base) D:\jenkins\workspace\gpkit_ResearchModel_solar_PR\mosek>python -c "import scipy; print scipy.__version__"   || exit /b 666 
1.0.1

(venv2_gpkit) (base) D:\jenkins\workspace\gpkit_ResearchModel_solar_PR\mosek>python -c "import numpy; print numpy.__version__"   || exit /b 666 
1.14.3

(venv2_gpkit) (base) D:\jenkins\workspace\gpkit_ResearchModel_solar_PR\mosek>python -c "import pint; print pint.__version__"   || exit /b 666 
0.8.1

(venv2_gpkit) (base) D:\jenkins\workspace\gpkit_ResearchModel_solar_PR\mosek>git --version 
git version 2.16.2.windows.1

(venv2_gpkit) (base) D:\jenkins\workspace\gpkit_ResearchModel_solar_PR\mosek>git clone --depth 1 https://github.com/convexengineering/gpkit.git D:\jenkins\workspace\gpkit_ResearchModel_solar_PR\mosek\gpkit 
Cloning into 'D:\jenkins\workspace\gpkit_ResearchModel_solar_PR\mosek\gpkit'...
Checking out files:  70% (136/193)   
Checking out files:  71% (138/193)   
Checking out files:  72% (139/193)   
Checking out files:  73% (141/193)   
Checking out files:  74% (143/193)   
Checking out files:  75% (145/193)   
Checking out files:  76% (147/193)   
Checking out files:  77% (149/193)   
Checking out files:  78% (151/193)   
Checking out files:  79% (153/193)   
Checking out files:  80% (155/193)   
Checking out files:  81% (157/193)   
Checking out files:  82% (159/193)   
Checking out files:  83% (161/193)   
Checking out files:  84% (163/193)   
Checking out files:  85% (165/193)   
Checking out files:  86% (166/193)   
Checking out files:  87% (168/193)   
Checking out files:  88% (170/193)   
Checking out files:  89% (172/193)   
Checking out files:  90% (174/193)   
Checking out files:  91% (176/193)   
Checking out files:  92% (178/193)   
Checking out files:  93% (180/193)   
Checking out files:  94% (182/193)   
Checking out files:  95% (184/193)   
Checking out files:  96% (186/193)   
Checking out files:  97% (188/193)   
Checking out files:  98% (190/193)   
Checking out files:  99% (192/193)   
Checking out files: 100% (193/193)   
Checking out files: 100% (193/193), done.

(venv2_gpkit) (base) D:\jenkins\workspace\gpkit_ResearchModel_solar_PR\mosek>pip install --no-cache-dir --no-deps -e D:\jenkins\workspace\gpkit_ResearchModel_solar_PR\mosek\gpkit   || exit /b 666 
Obtaining file:///D:/jenkins/workspace/gpkit_ResearchModel_solar_PR/mosek/gpkit
Installing collected packages: gpkit
  Running setup.py develop for gpkit
Successfully installed gpkit

(venv2_gpkit) (base) D:\jenkins\workspace\gpkit_ResearchModel_solar_PR\mosek>python -c "from gpkit.build import rebuild; rebuild()" 
No filename given.
Usage:
     mskexpopt FILENAME [-primal] [-dual] [-p parameterfile]
Return code: 1052
Description: MSK_RES_ERR_FILE_OPEN [An error occurred while opening a file.]
# Moving to the directory from which GPkit was imported.
d:\jenkins\workspace\gpkit_researchmodel_solar_pr\mosek\gpkit\gpkit\build.pyc d:\jenkins\workspace\gpkit_researchmodel_solar_pr\mosek\gpkit\gpkit
#     Found __init__.py
#     Don't want to be in a folder with __init__.py, going up!
Started building gpkit...

Attempting to find and build solvers:

# Looking for mosek
#     Found C:\Program Files\Mosek\7\tools\platform\win64x86\h\mosek.h
#     Found C:\Program Files\Mosek\7\tools\platform\win64x86\bin\mosek64_7_1.dll
#     Found C:\Program Files\Mosek\7\tools\examples\c\scopt-ext.c
#     Found C:\Program Files\Mosek\7\tools\examples\c\expopt.c
#     Found C:\Program Files\Mosek\7\tools\examples\c\dgopt.c
#     Found C:\Program Files\Mosek\7\tools\examples\c\scopt-ext.h
#     Found C:\Program Files\Mosek\7\tools\examples\c\expopt.h
#     Found C:\Program Files\Mosek\7\tools\examples\c\dgopt.h
#     Found C:\Program Files\Mosek\7\tools\platform\win64x86\h\mosek.h
# Found mosek version 7, installed to C:\Program Files\Mosek
#
# Building mosek...
#     Replacing directory gpkit\_mosek\lib
#     Replacing directory D:\jenkins\workspace\gpkit_ResearchModel_solar_PR\mosek\build_gpkit
#     Replacing directory gpkit\_mosek\build
#
#   Copying expopt library files to gpkit\_mosek\build
#f     Copying C:\Program Files\Mosek\7\tools\examples\c\scopt-ext.c
#f     Copying C:\Program Files\Mosek\7\tools\examples\c\expopt.c
#f     Copying C:\Program Files\Mosek\7\tools\examples\c\dgopt.c
#f     Copying C:\Program Files\Mosek\7\tools\examples\c\scopt-ext.h
#f     Copying C:\Program Files\Mosek\7\tools\examples\c\expopt.h
#f     Copying C:\Program Files\Mosek\7\tools\examples\c\dgopt.h
#f     Copying C:\Program Files\Mosek\7\tools\platform\win64x86\h\mosek.h
#
#   Applying expopt patches...
#
#     Change in gpkit\_mosek\build\dgopt.con line 683
#     --           printf("Number of Hessian non-zeros: %d\n",nlh[0]->numhesnz)
#     ++ MSK_echotask(task,MSK_STREAM_MSG,"Number of Hessian non-zeros: %d\n",n
#
#     Change in gpkit\_mosek\build\expopt.con line 569
#     --       printf("Warning: The variable with index '%d' has only positive 
#     ++ MSK_echotask(expopttask,MSK_STREAM_MSG, "Warning: The variable with in
#
#     Change in gpkit\_mosek\build\expopt.con line 582
#     --       printf("Warning: The variable with index '%d' has only negative 
#     ++ MSK_echotask(expopttask,MSK_STREAM_MSG, "Warning: The variable with in
#
#     Change in gpkit\_mosek\build\expopt.con line 1115
#     --     printf ("solsta = %d, prosta = %d\n", (int)*solsta,(int)*prosta);
#     ++ MSK_echotask(expopttask,MSK_STREAM_MSG, "solsta = %d, prosta = %d\n", 
#
#   Building expopt library...
#     Calling 'gcc -fpic -shared -Wl,--export-all-symbols,-R "C:\Program Files\Mosek\7\tools\platform\win64x86\bin"    gpkit\_mosek\build\scopt-ext.c gpkit\_mosek\build\expopt.c gpkit\_mosek\build\dgopt.c   "C:\Program Files\Mosek\7\tools\platform\win64x86\bin\mosek64_7_1.dll" -o D:\jenkins\workspace\gpkit_ResearchModel_solar_PR\mosek\build_gpkit\expopt.so'
##
### CALL BEGINS
### CALL ENDS
##
#
#   Building Python bindings for expopt and Mosek...
#     Calling 'python gpkit/modified_ctypesgen.py -a -l D:/jenkins/workspace/gpkit_ResearchModel_solar_PR/mosek/build_gpkit/expopt.so -l "C:/Program Files/Mosek/7/tools/platform/win64x86/bin/mosek64_7_1.dll" -o gpkit\_mosek\lib\expopt_h.py    gpkit\_mosek\build\expopt.h'
##
### CALL BEGINS
### CALL ENDS
##
# Done building mosek
# Looking for mosek_cli
#   Trying to run mskexpopt...
#     Calling 'mskexpopt'
##
### CALL BEGINS
### CALL ENDS
##
# Found mosek_cli in system path
# Looking for cvxopt
#   Trying to import cvxopt...
# Found cvxopt in Python path
...finished building gpkit.
Replaced found solvers (['mosek', 'mosek_cli', 'cvxopt']) with environment var GPKITSOLVERS (mosek, mosek_cli)

Found the following solvers: mosek, mosek_cli
#     Replacing directory gpkit\env
Replaced the directory gpkit/env


(venv2_gpkit) (base) D:\jenkins\workspace\gpkit_ResearchModel_solar_PR\mosek>type D:\jenkins\workspace\gpkit_ResearchModel_solar_PR\mosek\gpkit\gpkit\env\settings 
installed_solvers : mosek, mosek_cli
mosek_bin_dir : C:\Program Files\Mosek\7\tools\platform\win64x86\bin


(venv2_gpkit) (base) D:\jenkins\workspace\gpkit_ResearchModel_solar_PR\mosek>python -c "import gpkit; print gpkit.__version__"   || exit /b 666 
0.7.0

(venv2_gpkit) (base) D:\jenkins\workspace\gpkit_ResearchModel_solar_PR\mosek>dir D:\jenkins\workspace\gpkit_ResearchModel_solar_PR\mosek\build_gpkit 
 Volume in drive D is Home
 Volume Serial Number is EA39-7CA0

 Directory of D:\jenkins\workspace\gpkit_ResearchModel_solar_PR\mosek\build_gpkit

05/01/2018  11:00 AM    <DIR>          .
05/01/2018  11:00 AM    <DIR>          ..
05/01/2018  11:00 AM           125,642 expopt.so
               1 File(s)        125,642 bytes
               2 Dir(s)   5,733,736,448 bytes free

(venv2_gpkit) (base) D:\jenkins\workspace\gpkit_ResearchModel_solar_PR\mosek>REM Limit number of threads that be can used 

(venv2_gpkit) (base) D:\jenkins\workspace\gpkit_ResearchModel_solar_PR\mosek>set MSK_IPAR_NUM_THREADS=2 

(venv2_gpkit) (base) D:\jenkins\workspace\gpkit_ResearchModel_solar_PR\mosek>set MKL_NUM_THREADS=2 

(venv2_gpkit) (base) D:\jenkins\workspace\gpkit_ResearchModel_solar_PR\mosek>set NUMEXPR_NUM_THREADS=2 

(venv2_gpkit) (base) D:\jenkins\workspace\gpkit_ResearchModel_solar_PR\mosek>set OPENBLAS_NUM_THREADS=2 

(venv2_gpkit) (base) D:\jenkins\workspace\gpkit_ResearchModel_solar_PR\mosek>set OMP_NUM_THREADS=2 

(venv2_gpkit) (base) D:\jenkins\workspace\gpkit_ResearchModel_solar_PR\mosek>python -c "from gpkit.tests.test_repo import test_repo; test_repo(xmloutput=True)"   || exit /b 666 
Cloning into 'gplibrary'...
Checking out files:  88% (118/133)   
Checking out files:  89% (119/133)   
Checking out files:  90% (120/133)   
Checking out files:  91% (122/133)   
Checking out files:  92% (123/133)   
Checking out files:  93% (124/133)   
Checking out files:  94% (126/133)   
Checking out files:  95% (127/133)   
Checking out files:  96% (128/133)   
Checking out files:  97% (130/133)   
Checking out files:  98% (131/133)   
Checking out files:  99% (132/133)   
Checking out files: 100% (133/133)   
Checking out files: 100% (133/133), done.
Obtaining file:///D:/jenkins/workspace/gpkit_ResearchModel_solar_PR/mosek/gplibrary
Installing collected packages: gpkitmodels
  Running setup.py develop for gpkitmodels
Successfully installed gpkitmodels
Requirement already satisfied: pandas in d:\anaconda2\lib\site-packages (0.22.0)
Requirement already satisfied: python-dateutil in d:\anaconda2\lib\site-packages (from pandas) (2.6.1)
Requirement already satisfied: pytz>=2011k in d:\anaconda2\lib\site-packages (from pandas) (2017.3)
Requirement already satisfied: numpy>=1.9.0 in d:\anaconda2\lib\site-packages (from pandas) (1.14.3)
Requirement already satisfied: six>=1.5 in d:\anaconda2\lib\site-packages (from python-dateutil->pandas) (1.11.0)
grin 1.2.1 requires argparse>=1.1, which is not installed.
Collecting git+https://github.com/convexengineering/gpfit.git
  Cloning https://github.com/convexengineering/gpfit.git to c:\users\jenkins\appdata\local\temp\pip-req-build-cgf42q
Requirement already satisfied: numpy in d:\anaconda2\lib\site-packages (from gpfit==0.1) (1.14.3)
Requirement already satisfied: scipy in d:\anaconda2\lib\site-packages (from gpfit==0.1) (1.0.1)
Requirement already satisfied: gpkit in d:\jenkins\workspace\gpkit_researchmodel_solar_pr\mosek\gpkit (from gpfit==0.1) (0.7.0.0)
Requirement already satisfied: pint>=0.7 in d:\anaconda2\lib\site-packages (from gpkit->gpfit==0.1) (0.8.1)
Requirement already satisfied: ad in d:\anaconda2\lib\site-packages (from gpkit->gpfit==0.1) (1.3.2)
Building wheels for collected packages: gpfit
  Running setup.py bdist_wheel for gpfit: started
  Running setup.py bdist_wheel for gpfit: finished with status 'done'
  Stored in directory: c:\users\jenkins\appdata\local\temp\pip-ephem-wheel-cache-xuqy8h\wheels\d5\94\ac\b1f68b07599181f26f4b9149a1a6d49dfc5cdbc65de1a14d12
Successfully built gpfit
grin 1.2.1 requires argparse>=1.1, which is not installed.
Installing collected packages: gpfit
Successfully installed gpfit-0.1
Collecting git+https://github.com/convexengineering/gassolar.git
  Cloning https://github.com/convexengineering/gassolar.git to c:\users\jenkins\appdata\local\temp\pip-req-build-bm5g9m
Requirement already satisfied: numpy in d:\anaconda2\lib\site-packages (from gassolar==0.0.0.0) (1.14.3)
Requirement already satisfied: scipy in d:\anaconda2\lib\site-packages (from gassolar==0.0.0.0) (1.0.1)
Requirement already satisfied: gpkit in d:\jenkins\workspace\gpkit_researchmodel_solar_pr\mosek\gpkit (from gassolar==0.0.0.0) (0.7.0.0)
Requirement already satisfied: pandas in d:\anaconda2\lib\site-packages (from gassolar==0.0.0.0) (0.22.0)
Requirement already satisfied: gpfit in d:\jenkins\workspace\gpkit_researchmodel_solar_pr\mosek\venv2_gpkit\lib\site-packages (from gassolar==0.0.0.0) (0.1)
Requirement already satisfied: pint>=0.7 in d:\anaconda2\lib\site-packages (from gpkit->gassolar==0.0.0.0) (0.8.1)
Requirement already satisfied: ad in d:\anaconda2\lib\site-packages (from gpkit->gassolar==0.0.0.0) (1.3.2)
Requirement already satisfied: python-dateutil in d:\anaconda2\lib\site-packages (from pandas->gassolar==0.0.0.0) (2.6.1)
Requirement already satisfied: pytz>=2011k in d:\anaconda2\lib\site-packages (from pandas->gassolar==0.0.0.0) (2017.3)
Requirement already satisfied: six>=1.5 in d:\anaconda2\lib\site-packages (from python-dateutil->pandas->gassolar==0.0.0.0) (1.11.0)
Building wheels for collected packages: gassolar
  Running setup.py bdist_wheel for gassolar: started
  Running setup.py bdist_wheel for gassolar: still running...
  Running setup.py bdist_wheel for gassolar: finished with status 'done'
  Stored in directory: c:\users\jenkins\appdata\local\temp\pip-ephem-wheel-cache-azma8f\wheels\fe\11\0a\2dde16df75c51194d20248ec9e30e88fc7200e9fc4664b032e
Successfully built gassolar
grin 1.2.1 requires argparse>=1.1, which is not installed.
Installing collected packages: gassolar
Successfully installed gassolar-0.0.0.0
Processing d:\jenkins\workspace\gpkit_researchmodel_solar_pr\mosek
Requirement already satisfied: numpy in d:\anaconda2\lib\site-packages (from solar==0.0.0.0) (1.14.3)
Requirement already satisfied: scipy in d:\anaconda2\lib\site-packages (from solar==0.0.0.0) (1.0.1)
Requirement already satisfied: gpkit in d:\jenkins\workspace\gpkit_researchmodel_solar_pr\mosek\gpkit (from solar==0.0.0.0) (0.7.0.0)
Requirement already satisfied: pandas in d:\anaconda2\lib\site-packages (from solar==0.0.0.0) (0.22.0)
Requirement already satisfied: gpfit in d:\jenkins\workspace\gpkit_researchmodel_solar_pr\mosek\venv2_gpkit\lib\site-packages (from solar==0.0.0.0) (0.1)
Requirement already satisfied: gpkitmodels in d:\jenkins\workspace\gpkit_researchmodel_solar_pr\mosek\gplibrary (from solar==0.0.0.0) (0.0.0.0)
Requirement already satisfied: pint>=0.7 in d:\anaconda2\lib\site-packages (from gpkit->solar==0.0.0.0) (0.8.1)
Requirement already satisfied: ad in d:\anaconda2\lib\site-packages (from gpkit->solar==0.0.0.0) (1.3.2)
Requirement already satisfied: python-dateutil in d:\anaconda2\lib\site-packages (from pandas->solar==0.0.0.0) (2.6.1)
Requirement already satisfied: pytz>=2011k in d:\anaconda2\lib\site-packages (from pandas->solar==0.0.0.0) (2017.3)
Requirement already satisfied: six>=1.5 in d:\anaconda2\lib\site-packages (from python-dateutil->pandas->solar==0.0.0.0) (1.11.0)
Building wheels for collected packages: solar
  Running setup.py bdist_wheel for solar: started
  Running setup.py bdist_wheel for solar: finished with status 'done'
  Stored in directory: c:\users\jenkins\appdata\local\temp\pip-ephem-wheel-cache-8yhtun\wheels\f8\93\c7\7ff39419885098d8b8c872ee233d43ee9fbed6fa8de6d7bfde
Successfully built solar
grin 1.2.1 requires argparse>=1.1, which is not installed.
Installing collected packages: solar
Successfully installed solar-0.0.0.0
adding test for 'solar/sens_chart.py'
adding test for 'solar/season.py'
adding test for 'solar/npod_trade.py'
Beginning signomial solve.
Solving took 9 GP solves and 4.77 seconds.
Warning: Variable [CL_Mission/Climb/AircraftDrag/WingAero_(0,), CL_Mission/Climb/AircraftDrag/WingAero_(1,), CL_Missio could cause inaccurate result because it is below lower bound. Solution is 0.9740 but bound is 0.9465
Warning: Variable [Re_Mission/Climb/AircraftDrag/WingAero_(0,), Re_Mission/Climb/AircraftDrag/WingAero_(1,), Re_Missio could cause inaccurate result because it is above upper bound. Solution is 1359978.9643 but bound is 600000.0000
Warning: Variable [Re_Mission/Climb/AircraftDrag/TailAero.1_(0,), Re_Mission/Climb/AircraftDrag/TailAero.1_(1,), Re_Mi could cause inaccurate result because it is above upper bound. Solution is 1118578.9967 but bound is 1000000.0000
Warning: Variable [Re_Mission/FlightSegment/AircraftPerf/AircraftDrag.1/BladeElementProp/BladeElementPerf_(0,), Re_Mis could cause inaccurate result because it is below lower bound. Solution is 89126.6215 but bound is 50000.0000
Beginning signomial solve.
Beginning signomial solve.
Solving took 9 GP solves and 4.61 seconds.
Warning: Variable [CL_Mission/Climb/AircraftDrag/WingAero_(0,), CL_Mission/Climb/AircraftDrag/WingAero_(1,), CL_Missio could cause inaccurate result because it is below lower bound. Solution is 0.9740 but bound is 0.9465
Warning: Variable [Re_Mission/Climb/AircraftDrag/WingAero_(0,), Re_Mission/Climb/AircraftDrag/WingAero_(1,), Re_Missio could cause inaccurate result because it is above upper bound. Solution is 1359978.9645 but bound is 600000.0000
Warning: Variable [Re_Mission/Climb/AircraftDrag/TailAero.1_(0,), Re_Mission/Climb/AircraftDrag/TailAero.1_(1,), Re_Mi could cause inaccurate result because it is above upper bound. Solution is 1118578.9969 but bound is 1000000.0000
Warning: Variable [Re_Mission/FlightSegment/AircraftPerf/AircraftDrag.1/BladeElementProp/BladeElementPerf_(0,), Re_Mis could cause inaccurate result because it is below lower bound. Solution is 89126.6215 but bound is 50000.0000
Beginning signomial solve.
Using solver 'mosek'
Solving for 14852 variables.
Solving took 5.14 seconds.
Warning: Variable [CL_Mission/Climb/AircraftDrag/WingAero_(0,), CL_Mission/Climb/AircraftDrag/WingAero_(1,), CL_Missio could cause inaccurate result because it is below lower bound. Solution is 1.3227 but bound is 0.9465
Warning: Variable [Re_Mission/Climb/AircraftDrag/WingAero_(0,), Re_Mission/Climb/AircraftDrag/WingAero_(1,), Re_Missio could cause inaccurate result because it is above upper bound. Solution is 671709.7357 but bound is 600000.0000
Using solver 'mosek'
Solving for 14852 variables.
Solving took 4.26 seconds.
Warning: Variable [CL_Mission.1/Climb.1/AircraftDrag.41/WingAero.41_(0,), CL_Mission.1/Climb.1/AircraftDrag.41/WingAer could cause inaccurate result because it is below lower bound. Solution is 1.2812 but bound is 0.9465
Warning: Variable [Re_Mission.1/Climb.1/AircraftDrag.41/WingAero.41_(0,), Re_Mission.1/Climb.1/AircraftDrag.41/WingAer could cause inaccurate result because it is above upper bound. Solution is 729183.6153 but bound is 600000.0000
Using solver 'mosek'
Solving for 14852 variables.
Solving took 4.05 seconds.
Allowing negative dual variable(s) as small as -2.127108981574838e-11.
Warning: Variable [CL_Mission.2/Climb.2/AircraftDrag.82/WingAero.82_(0,), CL_Mission.2/Climb.2/AircraftDrag.82/WingAer could cause inaccurate result because it is below lower bound. Solution is 1.2258 but bound is 0.9465
Warning: Variable [Re_Mission.2/Climb.2/AircraftDrag.82/WingAero.82_(0,), Re_Mission.2/Climb.2/AircraftDrag.82/WingAer could cause inaccurate result because it is above upper bound. Solution is 802959.5990 but bound is 600000.0000
Using solver 'mosek'
Solving for 7672 variables.
Solving took 2.11 seconds.
Warning: Variable [CL_Mission.3/Climb.3/AircraftDrag.123/WingAero.123_(0,), CL_Mission.3/Climb.3/AircraftDrag.123/Wing could cause inaccurate result because it is below lower bound. Solution is 1.2008 but bound is 0.9465
Warning: Variable [Re_Mission.3/Climb.3/AircraftDrag.123/WingAero.123_(0,), Re_Mission.3/Climb.3/AircraftDrag.123/Wing could cause inaccurate result because it is above upper bound. Solution is 839122.5080 but bound is 600000.0000
Using solver 'mosek'
Solving for 14852 variables.
Solving took 4.55 seconds.
Allowing negative dual variable(s) as small as -5.702947968932598e-14.
Warning: Variable [CL_Mission/Climb/AircraftDrag/WingAero_(0,), CL_Mission/Climb/AircraftDrag/WingAero_(1,), CL_Missio could cause inaccurate result because it is below lower bound. Solution is 1.3227 but bound is 0.9465
Warning: Variable [Re_Mission/Climb/AircraftDrag/WingAero_(0,), Re_Mission/Climb/AircraftDrag/WingAero_(1,), Re_Missio could cause inaccurate result because it is above upper bound. Solution is 671709.7361 but bound is 600000.0000
Using solver 'mosek'
Solving for 14852 variables.
Solving took 4.29 seconds.
Warning: Variable [CL_Mission.1/Climb.1/AircraftDrag.41/WingAero.41_(0,), CL_Mission.1/Climb.1/AircraftDrag.41/WingAer could cause inaccurate result because it is below lower bound. Solution is 1.2812 but bound is 0.9465
Warning: Variable [Re_Mission.1/Climb.1/AircraftDrag.41/WingAero.41_(0,), Re_Mission.1/Climb.1/AircraftDrag.41/WingAer could cause inaccurate result because it is above upper bound. Solution is 729183.6530 but bound is 600000.0000
Using solver 'mosek'
Solving for 14852 variables.
Solving took 4.06 seconds.
Warning: Variable [CL_Mission.2/Climb.2/AircraftDrag.82/WingAero.82_(0,), CL_Mission.2/Climb.2/AircraftDrag.82/WingAer could cause inaccurate result because it is below lower bound. Solution is 1.2258 but bound is 0.9465
Warning: Variable [Re_Mission.2/Climb.2/AircraftDrag.82/WingAero.82_(0,), Re_Mission.2/Climb.2/AircraftDrag.82/WingAer could cause inaccurate result because it is above upper bound. Solution is 802959.5991 but bound is 600000.0000
Using solver 'mosek'
Solving for 7672 variables.
Solving took 2.01 seconds.
Warning: Variable [CL_Mission.3/Climb.3/AircraftDrag.123/WingAero.123_(0,), CL_Mission.3/Climb.3/AircraftDrag.123/Wing could cause inaccurate result because it is below lower bound. Solution is 1.2008 but bound is 0.9465
Warning: Variable [Re_Mission.3/Climb.3/AircraftDrag.123/WingAero.123_(0,), Re_Mission.3/Climb.3/AircraftDrag.123/Wing could cause inaccurate result because it is above upper bound. Solution is 839122.5080 but bound is 600000.0000
Beginning signomial solve.
Solving took 9 GP solves and 4.65 seconds.
Warning: Variable [CL_Mission/Climb/AircraftDrag/WingAero_(0,), CL_Mission/Climb/AircraftDrag/WingAero_(1,), CL_Missio could cause inaccurate result because it is below lower bound. Solution is 1.0930 but bound is 0.9465
Warning: Variable [Re_Mission/Climb/AircraftDrag/WingAero_(0,), Re_Mission/Climb/AircraftDrag/WingAero_(1,), Re_Missio could cause inaccurate result because it is above upper bound. Solution is 1365008.3903 but bound is 600000.0000
Warning: Variable [Re_Mission/FlightSegment/AircraftPerf/AircraftDrag.1/BladeElementProp/BladeElementPerf_(0,), Re_Mis could cause inaccurate result because it is below lower bound. Solution is 80513.9534 but bound is 50000.0000
Warning: Constraint [0.151*B_Mission/FlightSegment/AircraftPerf/AircraftDrag.1/BladeElementProp/BladeElementPerf_(0,)**-2... >= 0.00633*B_Mission/FlightSegment/AircraftPerf/AircraftDrag.1/BladeElementProp/BladeElementPerf_(0,)**...] is not tight because the left hand side evaluated to 3.11544275051 meter ** 2 / second ** 2 but the right hand side evaluated to 3.11543947856 meter ** 2 / second ** 2 (Allowable error: 0.0001%, Actual error: 0.00011%)

Warning: Constraint [0.151*B_Mission/FlightSegment/AircraftPerf/AircraftDrag.1/BladeElementProp/BladeElementPerf_(1,)**-2... >= 0.00633*B_Mission/FlightSegment/AircraftPerf/AircraftDrag.1/BladeElementProp/BladeElementPerf_(1,)**...] is not tight because the left hand side evaluated to 2.2760682166 meter ** 2 / second ** 2 but the right hand side evaluated to 2.27606474063 meter ** 2 / second ** 2 (Allowable error: 0.0001%, Actual error: 0.00015%)

Beginning signomial solve.
So
Running tests...
----------------------------------------------------------------------
EED:\jenkins\workspace\gpkit_ResearchModel_solar_PR\mosek\venv2_gpkit\lib\site-packages\gassolar\environment\solar_irradiance.py:40: RuntimeWarning: overflow encountered in exp
  tau = np.exp(-0.175/costhsun)
D:\jenkins\workspace\gpkit_ResearchModel_solar_PR\mosek\venv2_gpkit\lib\site-packages\gassolar\environment\solar_irradiance.py:40: RuntimeWarning: divide by zero encountered in divide
  tau = np.exp(-0.175/costhsun)
....
======================================================================
ERROR [18.037s]: test_solar_npod_trade_py_mosek (gpkit.tests.from_paths.TestFiles)
----------------------------------------------------------------------
Traceback (most recent call last):
  File "d:\jenkins\workspace\gpkit_researchmodel_solar_pr\mosek\gpkit\gpkit\tests\helpers.py", line 62, in test
    testfn(name, import_dict, path)(self)
  File "d:\jenkins\workspace\gpkit_researchmodel_solar_pr\mosek\gpkit\gpkit\tests\from_paths.py", line 50, in <lambda>
    lambda self: getattr(self, name)()))  # pylint:disable=undefined-variable
  File "d:\jenkins\workspace\gpkit_researchmodel_solar_pr\mosek\gpkit\gpkit\tests\from_paths.py", line 39, in test_fn
    mod.test()
  File "npod_trade.py", line 81, in test
  File "npod_trade.py", line 26, in pods
  File "d:\jenkins\workspace\gpkit_researchmodel_solar_pr\mosek\gpkit\gpkit\constraints\prog_factories.py", line 122, in solvefn
    self.program, progsolve = genfunction(self)
  File "d:\jenkins\workspace\gpkit_researchmodel_solar_pr\mosek\gpkit\gpkit\constraints\prog_factories.py", line 79, in programify
    prog = program(self.cost, self, constants, **kwargs)
  File "d:\jenkins\workspace\gpkit_researchmodel_solar_pr\mosek\gpkit\gpkit\constraints\sgp.py", line 64, in __init__
    self._gp = self.init_gp(self.substitutions)
  File "d:\jenkins\workspace\gpkit_researchmodel_solar_pr\mosek\gpkit\gpkit\constraints\sgp.py", line 186, in init_gp
    gp = GeometricProgram(self.cost, [gpconstrs, spapproxs], substitutions)
  File "d:\jenkins\workspace\gpkit_researchmodel_solar_pr\mosek\gpkit\gpkit\constraints\gp.py", line 72, in __init__
    self.posynomials.extend(self.as_posyslt1(self.substitutions))
  File "d:\jenkins\workspace\gpkit_researchmodel_solar_pr\mosek\gpkit\gpkit\constraints\set.py", line 264, in as_posyslt1
    posys = constraint.as_posyslt1(substitutions)
  File "d:\jenkins\workspace\gpkit_researchmodel_solar_pr\mosek\gpkit\gpkit\constraints\set.py", line 264, in as_posyslt1
    posys = constraint.as_posyslt1(substitutions)
  File "d:\jenkins\workspace\gpkit_researchmodel_solar_pr\mosek\gpkit\gpkit\nomials\math.py", line 498, in as_posyslt1
    hmap = self._simplify_posy_ineq(hmap, self.pmap)
  File "d:\jenkins\workspace\gpkit_researchmodel_solar_pr\mosek\gpkit\gpkit\nomials\math.py", line 442, in _simplify_posy_ineq
    " %f%%" % (self, -coeff*100))
ValueError: The constraint rho_FoamHD/Relax >= 1 is infeasible by 2677.777778%

======================================================================
ERROR [15.826s]: test_solar_npod_trade_py_mosek_cli (gpkit.tests.from_paths.TestFiles)
----------------------------------------------------------------------
Traceback (most recent call last):
  File "d:\jenkins\workspace\gpkit_researchmodel_solar_pr\mosek\gpkit\gpkit\tests\helpers.py", line 62, in test
    testfn(name, import_dict, path)(self)
  File "d:\jenkins\workspace\gpkit_researchmodel_solar_pr\mosek\gpkit\gpkit\tests\from_paths.py", line 50, in <lambda>
    lambda self: getattr(self, name)()))  # pylint:disable=undefined-variable
  File "d:\jenkins\workspace\gpkit_researchmodel_solar_pr\mosek\gpkit\gpkit\tests\from_paths.py", line 39, in test_fn
    mod.test()
  File "npod_trade.py", line 81, in test
  File "npod_trade.py", line 26, in pods
  File "d:\jenkins\workspace\gpkit_researchmodel_solar_pr\mosek\gpkit\gpkit\constraints\prog_factories.py", line 122, in solvefn
    self.program, progsolve = genfunction(self)
  File "d:\jenkins\workspace\gpkit_researchmodel_solar_pr\mosek\gpkit\gpkit\conlving took 9 GP solves and 4.72 seconds.
Warning: Variable [CL_Mission/Climb/AircraftDrag/WingAero_(0,), CL_Mission/Climb/AircraftDrag/WingAero_(1,), CL_Missio could cause inaccurate result because it is below lower bound. Solution is 1.0930 but bound is 0.9465
Warning: Variable [Re_Mission/Climb/AircraftDrag/WingAero_(0,), Re_Mission/Climb/AircraftDrag/WingAero_(1,), Re_Missio could cause inaccurate result because it is above upper bound. Solution is 1365008.4107 but bound is 600000.0000
Warning: Variable [Re_Mission/FlightSegment/AircraftPerf/AircraftDrag.1/BladeElementProp/BladeElementPerf_(0,), Re_Mis could cause inaccurate result because it is below lower bound. Solution is 80513.9534 but bound is 50000.0000
Warning: Constraint [0.151*B_Mission/FlightSegment/AircraftPerf/AircraftDrag.1/BladeElementProp/BladeElementPerf_(0,)**-2... >= 0.00633*B_Mission/FlightSegment/AircraftPerf/AircraftDrag.1/BladeElementProp/BladeElementPerf_(0,)**...] is not tight because the left hand side evaluated to 3.11544275109 meter ** 2 / second ** 2 but the right hand side evaluated to 3.11543947914 meter ** 2 / second ** 2 (Allowable error: 0.0001%, Actual error: 0.00011%)

Warning: Constraint [0.151*B_Mission/FlightSegment/AircraftPerf/AircraftDrag.1/BladeElementProp/BladeElementPerf_(1,)**-2... >= 0.00633*B_Mission/FlightSegment/AircraftPerf/AircraftDrag.1/BladeElementProp/BladeElementPerf_(1,)**...] is not tight because the left hand side evaluated to 2.27606821665 meter ** 2 / second ** 2 but the right hand side evaluated to 2.27606474069 meter ** 2 / second ** 2 (Allowable error: 0.0001%, Actual error: 0.00015%)

straints\prog_factories.py", line 79, in programify
    prog = program(self.cost, self, constants, **kwargs)
  File "d:\jenkins\workspace\gpkit_researchmodel_solar_pr\mosek\gpkit\gpkit\constraints\sgp.py", line 64, in __init__
    self._gp = self.init_gp(self.substitutions)
  File "d:\jenkins\workspace\gpkit_researchmodel_solar_pr\mosek\gpkit\gpkit\constraints\sgp.py", line 186, in init_gp
    gp = GeometricProgram(self.cost, [gpconstrs, spapproxs], substitutions)
  File "d:\jenkins\workspace\gpkit_researchmodel_solar_pr\mosek\gpkit\gpkit\constraints\gp.py", line 72, in __init__
    self.posynomials.extend(self.as_posyslt1(self.substitutions))
  File "d:\jenkins\workspace\gpkit_researchmodel_solar_pr\mosek\gpkit\gpkit\constraints\set.py", line 264, in as_posyslt1
    posys = constraint.as_posyslt1(substitutions)
  File "d:\jenkins\workspace\gpkit_researchmodel_solar_pr\mosek\gpkit\gpkit\constraints\set.py", line 264, in as_posyslt1
    posys = constraint.as_posyslt1(substitutions)
  File "d:\jenkins\workspace\gpkit_researchmodel_solar_pr\mosek\gpkit\gpkit\nomials\math.py", line 498, in as_posyslt1
    hmap = self._simplify_posy_ineq(hmap, self.pmap)
  File "d:\jenkins\workspace\gpkit_researchmodel_solar_pr\mosek\gpkit\gpkit\nomials\math.py", line 442, in _simplify_posy_ineq
    " %f%%" % (self, -coeff*100))
ValueError: The constraint rho_FoamHD/Relax >= 1 is infeasible by 2677.777778%

----------------------------------------------------------------------
Ran 6 tests in 338.114s

FAILED (errors=2)

Generating XML reports...

SETTINGS
defaultdict(<type 'str'>, {'skipsolvers': 'cvxopt', 'pip install': 'pandas, git+https://github.com/convexengineering/gpfit.git, git+https://github.com/convexengineering/gassolar.git', 'gpkit-models branch': 'master'})

calling ['git', 'clone', '--depth', '1', '-b', 'master', 'https://github.com/convexengineering/gplibrary.git']
  attempt 1
calling ['pip', 'install', '--no-cache-dir', '--no-deps', '-e', 'gplibrary']
  attempt 1
calling ['pip', 'install', 'pandas']
  attempt 1
calling ['pip', 'install', 'git+https://github.com/convexengineering/gpfit.git']
  attempt 1
calling ['pip', 'install', 'git+https://github.com/convexengineering/gassolar.git']
  attempt 1
calling ['pip', 'install', '.']
  attempt 1

(venv2_gpkit) (base) D:\jenkins\workspace\gpkit_ResearchModel_solar_PR\mosek>REM echo from gpkit.tests.test_repo import test_repo; test_repo(xmloutput=True)> jenkins_test.py || exit /b 666 

(venv2_gpkit) (base) D:\jenkins\workspace\gpkit_ResearchModel_solar_PR\mosek>REM coverage run --append --source=. jenkins_test.py || exit /b 666 

(venv2_gpkit) (base) D:\jenkins\workspace\gpkit_ResearchModel_solar_PR\mosek>REM coverage html -d htmlcov --omit=gpkit/*,gpkit-models/*,venv2_gpkit/*,jenkins_test.py || exit /b 666 

(venv2_gpkit) (base) D:\jenkins\workspace\gpkit_ResearchModel_solar_PR\mosek>exit 0 
Build step 'Console output (build log) parsing' changed build result to FAILURE
[Cobertura] Publishing Cobertura coverage report...

[xUnit] [INFO] - Starting to record.
[xUnit] [INFO] - Processing JUnit
[xUnit] [INFO] - [JUnit] - 1 test report file(s) were found with the pattern '**/test_reports/*.xml' relative to 'D:\jenkins\workspace\gpkit_ResearchModel_solar_PR\mosek' for the testing framework 'JUnit'.
[xUnit] [INFO] - Check 'Failed Tests' threshold.
[xUnit] [INFO] - The total number of tests for this category exceeds the specified 'failure' threshold value.
[xUnit] [INFO] - Setting the build status to FAILURE
[xUnit] [INFO] - Stopping recording.
[WS-CLEANUP] Deleting project workspace...[WS-CLEANUP] done
Finished: FAILURE