Console Output

Skipping 88 KB.. Full Log

Wing Cd percent Diff: [-29.62876698]
Induced Drag Cd Percent Diff: [-33.69791978]




CRUISE SEGMENT 1 TSFC DIFFERENCES


Initial Cruise TSFC Percent Diff: [-5.54348831]




FUSELAGE DIFFERENCES




Weight of HB material: -30.63830046398364 


Weight of VB material: 115.86605373880947 
Fan Propulsive Efficiency in Cruise Segment 1
---------------------
[0.80047655]
Starting a sequence of GP solves
 for 317 free variables
  in 136 locally-GP constraints
  and for 1198 free variables
       in 4699 posynomial inequalities.

GP Solve 1
Using solver 'mosek_cli'
 for 1198 free variables
  in 4699 posynomial inequalities.
Solving took 0.572 seconds.
Solved cost was 3.965e+40.

GP Solve 2
Using solver 'mosek_cli'
 for 1198 free variables
  in 4699 posynomial inequalities.
Solving took 0.407 seconds.
Solved cost was 4.009e+10.

GP Solve 3
Using solver 'mosek_cli'
 for 1198 free variables
  in 4699 posynomial inequalities.
Solving took 0.479 seconds.
Solved cost was 3.198e+05.

GP Solve 4
Using solver 'mosek_cli'
 for 1198 free variables
  in 4699 posynomial inequalities.
Solving took 0.502 seconds.
Solved cost was 2.931e+04.

GP Solve 5
Using solver 'mosek_cli'
 for 1198 free variables
  in 4699 posynomial inequalities.
Solving took 0.423 seconds.
Solved cost was 2.498e+04.

GP Solve 6
Using solver 'mosek_cli'
 for 1198 free variables
  in 4699 posynomial inequalities.
Solving took 0.429 seconds.
Solved cost was 2.381e+04.

GP Solve 7
Using solver 'mosek_cli'
 for 1198 free variables
  in 4699 posynomial inequalities.
Solving took 0.479 seconds.
Solved cost was 2.328e+04.

GP Solve 8
Using solver 'mosek_cli'
 for 1198 free variables
  in 4699 posynomial inequalities.
Solving took 0.538 seconds.
Solved cost was 2.303e+04.

Solving took 4.77 seconds and 8 GP solves.
WEIGHT DIFFERENCES


Total Fuel Weight Percent Diff: [-14.58138901]


Total Aircraft Weight Percent Diff: [-0.74792307]


Engine Weight Percent Diff: -31.67737173064652


Fuselage Weight Percent Diff: 2.6526976812611798


Payload Weight Percent Diff: [-0.04052335]


VT Weight Percent Diff: 36.221546615482346


HT Weight Percent Diff: -97.00046133440463


Wing Weight Percent Diff: 6.301579926786875




WING DIFFERENCES


Wing Span Percent Diff: -4.0375217464993565


Wing Area Percent Diff: 20.48887722348716




HORIZONTAL TAIL DIFFERENCES


HT Area Percent Diff: 31.218905332316265




VERTICAL TAIL DIFFERENCES




VT Span Percent Diff: 0.9751032325104769


VT Area Percent Diff: -48.984006572356954




CRUISE SEGMENT 1 DRAG DIFFERENCES


Overall Cd Percent Diff: [-29.23159982]


L/D Percent Diff: [16.07547092]


Nacelle Cd Percent Diff: [-2.27937869]


HT Cd Percent Diff: [-97.20243433554572] dimensionless


Fuselage Cd Percent Diff: [108.78744865]


VT Cd Percent Diff: [-35.67301084351497] dimensionless


Wing Cd percent Diff: [-29.62869661]
Induced Drag Cd Percent Diff: [-33.69785347]




CRUISE SEGMENT 1 TSFC DIFFERENCES


Initial Cruise TSFC Percent Diff: [-5.54327106]




FUSELAGE DIFFERENCES




Weight of HB material: -30.59479704147676 


Weight of VB material: 115.86756480647438 
Fan Propulsive Efficiency in Cruise Segment 1
---------------------
[0.80047223]
Starting a sequence of GP solves
 for 317 free variables
  in 136 locally-GP constraints
  and for 1198 free variables
       in 4699 posynomial inequalities.

GP Solve 1
Using solver 'mosek_conif'
 for 1198 free variables
  in 4699 posynomial inequalities.
Solving took 0.301 seconds.
Solved cost was 3.965e+40.

GP Solve 2
Using solver 'mosek_conif'
 for 1198 free variables
  in 4699 posynomial inequalities.
Solving took 0.354 seconds.
Solved cost was 2.961e+10.

GP Solve 3
Using solver 'mosek_conif'
 for 1198 free variables
  in 4699 posynomial inequalities.
Solving took 0.37 seconds.
Solved cost was 4.992e+05.

GP Solve 4
Using solver 'mosek_conif'
 for 1198 free variables
  in 4699 posynomial inequalities.
Solving took 0.329 seconds.
Solved cost was 3.083e+04.

GP Solve 5
Using solver 'mosek_conif'
 for 1198 free variables
  in 4699 posynomial inequalities.
Solving took 0.324 seconds.
Solved cost was 2.522e+04.

GP Solve 6
Using solver 'mosek_conif'
 for 1198 free variables
  in 4699 posynomial inequalities.
Solving took 0.334 seconds.
Solved cost was 2.393e+04.

GP Solve 7
Using solver 'mosek_conif'
 for 1198 free variables
  in 4699 posynomial inequalities.
Solving took 0.33 seconds.
Solved cost was 2.335e+04.

GP Solve 8
Using solver 'mosek_conif'
 for 1198 free variables
  in 4699 posynomial inequalities.
Solving took 0.315 seconds.
Solved cost was 2.306e+04.
Solution check warning: Dual cost nan does not match primal cost 23060.282113908033

Solving took 3.46 seconds and 8 GP solves.
WEIGHT DIFFERENCES


Total Fuel Weight Percent Diff: [-14.46199779]


Total Aircraft Weight Percent Diff: [-0.47843846]


Engine Weight Percent Diff: -30.88452146201815


Fuselage Weight Percent Diff: 3.046884841844836


Payload Weight Percent Diff: [-0.04003538]


VT Weight Percent Diff: 37.15207791294599


HT Weight Percent Diff: -96.99293521416652


Wing Weight Percent Diff: 6.454992701148366




WING DIFFERENCES


Wing Span Percent Diff: -4.069694520201649


Wing Area Percent Diff: 20.571190761946696




HORIZONTAL TAIL DIFFERENCES


HT Area Percent Diff: 31.541758211618504




VERTICAL TAIL DIFFERENCES




VT Span Percent Diff: 1.1516880797045497


VT Area Percent Diff: -48.805435878549034




CRUISE SEGMENT 1 DRAG DIFFERENCES


Overall Cd Percent Diff: [-29.22656721]


L/D Percent Diff: [15.98304799]


Nacelle Cd Percent Diff: [-1.32108653]


HT Cd Percent Diff: [-97.1956538727884] dimensionless


Fuselage Cd Percent Diff: [108.78752887]


VT Cd Percent Diff: [-35.4617366962488] dimensionless


Wing Cd percent Diff: [-29.7021956]
/jenkins/workspace/CE_gpkit_PR_research_models/buildnode/reynolds/optimizer/mosek/gpkit/constraints/gp.py:441: RuntimeWarning: divide by zero encountered in log
  b[mi] - np.log(self.nu_by_posy[i]/la[i]))
.Induced Drag Cd Percent Diff: [-33.70534438]




CRUISE SEGMENT 1 TSFC DIFFERENCES


Initial Cruise TSFC Percent Diff: [-5.63182143]




FUSELAGE DIFFERENCES




Weight of HB material: -48.55916888028433 


Weight of VB material: 117.25849282189988 
Fan Propulsive Efficiency in Cruise Segment 1
---------------------
[0.80269331]

----------------------------------------------------------------------
Ran 2 tests in 20.068s

OK

Generating XML reports...
Cloning into 'robust'...
Processing /jenkins/workspace/CE_gpkit_PR_research_models/buildnode/reynolds/optimizer/mosek/robust
  Preparing metadata (setup.py): started
  Preparing metadata (setup.py): finished with status 'done'
Requirement already satisfied: gpkit in /jenkins/workspace/CE_gpkit_PR_research_models/buildnode/reynolds/optimizer/mosek (from robust==0.0.0) (1.1.1)
ERROR: Could not find a version that satisfies the requirement gplibrary (from robust) (from versions: none)
ERROR: No matching distribution found for gplibrary
Processing /jenkins/workspace/CE_gpkit_PR_research_models/buildnode/reynolds/optimizer/mosek/robust
  Preparing metadata (setup.py): started
  Preparing metadata (setup.py): finished with status 'done'
Requirement already satisfied: gpkit in /jenkins/workspace/CE_gpkit_PR_research_models/buildnode/reynolds/optimizer/mosek (from robust==0.0.0) (1.1.1)
ERROR: Could not find a version that satisfies the requirement gplibrary (from robust) (from versions: none)
ERROR: No matching distribution found for gplibrary
Processing /jenkins/workspace/CE_gpkit_PR_research_models/buildnode/reynolds/optimizer/mosek/robust
  Preparing metadata (setup.py): started
  Preparing metadata (setup.py): finished with status 'done'
Requirement already satisfied: gpkit in /jenkins/workspace/CE_gpkit_PR_research_models/buildnode/reynolds/optimizer/mosek (from robust==0.0.0) (1.1.1)
ERROR: Could not find a version that satisfies the requirement gplibrary (from robust) (from versions: none)
ERROR: No matching distribution found for gplibrary
Processing /jenkins/workspace/CE_gpkit_PR_research_models/buildnode/reynolds/optimizer/mosek/robust
  Preparing metadata (setup.py): started
  Preparing metadata (setup.py): finished with status 'done'
Requirement already satisfied: gpkit in /jenkins/workspace/CE_gpkit_PR_research_models/buildnode/reynolds/optimizer/mosek (from robust==0.0.0) (1.1.1)
ERROR: Could not find a version that satisfies the requirement gplibrary (from robust) (from versions: none)
ERROR: No matching distribution found for gplibrary
Processing /jenkins/workspace/CE_gpkit_PR_research_models/buildnode/reynolds/optimizer/mosek/robust
  Preparing metadata (setup.py): started
  Preparing metadata (setup.py): finished with status 'done'
Requirement already satisfied: gpkit in /jenkins/workspace/CE_gpkit_PR_research_models/buildnode/reynolds/optimizer/mosek (from robust==0.0.0) (1.1.1)
ERROR: Could not find a version that satisfies the requirement gplibrary (from robust) (from versions: none)
ERROR: No matching distribution found for gplibrary
adding test for 'run_tests.py'

Running tests...
----------------------------------------------------------------------

Running tests...
----------------------------------------------------------------------
.F...F................FF..FF....F..F....Solution check warning: Dual: sum of nu^T * A did not vanish.
Final PCCP solution let non-GP constraints slacken by 3.9%. Calling .localsolve(pccp_penalty=...) with a higher `pccp_penalty` (it was 200 this time) will reduce slack if the model is solvable with less. To verify that the slack is needed, generate an SGP with `use_pccp=False` and start it from this model's  solution: e.g. `m.localsolve(use_pccp=False, x0=m.solution["variables"])`.
Final PCCP solution let non-GP constraints slacken by 0.053%. Calling .localsolve(pccp_penalty=...) with a higher `pccp_penalty` (it was 200 this time) will reduce slack if the model is solvable with less. To verify that the slack is needed, generate an SGP with `use_pccp=False` and start it from this model's  solution: e.g. `m.localsolve(use_pccp=False, x0=m.solution["variables"])`.
.Final PCCP solution let non-GP constraints slacken by 0.17%. Calling .localsolve(pccp_penalty=...) with a higher `pccp_penalty` (it was 200 this time) will reduce slack if the model is solvable with less. To verify that the slack is needed, generate an SGP with `use_pccp=False` and start it from this model's  solution: e.g. `m.localsolve(use_pccp=False, x0=m.solution["variables"])`.
.
======================================================================
FAIL [0.032s]: test_correlated_monomials (run_tests.TestEquivalentPosynomials_mosek_cli)
----------------------------------------------------------------------
Traceback (most recent call last):
  File "/jenkins/workspace/CE_gpkit_PR_research_models/buildnode/reynolds/optimizer/mosek/robust/robust/testing/t_equivalent_posynomials.py", line 99, in test_correlated_monomials
    self.assertSetEqual(set(actual_posynomials), set(theoretical_posynomials))
AssertionError: Items in the first set but not the second:
gpkit.Posynomial(x_3^0.093·x_13^2.3·x_6^3.2·x_4^3.4·x_10^4.1·x_8^4.7·x_11^4.9/x_14^4.5/x_1^3.8/x_5^3.7/x_7^1.4/x_0^0.67/x_2^0.62/x_9^0.59/x_12^0.38 + x_9^0.41·u_1^0.53·x_1^0.63·x_2^1.4·x_14^1.4·x_8^1.8·x_13^2/x_3^4/x_5^3.8/x_7^3.1/x_6^2.6/x_10^2.5/x_12^2.1/x_4^2/x_11^2/x_0^0.94 + x_10^0.36·x_12^0.53·x_2^0.86·x_8^2.1·x_11^2.4·x_14^3.5·x_7^4.1/x_4^4.6/x_6^4.5/x_3^2.8/x_9^2.5/x_5^2.5/x_1^2.4/x_0^1.4/x_13^0.29 + x_9^0.83·x_1^2·x_4^2.7·x_3^3.9·x_6^4.2·x_12^4.3·x_7^4.4/x_8^5/x_11^4.5/x_13^3.8/x_2^2.9/x_0^1.4/u_2^0.82/x_10^0.76/x_14^0.49/x_5^0.25 + x_13^0.51·x_12^0.51·x_9^1.2·x_1^1.2·x_4^2.3·x_2^3.1·x_3^4.5/x_6^4.9/x_0^4.1/x_11^3.9/x_8^3.2/u_3^2.4/x_7^1.8/x_10^1.1/x_14^0.87/x_5^0.33 + x_9^0.63·x_11^0.73·x_10^0.75·u_3^1.8·x_14^2.4·x_2^2.8·x_4^3·x_3^4.2·x_1^4.2·x_6^4.6/x_0^4.2/x_12^3.7/x_13^2.4/x_8^1.3/x_5^1.2/u_1^1/x_7^0.52 + x_0^0.4·x_8^1.5·x_5^1.8·x_11^2.4·x_10^3.5/x_7^4.3/x_12^4.1/x_6^3.9/x_4^3.8/u_3^3.1/x_9^2.4/x_2^2.1/x_13^1.4/x_14^1.3/x_1^0.31/x_3^0.23 + x_13^0.92·x_0^1.4·x_3^2.7·x_8^3.2/x_14^4.8/x_11^3.2/x_7^3.1/x_12^2.9/x_6^2.5/x_9^2.1/x_1^2/x_10^1.6/x_4^0.98/x_5^0.21/x_2^0.079 + x_7^0.99·x_0^1.6·x_1^2·x_11^3.1·x_2^3.5·x_4^3.8·x_9^4.1·x_6^4.6/x_8^4.1/x_5^3.3/x_12^2.6/x_3^2.3/x_13^1.6/x_10^1.1/x_14^0.42 + u_0^1·x_0^2·x_3^2.1·x_8^2.7·x_10^2.9·x_7^3·x_9^3.1·x_6^4·x_11^4.2·x_2^4.6/x_13^4.8/x_14^3.7/x_4^3.4/x_1^1.2/x_5^0.44/x_12^0.16 + x_4^0.31·x_2^0.36·x_8^0.61·x_14^1.5·x_5^2.1·x_3^4.6·x_0^4.7/x_9^4.8/x_7^4.7/x_11^4.5/x_13^4/x_6^3.5/x_1^0.99/x_12^0.29/x_10^0.27)
Items in the second set but not the first:
gpkit.Posynomial(x_14^0.44·x_8^1.1·x_4^2.3·x_1^2.8·x_10^2.8·u_0^4·x_12^4.3·x_0^4.4/x_9^4.7/x_6^4.5/x_13^3/x_11^2.5/x_7^2.2/x_5^2/x_2^1/x_3^0.7 + x_0^0.3981760310030076·x_1^-0.307044267524315·x_2^-2.0763465616030174·x_3^-0.23280139844900383·x_4^-3.7809260312998205·x_5^1.834017302948804·x_6^-3.937024021496379·x_7^-4.275269692061222·x_8^1.5283805565509825·x_9^-2.4445177830403964·x_10^3.4676071456358297·x_11^2.4069273175212036·x_12^-4.1260777321096604·x_13^-1.3637264459345344·x_14^-1.294169353905498·u_0^0.0·u_1^0.0·u_2^0.0·u_3^-3.108640133742796 + x_0^-0.10947559103222648·x_1^-2.929039072547103·x_2^-2.098439023620391·x_3^4.837225840874705·x_4^-1.3577785760269148·x_5^1.1101659718146735·x_6^2.889832094428809·x_7^4.868125004328249·x_8^-1.5634819102178952·x_9^4.453783651826251·x_10^-0.7487294213647431·x_11^-1.23785905796433·x_12^-1.3269478103481025·x_13^4.298535545188635·x_14^4.582633425518093·u_0^0.0·u_1^-1.2292312038096802·u_2^0.0·u_3^0.0 + x_0^-4.194174962793193·x_1^4.239244103867719·x_2^2.769700491865727·x_3^4.1781461534245015·x_4^3.001406852341953·x_5^-1.19497297068474·x_6^4.6411566339663715·x_7^-0.5206204410667361·x_8^-1.2501457713482358·x_9^0.6288612251487375·x_10^0.7523679852653808·x_11^0.7324511870342008·x_12^-3.6979126147633123·x_13^-2.3868489312419006·x_14^2.3996425193782747·u_0^0.0·u_1^-1.0202770017592049·u_2^0.0·u_3^1.7633326440683983 + x_0^3.1134826951367387·x_1^1.39995279307327·x_2^-2.049398349064048·x_3^2.481502304712259·x_4^-1.2039041203208676·x_5^-3.4580562838551687·x_6^-4.536834274290137·x_7^1.2687603753211825·x_8^-3.9449623569678947·x_9^1.6616165562890242·x_10^2.4278416441921635·x_11^-4.4355976634772185·x_12^4.567238973999432·x_13^3.358481865191864·x_14^0.9827548895157578·u_0^0.0·u_1^0.0·u_2^0.0·u_3^-2.8669825543070067 + x_0^-4.050195611445988·x_1^1.2432656580895882·x_2^3.1196103065499177·x_3^4.542293801676658·x_4^2.314282418751991·x_5^-0.33400951092187725·x_6^-4.935239659574682·x_7^-1.7598182023279962·x_8^-3.2394577215217413·x_9^1.1942534676571608·x_10^-1.0969957234735594·x_11^-3.908701509233683·x_12^0.5147978947354837·x_13^0.5129877456564591·x_14^-0.8710466109761654·u_0^0.0·u_1^0.0·u_2^0.0·u_3^-2.4429842114991436 + x_0^3.2357513363326404·x_1^-3.2409453793464182·x_2^4.165137817312045·x_3^4.58798349754429·x_4^-0.08319263093960849·x_5^-1.1132350999056815·x_6^0.478169727141605·x_7^-0.8091216219151187·x_8^-3.4834989299825403·x_9^1.0828601013035·x_10^3.7723600204202583·x_11^-3.6463663032651117·x_12^3.59199965465268·x_13^-1.6574469411286752·x_14^3.3703289804703953·u_0^-1.7629380236026733·u_1^0.0·u_2^0.0·u_3^0.0 + x_0^2.0401818319745644·x_1^-1.2447090637371918·x_2^4.619089451714473·x_3^2.050784009166593·x_4^-3.4090055197563442·x_5^-0.4385607166129857·x_6^3.966920686359071·x_7^3.016800039791617·x_8^2.652198301748669·x_9^3.1317846605392923·x_10^2.884356290558885·x_11^4.187895143826921·x_12^-0.15926187071885867·x_13^-4.841771062487814·x_14^-3.6667395402674363·u_0^1.002026325431868·u_1^0.0·u_2^0.0·u_3^0.0 + x_0^-2.642752611229465·x_1^2.6197083357335895·x_2^4.927764772690296·x_3^-4.565166455902131·x_4^3.5760718695598435·x_5^-4.958449778476584·x_6^0.05727454239092644·x_7^1.433199553957353·x_8^-1.993048411179279·x_9^1.8306884804981927·x_10^2.98223121302033·x_11^-4.480360536139866·x_12^2.867946239924816·x_13^-2.206978235621695·x_14^1.2055419050971832·u_0^0.0·u_1^-4.760508815566944·u_2^0.0·u_3^0.0 + x_0^-0.9397043428108596·x_1^0.6334371442593749·x_2^1.3540672460858802·x_3^-3.9714279859135337·x_4^-2.0287569021748997·x_5^-3.8346823675677246·x_6^-2.5619422950288797·x_7^-3.091187051661098·x_8^1.848683046125668·x_9^0.40820154145335596·x_10^-2.456327271667936·x_11^-1.9876617037385569·x_12^-2.145585837940164·x_13^2.0014610359307516·x_14^1.369309307180485·u_0^0.0·u_1^0.5289374086843146·u_2^0.0·u_3^0.0 + x_0^3.4558576316914795·x_1^-2.9736029886693616·x_2^4.378603222318864·x_3^-0.8135766252411383·x_4^-0.24844908369770202·x_5^-1.3193052195281672·x_6^-0.4877354513597396·x_7^4.623644360882903·x_8^-0.6349453475646882·x_9^-4.83259950386481·x_10^-3.6285804369212507·x_11^4.8823131257417725·x_12^-0.378049568000689·x_13^-0.92508255844837·x_14^-2.436994019435029·u_0^-4.17413597954781·u_1^-3.756683412325739·u_2^0.0·u_3^0.0)

======================================================================
FAIL [0.011s]: test_correlated_monomials (run_tests.TestEquivalentPosynomials_mosek_conif)
----------------------------------------------------------------------
Traceback (most recent call last):
  File "/jenkins/workspace/CE_gpkit_PR_research_models/buildnode/reynolds/optimizer/mosek/robust/robust/testing/t_equivalent_posynomials.py", line 116, in test_correlated_monomials
    self.assertSetEqual(set(actual_posynomials), set(theoretical_posynomials))
AssertionError: Items in the first set but not the second:
gpkit.Posynomial(x_8^0.31·x_9^2.5·x_2^2.6·x_4^3.4·x_3^3.6·x_6^4.2/x_0^3.2/x_7^1.8/x_1^1.3/x_5^0.6 + x_2^0.049·x_3^0.24·x_0^0.91·x_5^1.3·x_9^1.9·x_1^4.1·x_8^4.1·x_6^4.8/x_4^4.6/x_7^2 + u_1^0.97·x_0^1.3·u_0^2.6·x_9^3.2·x_3^3.3/x_4^5/x_6^4.8/x_8^3.3/x_2^3.2/x_1^3.1/x_7^2.1/x_5^0.85 + u_0^0.18·x_5^1.1·x_8^1.3·x_7^1.4·x_0^4.5/x_9^4.9/x_2^4.1/x_1^3.8/x_6^1.6/x_3^1.6/x_4^0.39)
Items in the second set but not the first:
gpkit.Posynomial(x_5^0.72·x_9^0.88·x_8^1·x_6^2.2·u_1^2.5·x_2^3.3·x_7^4/x_4^4/x_0^3.2/x_1^1.5/x_3^0.38 + x_0^4.546697027675023·x_1^-3.7642833604854076·x_2^-4.140426908128905·x_3^-1.6240726681230964·x_4^-0.38751415122208854·x_5^1.0875489761508668·x_6^-1.6282918065460485·x_7^1.3595960209511713·x_8^1.2874343691359824·x_9^-4.903530621955662·u_0^0.18293215944904462·u_1^0.0 + x_0^2.844468142468007·x_1^3.9307331939886243·x_2^4.905564362113509·x_3^1.9666442297533884·x_4^2.9166336857856763·x_5^-1.8325410033370182·x_6^-3.56785550620095·x_7^2.661392087297976·x_8^2.2683978984630118·x_9^4.907927720340689·u_0^0.0·u_1^1.757181709337624 + x_0^1.263703259113523·x_1^-3.1354353525277·x_2^-3.2408042604533573·x_3^3.2798590838830517·x_4^-4.992973407247376·x_5^-0.8506082030882824·x_6^-4.812293913963971·x_7^-2.06819666439934·x_8^-3.2936043678502793·x_9^3.188288108591067·u_0^2.622099480232718·u_1^0.9739762827522752)

======================================================================
FAIL [0.838s]: test_conservativeness (run_tests.TestPrimitives_mosek_cli)
Testing conservativeness of solution methods
----------------------------------------------------------------------
Traceback (most recent call last):
  File "/jenkins/workspace/CE_gpkit_PR_research_models/buildnode/reynolds/optimizer/mosek/robust/robust/testing/t_primitives.py", line 66, in test_conservativeness
    self.assertTrue(sm['cost'] <= sem['cost'] <= smm['cost'] <= sbm['cost'])
AssertionError: False is not true

======================================================================
FAIL [0.217s]: test_methods (run_tests.TestPrimitives_mosek_cli)
----------------------------------------------------------------------
Traceback (most recent call last):
  File "/jenkins/workspace/CE_gpkit_PR_research_models/buildnode/reynolds/optimizer/mosek/robust/robust/testing/t_primitives.py", line 117, in test_methods
    self.assertAlmostEqual(sol(vk), prev_sol(vk), places=5)
AssertionError: <Quantity(0.636130467, 'dimensionless')> != <Quantity(0.631384596, 'dimensionless')> within 5 places (<Quantity(0.0047458711, 'dimensionless')> difference)

======================================================================
FAIL [1.123s]: test_conservativeness (run_tests.TestPrimitives_mosek_conif)
Testing conservativeness of solution methods
----------------------------------------------------------------------
Traceback (most recent call last):
  File "/jenkins/workspace/CE_gpkit_PR_research_models/buildnode/reynolds/optimizer/mosek/robust/robust/testing/t_primitives.py", line 66, in test_conservativeness
    self.assertTrue(sm['cost'] <= sem['cost'] <= smm['cost'] <= sbm['cost'])
AssertionError: False is not true

======================================================================
FAIL [0.207s]: test_methods (run_tests.TestPrimitives_mosek_conif)
----------------------------------------------------------------------
Traceback (most recent call last):
  File "/jenkins/workspace/CE_gpkit_PR_research_models/buildnode/reynolds/optimizer/mosek/robust/robust/testing/t_primitives.py", line 117, in test_methods
    self.assertAlmostEqual(sol(vk), prev_sol(vk), places=5)
AssertionError: <Quantity(0.636130467, 'dimensionless')> != <Quantity(0.631384596, 'dimensionless')> within 5 places (<Quantity(0.0047458711, 'dimensionless')> difference)

======================================================================
FAIL [0.218s]: test_bad_relations (run_tests.TestTwoTermApproximation_mosek_cli)
----------------------------------------------------------------------
Traceback (most recent call last):
  File "/jenkins/workspace/CE_gpkit_PR_research_models/buildnode/reynolds/optimizer/mosek/robust/robust/testing/t_two_term_approximation.py", line 202, in test_bad_relations
    self.assertEqual(actual_relations_mons, relations_mons)
AssertionError: {gpkit.Monomial(4.86·u_16^0.31·u_26^0.57·u_13^0.89·x_1^0.9·[38979 chars]: 9}} != {gpkit.Monomial(4.92·x_0^2.7354036956301844·x_1^2.237339425[104701 chars] 10}}
Diff is 258994 characters long. Set self.maxDiff to None to see it.

======================================================================
FAIL [0.281s]: test_bad_relations (run_tests.TestTwoTermApproximation_mosek_conif)
----------------------------------------------------------------------
Traceback (most recent call last):
  File "/jenkins/workspace/CE_gpkit_PR_research_models/buildnode/reynolds/optimizer/mosek/robust/robust/testing/t_two_term_approximation.py", line 202, in test_bad_relations
    self.assertEqual(actual_relations_mons, relations_mons)
AssertionError: {gpkit.Monomial(0.208·u_22^0.31·u_6^0.8·x_4^0.96·u_36^1.2[46715 chars]: 5}} != {gpkit.Monomial(4.95·x_0^3.7891366520601615·x_1^1.7038763[132525 chars]: 2}}
Diff is 321342 characters long. Set self.maxDiff to None to see it.

----------------------------------------------------------------------
Ran 42 tests in 67.170s

FAILED (failures=8)

Generating XML reports...
.
Running tests...
----------------------------------------------------------------------
.F...F................FF..FF....F..F.....Final PCCP solution let non-GP constraints slacken by 0.0094%. Calling .localsolve(pccp_penalty=...) with a higher `pccp_penalty` (it was 200 this time) will reduce slack if the model is solvable with less. To verify that the slack is needed, generate an SGP with `use_pccp=False` and start it from this model's  solution: e.g. `m.localsolve(use_pccp=False, x0=m.solution["variables"])`.
Final PCCP solution let non-GP constraints slacken by 0.048%. Calling .localsolve(pccp_penalty=...) with a higher `pccp_penalty` (it was 200 this time) will reduce slack if the model is solvable with less. To verify that the slack is needed, generate an SGP with `use_pccp=False` and start it from this model's  solution: e.g. `m.localsolve(use_pccp=False, x0=m.solution["variables"])`.
Final PCCP solution let non-GP constraints slacken by 0.027%. Calling .localsolve(pccp_penalty=...) with a higher `pccp_penalty` (it was 200 this time) will reduce slack if the model is solvable with less. To verify that the slack is needed, generate an SGP with `use_pccp=False` and start it from this model's  solution: e.g. `m.localsolve(use_pccp=False, x0=m.solution["variables"])`.
.
======================================================================
FAIL [0.068s]: test_correlated_monomials (run_tests.TestEquivalentPosynomials_mosek_cli)
----------------------------------------------------------------------
Traceback (most recent call last):
  File "/jenkins/workspace/CE_gpkit_PR_research_models/buildnode/reynolds/optimizer/mosek/robust/robust/testing/t_equivalent_posynomials.py", line 99, in test_correlated_monomials
    self.assertSetEqual(set(actual_posynomials), set(theoretical_posynomials))
AssertionError: Items in the first set but not the second:
gpkit.Posynomial(x_1^0.1·x_14^0.47·x_16^2.2·x_3^2.3·x_4^2.7·x_9^2.9·x_6^3.3·x_11^3.5·x_2^3.6·x_7^4.7·x_10^4.8/u_1^4.5/x_12^3.3/x_5^2.9/x_13^1.6/x_8^1.6/x_15^0.029/x_0^0.025 + x_2^0.7·x_8^1.9·x_10^3.2·x_16^3.2·x_9^4.2/x_4^4.9/x_5^4.7/x_13^3.7/x_6^3.2/x_1^2.6/x_15^2.4/x_7^2.4/x_3^2.2/x_12^1.4/x_14^0.31/x_11^0.26/x_0^0.21 + x_4^1.7·x_6^2·x_8^2.6·x_13^2.7·x_3^4.6·x_10^4.7/x_16^4.9/x_14^4.6/x_7^4.4/x_2^2.7/x_5^2.4/x_15^1.6/x_12^1.4/x_1^0.75/x_11^0.41/x_0^0.4/x_9^0.15/u_1^0.14 + x_9^0.99·x_14^1.5·x_3^1.5·x_10^1.9·x_13^1.9·x_5^2.2·x_1^3.3·x_12^3.4·x_11^3.4·x_7^3.5·x_8^4.2/x_16^3.3/u_1^3.1/x_15^2.8/x_4^2.5/x_6^2.1/x_2^0.87/x_0^0.55 + x_13^0.28·x_9^1.5·x_14^2.2·x_5^3.1·x_7^4.5·x_10^4.7/x_3^4.8/x_16^4.7/x_11^4.2/x_15^4.1/x_6^3/x_8^2.7/x_1^2.2/x_4^1.2/x_2^1.1/x_12^0.6/x_0^0.57/u_1^0.25 + x_13^0.33·x_1^1.1·x_11^1.6·x_4^1.7·x_7^1.9·x_10^2.5·x_16^2.6·x_12^3.7/x_9^4.9/x_5^4.7/x_14^4.6/x_3^4.6/x_8^2.7/x_15^1.6/x_0^0.96/x_2^0.64/x_6^0.19 + x_9^0.51·x_12^0.54·x_15^1·u_0^1.4·x_8^1.7·x_3^1.8·x_11^2.9·x_16^3.9·x_13^4·x_10^4.2/x_14^4.5/x_2^1.9/x_1^1.5/x_5^1.5/x_7^1.4/x_0^1.3/x_6^0.55/x_4^0.038 + x_11^0.12·x_10^0.32·x_7^0.44·x_16^2.2·x_4^2.3·x_12^2.3·x_5^3.3·x_1^3.3·x_15^3.5·x_13^3.6·x_8^4.1/x_6^3.8/x_9^2.2/x_3^1.9/x_0^1.5/x_2^1.4/x_14^0.28 + x_11^0.2·x_6^0.71·x_1^2.4·x_13^2.8·x_15^3.6·x_7^3.8·x_14^4.1/x_5^4.5/x_12^4.4/x_0^4.2/x_3^3.6/x_2^2.7/x_4^2.4/x_10^1.9/x_9^1.5/x_8^1.4/x_16^1.1 + x_5^0.5·x_13^1.9·x_7^2.9·x_2^4.2·x_8^4.6·x_9^5/x_0^4.7/x_1^4.7/x_12^4.6/x_15^4/x_11^3.7/x_16^3.5/x_10^3.3/x_6^2.2/x_3^1.3/x_14^1.2/x_4^0.9 + x_2^0.6·x_7^0.79·x_9^1.1·x_15^2·x_16^2.8·x_10^3.3·x_14^3.9/x_0^4.9/x_8^4.8/u_0^4.4/x_5^4.4/x_3^3.5/u_1^3.5/x_13^3.2/x_12^3.2/x_4^2.2/x_11^1.1/x_1^0.35/x_6^0.02 + x_13^0.1·x_3^2·x_10^2.2·x_5^3.2·x_8^3.3·x_14^4.2·x_6^4.6·x_4^4.7/x_0^5/x_12^4.8/x_9^4.4/x_15^4.1/x_2^3.9/x_7^3.7/x_16^3.2/x_11^1.2/x_1^0.6 + x_6^0.25·x_10^0.43·x_0^0.51·x_5^1·x_11^2·x_7^4.9·x_8^4.9/x_4^4.9/x_16^4.2/x_1^3.2/x_14^3.1/x_13^3.1/x_9^3/x_12^2.6/x_2^2/x_3^1.2/x_15^0.51 + x_0^1.2·x_2^1.6·x_6^2.3·x_7^2.8·x_16^3.5·x_15^4.6·x_3^4.7·x_5^4.7·x_13^4.8·x_14^4.9·x_8^5/x_9^4.7/x_10^4.4/x_1^2.8/x_4^2.7/x_11^2.7/u_0^1.6/x_12^0.54 + x_7^0.62·x_8^1.3·x_0^1.5·x_15^2·x_11^2.7·x_16^2.8·x_4^3.2·x_13^4.3/x_3^3.1/x_14^2.9/x_12^2.5/x_10^2.3/x_2^1.5/x_6^1.5/x_1^0.99/x_9^0.31/x_5^0.12 + x_4^0.5·x_15^1.1·x_7^1.1·u_1^1.2·x_0^1.5·x_12^1.8·x_5^1.9·x_3^2.3·x_14^3.4/x_8^4.8/x_13^4.8/x_9^3.8/x_6^3.3/x_16^2.1/x_1^1.9/x_2^1/x_11^0.79/x_10^0.59 + x_14^0.63·u_0^0.91·x_4^0.97·x_0^1.7·x_6^1.7·x_8^1.8·x_1^2.7·x_9^4.1/x_13^4.6/x_7^3.9/x_16^3.9/x_2^3.5/x_11^3.1/x_3^2.1/x_5^0.51/x_12^0.43/x_15^0.21/x_10^0.16 + x_1^2.2·x_7^2.6·x_0^2.9·u_1^3.5·x_16^3.6·x_11^3.7·x_12^4.4·x_14^4.7/x_5^4.9/x_10^4.2/x_6^3.9/x_8^3.6/x_2^3.2/x_9^2.9/x_3^2.7/x_15^2.3/x_4^2.3/x_13^1.9 + x_7^0.13·x_15^0.26·x_12^0.93·x_5^1.1·x_2^1.2·x_13^2·x_3^2.2·x_8^2.3·x_0^3.5·x_1^3.5·x_10^3.8/x_9^4.7/x_4^4.5/x_6^4/x_11^4/x_14^4/x_16^0.98 + x_9^0.029·x_12^0.76·x_3^0.84·x_4^1.8·x_13^2·u_0^2·x_6^2.4·x_16^2.6·x_15^3.3·x_0^3.5·x_1^4.2·x_14^4.6/x_11^4.7/x_7^4/x_5^2.5/x_2^1.4/x_8^0.7/x_10^0.25 + x_15^0.6·x_14^0.89·x_7^2.2·x_11^2.7·x_12^2.7·x_0^3.7·x_5^4.1·x_3^4.6·x_2^4.6/x_6^4.3/x_1^3/x_16^2.6/x_10^2.3/x_4^1.7/x_13^1.6/x_8^1.6/x_9^1.4/u_1^0.3 + x_10^0.84·x_14^1.2·x_5^2.7·x_11^2.7·x_0^3.7·u_0^3.8·x_6^4.1·x_2^4.3·x_13^4.5·x_9^4.8·x_7^4.9·x_12^4.9/x_15^4.7/x_4^4.7/x_1^4.7/x_3^1.8/x_8^1.2/x_16^0.57 + x_9^0.71·x_2^1.4·x_14^2.6·x_5^3·x_0^3.8·x_1^4.2·x_13^4.4·x_10^4.8/x_3^5/x_4^4.1/x_8^3.3/x_7^3.1/x_12^2.5/x_16^1.8/x_11^1.7/x_15^0.49/x_6^0.0058 + x_7^0.011·x_12^0.051·x_16^1·x_2^1.1·x_13^2.1·x_4^3.5·x_9^3.7·x_0^4.9/x_10^4.8/x_11^4.3/x_1^3.7/x_5^2.8/u_1^2.4/x_3^2.3/x_15^1.2/x_8^0.85/x_6^0.61/x_14^0.55)
Items in the second set but not the first:
gpkit.Posynomial(x_9^0.029·x_12^0.76·x_3^0.84·x_4^1.8·x_13^2·u_0^2·x_6^2.4·x_16^2.6·x_15^3.3·x_0^3.5·x_1^4.2·x_14^4.6/x_11^4.7/x_7^4/x_5^2.5/x_2^1.4/x_8^0.7/x_10^0.25 + x_0^4.909374040553626·x_1^-0.8852960796806162·x_2^-2.071807089390678·x_3^1.7836444104975513·x_4^4.700204548253467·x_5^-4.386284754689292·x_6^4.238113273024505·x_7^1.373134279900123·x_8^4.13606141979567·x_9^3.967258404869767·x_10^1.6879414873586587·x_11^-2.4606262481084507·x_12^-3.335816194609522·x_13^0.6757480924465353·x_14^-1.8144533194347465·x_15^-3.0368477205901536·x_16^-4.7648131951240105·u_0^-1.1833227680199725·u_1^0.0 + x_0^-3.6490006320961452·x_1^3.9466460494306492·x_2^-2.7145216345873546·x_3^-0.2952042089365161·x_4^4.728513458429081·x_5^3.0090603876889723·x_6^-2.5073179912865307·x_7^-1.6915158457117863·x_8^2.3807545037513043·x_9^-3.8740571518241342·x_10^-0.2514998901531831·x_11^-2.4062689651217273·x_12^4.215980761748607·x_13^1.2695538625667124·x_14^4.2415829570917865·x_15^3.565597874960634·x_16^-2.402952284560439·u_0^0.0·u_1^1.0565891876778695 + x_0^-0.46310145016386706·x_1^-3.1425592591653997·x_2^-2.9399771001579467·x_3^-1.7289199233679895·x_4^-2.6054979154632685·x_5^3.693740958843403·x_6^0.09860674737668695·x_7^0.8153967500197723·x_8^0.38751029859956887·x_9^-2.996362412455398·x_10^-0.7309301702586923·x_11^4.683739431599621·x_12^3.5463758032382415·x_13^0.30832476574251544·x_14^-0.3642819823156511·x_15^-1.4339937195005903·x_16^-2.2029468155889234·u_0^0.0·u_1^-3.1244665325744063 + x_0^-1.3196703084641994·x_1^-1.5249180115565242·x_2^-1.9020391504185796·x_3^1.772233291509293·x_4^-0.03827863987988245·x_5^-1.4818858898140688·x_6^-0.5477324626107105·x_7^-1.384126232190137·x_8^1.7371759578109858·x_9^0.5134559872629474·x_10^4.164886381155119·x_11^2.9044930415491876·x_12^0.5376856816563791·x_13^4.025544886004122·x_14^-4.5093265434331204·x_15^1.0492489775342282·x_16^3.884771429500942·u_0^1.3525646456225493·u_1^0.0 + x_0^2.931569515843652·x_1^2.2383665300692934·x_2^-3.18505832460787·x_3^-2.7139483800513933·x_4^-2.2577207496663765·x_5^-4.850804466478326·x_6^-3.861024753889455·x_7^2.5902164022006877·x_8^-3.603219584201094·x_9^-2.8608768301685727·x_10^-4.212979947419251·x_11^3.674723878277115·x_12^4.435032101076221·x_13^-1.8906439705833544·x_14^4.7252482104598315·x_15^-2.311990055332193·x_16^3.5518703500663857·u_0^0.0·u_1^3.478975189179088 + x_0^-0.5682447025443871·x_1^-2.1690008455132883·x_2^-1.0648860722044242·x_3^-4.768177101302592·x_4^-1.2367345698949328·x_5^3.073786177417057·x_6^-2.9606974496018923·x_7^4.460401534537841·x_8^-2.682208768693494·x_9^1.475460714329163·x_10^4.749678522957826·x_11^-4.189941209369367·x_12^-0.5971677932374284·x_13^0.2763120215854027·x_14^2.213887879867076·x_15^-4.096869113054332·x_16^-4.745157586342334·u_0^0.0·u_1^-0.25053159609459585 + x_0^-0.40181019153421715·x_1^-0.7452443522738754·x_2^-2.650590454907653·x_3^4.638619240336498·x_4^1.7300390474727498·x_5^-2.3871587930123708·x_6^1.9581707034369025·x_7^-4.392343044663206·x_8^2.6189764425481465·x_9^-0.15441453953994966·x_10^4.735728044039538·x_11^-0.4125892336765533·x_12^-1.397899209742107·x_13^2.6553533435531023·x_14^-4.571164180145296·x_15^-1.613842828958175·x_16^-4.911236190672738·u_0^0.0·u_1^-0.1397435735008462 + x_0^-1.6848917722501189·x_1^-1.2531142669017825·x_2^-2.887250960689544·x_3^2.5207735508414846·x_4^4.384121539193464·x_5^-1.2856517746251561·x_6^0.4789931699783567·x_7^4.499253849118512·x_8^0.7298357732111258·x_9^-0.13142711278087305·x_10^-2.295642664244469·x_11^1.2859810097581272·x_12^1.2574879457112944·x_13^-0.32246655499648647·x_14^4.525155571503133·x_15^-2.6515952239193306·x_16^2.336236603815177·u_0^-2.453209155874445·u_1^0.0 + x_0^-0.5466153938750224·x_1^3.272822188104545·x_2^-0.8729753380458236·x_3^1.542439411921702·x_4^-2.450887160373033·x_5^2.1914870962740505·x_6^-2.081531065274096·x_7^3.4635104286942973·x_8^4.17714979396515·x_9^0.9929241220244043·x_10^1.855239186089542·x_11^3.4434021792837655·x_12^3.4258037693767136·x_13^1.9329726067081108·x_14^1.4643651101505375·x_15^-2.7809461639802113·x_16^-3.321035113702502·u_0^0.0·u_1^-3.0785763437421028 + x_0^-0.6008717097615186·x_1^-4.703675650843352·x_2^-0.38051556198177394·x_3^-3.6186005674636768·x_4^3.9449940170359294·x_5^4.667819686308253·x_6^2.651407882252369·x_7^-2.4301351977528296·x_8^-2.2804057898434973·x_9^1.2104706060799462·x_10^-1.5879322268020712·x_11^-1.5923846269661537·x_12^-3.1361787480698657·x_13^4.5503196124513·x_14^-0.016650016715899163·x_15^3.3907175890526897·x_16^3.602485561031564·u_0^-1.9901360542565838·u_1^0.0 + x_0^-3.8070119897894807·x_1^-4.868472865289284·x_2^-2.4946698213637433·x_3^0.5498333789523002·x_4^2.873307466472524·x_5^0.17286167551660103·x_6^-3.9851418276306005·x_7^1.9578309950037838·x_8^0.014900011421148385·x_9^-0.6235966435247473·x_10^-4.386495664208741·x_11^2.4132251871365593·x_12^-4.661653379667494·x_13^-1.5084670563194402·x_14^-3.762772331450103·x_15^1.9413622397518004·x_16^4.464524263121991·u_0^3.4816572947163427·u_1^0.0 + x_0^1.650474088593862·x_1^2.6611481683740497·x_2^-3.465099073714052·x_3^-2.093519509816711·x_4^0.9717801575518585·x_5^-0.5117571322462888·x_6^1.72381304539525·x_7^-3.9412657079654667·x_8^1.8252296932677083·x_9^4.090048079640475·x_10^-0.1646564644229498·x_11^-3.100820425255656·x_12^-0.43094593403495374·x_13^-4.571134399442829·x_14^0.6291650769890538·x_15^-0.2146820959902378·x_16^-3.88960515352873·u_0^0.9128281347614109·u_1^0.0 + x_0^-4.891737549943251·x_1^-0.35218545029689263·x_2^0.5991169569875607·x_3^-3.531609361679857·x_4^-2.2396033210104758·x_5^-4.402809656585419·x_6^-0.01970216353262444·x_7^0.788959627618917·x_8^-4.843953301835832·x_9^1.0515020794469265·x_10^3.348550431323204·x_11^-1.1206111468515187·x_12^-3.1606025200324437·x_13^-3.2006387809962487·x_14^3.865583626488414·x_15^1.9532085273598012·x_16^2.7712906131540365·u_0^-4.405266802179673·u_1^-3.5294495540506956 + x_0^3.696361464506552·x_1^-3.038251727600465·x_2^4.573989604319102·x_3^4.567682602067023·x_4^-1.679365577031521·x_5^4.073539776744973·x_6^-4.341252891836937·x_7^2.188143539618058·x_8^-1.5723273829470754·x_9^-1.3615524160309187·x_10^-2.315519559185464·x_11^2.6926643863350765·x_12^2.7079955592625335·x_13^-1.643330435738879·x_14^0.8908669564052651·x_15^0.5965776376259591·x_16^-2.628221664259469·u_0^0.0·u_1^-0.30205548458996534 + x_0^3.486991475363485·x_1^-3.3794825096960146·x_2^0.1788038717810405·x_3^-2.9176438608618893·x_4^4.200964905472036·x_5^2.1563002529685162·x_6^1.8772375721264112·x_7^-3.691415343244345·x_8^4.596517483876976·x_9^-3.6382957950267194·x_10^-2.1120588342818603·x_11^3.018917522978306·x_12^-1.688924410843243·x_13^3.231192061033184·x_14^-2.2710524358264483·x_15^3.646951382085696·x_16^1.7943893341549542·u_0^0.0·u_1^-2.159577024167585 + x_0^1.5434191286056382·x_1^-1.8633239987697992·x_2^-1.0091027215002457·x_3^2.3384637578613763·x_4^0.5012495892919766·x_5^1.9276221216703062·x_6^-3.2966170645623336·x_7^1.1055065495347405·x_8^-4.785499232420694·x_9^-3.8152056226516153·x_10^-0.5862878277952959·x_11^-0.7910880656469574·x_12^1.809143271508935·x_13^-4.750307459236362·x_14^3.3559185243974703·x_15^1.1015232307824752·x_16^-2.0661873602281142·u_0^0.0·u_1^1.2081308656234806 + x_0^4.870053297147296·x_1^-3.6780863147470235·x_2^1.0754343362052552·x_3^-2.3346508840050317·x_4^3.4969286630938896·x_5^-2.7752261589647·x_6^-0.6072183672784339·x_7^0.010900455198449066·x_8^-0.8454450949383494·x_9^3.6562070236559148·x_10^-4.772866898754034·x_11^-4.278478866668497·x_12^0.050502294323298·x_13^2.1241458659474564·x_14^-0.5476067054916598·x_15^-1.174746502003182·x_16^1.0124829273091152·u_0^0.0·u_1^-2.3624722140649217 + x_0^-0.025471369537138244·x_1^0.10361103577899478·x_2^3.582329806246447·x_3^2.2500063931103·x_4^2.670112410675082·x_5^-2.894422501787882·x_6^3.2833422030128414·x_7^4.725312464009164·x_8^-1.5619350223584991·x_9^2.8684273077006894·x_10^4.766357379899315·x_11^3.4763265023152083·x_12^-3.304807876624497·x_13^-1.602039363193144·x_14^0.47241293224542247·x_15^-0.028894944053496907·x_16^2.1612895996890726·u_0^0.0·u_1^-4.460907648144799 + x_0^3.6994594225759254·x_1^-4.650693768646502·x_2^4.349555984145876·x_3^-1.8064096699425711·x_4^-4.702507828149828·x_5^2.68160599460505·x_6^4.052861868144117·x_7^4.88239999777328·x_8^-1.162973352227504·x_9^4.83712913817366·x_10^0.8423414916887264·x_11^2.719289180333474·x_12^4.944486753396623·x_13^4.455328320428457·x_14^1.2139028133424956·x_15^-4.70875435186451·x_16^-0.5660949088224845·u_0^3.767028117707331·u_1^0.0 + x_0^-0.2367471056690773·x_1^-3.95539428307218·x_2^0.16148873559624377·x_3^2.5917463324892465·x_4^0.6706506591015335·x_5^2.8859911750656533·x_6^-2.372767374171553·x_7^-0.01187533178002198·x_8^-2.6212268134931085·x_9^-3.060205077729478·x_10^-3.455533046530932·x_11^-1.2857879464665842·x_12^4.465873836571211·x_13^-0.43327287359674216·x_14^-2.8454989866075895·x_15^-2.389232109032189·x_16^-4.126592967144659·u_0^-3.952283595488762·u_1^0.0 + x_0^-3.530612894869517·x_1^-3.0146830240456293·x_2^-0.2577907805042745·x_3^4.439395058889431·x_4^2.8848450206200464·x_5^2.6107731783784613·x_6^-1.1555275556042375·x_7^3.0667809598768283·x_8^1.4973897685904163·x_9^4.357238469838803·x_10^3.187198403948278·x_11^-1.901133575927111·x_12^2.8505122741926687·x_13^1.4548730575900937·x_14^-0.8790383829764306·x_15^2.4259821397275525·x_16^2.3721665575511244·u_0^0.0·u_1^-1.628169400240958 + x_0^1.1594518233301194·x_1^-2.7976888154806967·x_2^1.6252301019268254·x_3^4.7097631599042895·x_4^-2.6888881592312264·x_5^4.731758909924359·x_6^2.257257309398188·x_7^2.8478221099678915·x_8^4.979545052439109·x_9^-4.746873212604978·x_10^-4.3743325484612505·x_11^-2.6817268053624366·x_12^-0.536261158315078·x_13^4.8138279649314715·x_14^4.938554458944864·x_15^4.598112528605252·x_16^3.487453186267226·u_0^-1.5736506300863757·u_1^0.0 + x_0^0.43888343909389604·x_1^-3.1077002788988017·x_2^-2.8577555912159145·x_3^0.971484637194032·x_4^2.5781305098343648·x_5^-0.747672522372369·x_6^0.25146359230351223·x_7^1.2802991181124792·x_8^2.4243630660750632·x_9^1.2675734078865117·x_10^3.151506725140468·x_11^-4.001815550261663·x_12^4.1933505788415495·x_13^-4.139741673210654·x_14^-2.101403883200393·x_15^-4.29431206544407·x_16^0.588051531698218·u_0^-0.23092858948401074·u_1^0.0)

======================================================================
FAIL [0.107s]: test_correlated_monomials (run_tests.TestEquivalentPosynomials_mosek_conif)
----------------------------------------------------------------------
Traceback (most recent call last):
  File "/jenkins/workspace/CE_gpkit_PR_research_models/buildnode/reynolds/optimizer/mosek/robust/robust/testing/t_equivalent_posynomials.py", line 99, in test_correlated_monomials
    self.assertSetEqual(set(actual_posynomials), set(theoretical_posynomials))
AssertionError: Items in the first set but not the second:
gpkit.Posynomial(x_12^0.26·x_11^0.29·x_10^1.2·x_2^2.2·x_3^2.8/x_4^3.7/x_5^3.4/x_1^3.3/x_6^3/x_9^0.88/x_0^0.73/x_8^0.28/x_7^0.054 + x_5^0.011·x_10^2.4·x_1^2.7·x_12^3.2·x_8^3.5·x_2^4.2·x_11^4.4/x_4^4.1/x_0^3.4/x_7^1.8/x_6^1.7/x_9^0.9/x_3^0.78 + x_0^0.21·x_5^0.27·x_9^0.4·x_12^1.4·x_6^2.9·x_1^3.1·x_8^3.3·x_2^4.1/x_11^4.7/x_3^4.2/x_4^3.4/x_7^1.5/x_10^1.4)
Items in the second set but not the first:
gpkit.Posynomial(x_8^1.1·x_10^1.2·x_6^1.9·x_1^1.9·x_9^2.7·x_4^3.7/u_0^4.8/x_12^3.8/x_0^3.6/x_3^3.4/x_7^2.4/x_2^2.1/x_5^1.2/x_11^0.68 + x_0^-0.42077662592307963·x_1^-0.12308104069996073·x_2^-4.58975776088227·x_3^4.378993619208243·x_4^-2.19334704399465·x_5^1.8840190072922098·x_6^-1.2396800227065174·x_7^-3.3611760172988103·x_8^-4.7049388629909235·x_9^0.3082248888265129·x_10^-0.4754351717632517·x_11^-0.6675322686878129·x_12^4.8052194184535075·u_0^4.5547195041845985 + x_0^1.6783603641092624·x_1^-2.477977427687482·x_2^2.9801381676169036·x_3^2.959807582420593·x_4^-1.4800798774030053·x_5^3.9010610263256673·x_6^4.1611906477462455·x_7^-0.08965908382247445·x_8^-1.3775395772632582·x_9^-3.636360679997787·x_10^-4.51771662852008·x_11^-0.7895599674572873·x_12^-4.670328562715996·u_0^-3.255747634818033)

======================================================================
FAIL [0.378s]: test_conservativeness (run_tests.TestPrimitives_mosek_cli)
Testing conservativeness of solution methods
----------------------------------------------------------------------
Traceback (most recent call last):
  File "/jenkins/workspace/CE_gpkit_PR_research_models/buildnode/reynolds/optimizer/mosek/robust/robust/testing/t_primitives.py", line 66, in test_conservativeness
    self.assertTrue(sm['cost'] <= sem['cost'] <= smm['cost'] <= sbm['cost'])
AssertionError: False is not true

======================================================================
FAIL [0.105s]: test_methods (run_tests.TestPrimitives_mosek_cli)
----------------------------------------------------------------------
Traceback (most recent call last):
  File "/jenkins/workspace/CE_gpkit_PR_research_models/buildnode/reynolds/optimizer/mosek/robust/robust/testing/t_primitives.py", line 117, in test_methods
    self.assertAlmostEqual(sol(vk), prev_sol(vk), places=5)
AssertionError: <Quantity(0.636130459, 'dimensionless')> != <Quantity(0.631384596, 'dimensionless')> within 5 places (<Quantity(0.00474586309, 'dimensionless')> difference)

======================================================================
FAIL [0.372s]: test_conservativeness (run_tests.TestPrimitives_mosek_conif)
Testing conservativeness of solution methods
----------------------------------------------------------------------
Traceback (most recent call last):
  File "/jenkins/workspace/CE_gpkit_PR_research_models/buildnode/reynolds/optimizer/mosek/robust/robust/testing/t_primitives.py", line 66, in test_conservativeness
    self.assertTrue(sm['cost'] <= sem['cost'] <= smm['cost'] <= sbm['cost'])
AssertionError: False is not true

======================================================================
FAIL [0.105s]: test_methods (run_tests.TestPrimitives_mosek_conif)
----------------------------------------------------------------------
Traceback (most recent call last):
  File "/jenkins/workspace/CE_gpkit_PR_research_models/buildnode/reynolds/optimizer/mosek/robust/robust/testing/t_primitives.py", line 117, in test_methods
    self.assertAlmostEqual(sol(vk), prev_sol(vk), places=5)
AssertionError: <Quantity(0.636130459, 'dimensionless')> != <Quantity(0.631384596, 'dimensionless')> within 5 places (<Quantity(0.00474586309, 'dimensionless')> difference)

======================================================================
FAIL [0.056s]: test_bad_relations (run_tests.TestTwoTermApproximation_mosek_cli)
----------------------------------------------------------------------
Traceback (most recent call last):
  File "/jenkins/workspace/CE_gpkit_PR_research_models/buildnode/reynolds/optimizer/mosek/robust/robust/testing/t_two_term_approximation.py", line 202, in test_bad_relations
    self.assertEqual(actual_relations_mons, relations_mons)
AssertionError: {gpkit.Monomial(8.55·u_0^0.29·x_3^0.77·u_1^0.79·u_12^1.2·[12506 chars]: 4}} != {gpkit.Monomial(6.29·x_0^1.9322659499845605·x_1^3.8493004[34363 chars]: 2}}
Diff is 79312 characters long. Set self.maxDiff to None to see it.

======================================================================
FAIL [0.156s]: test_bad_relations (run_tests.TestTwoTermApproximation_mosek_conif)
----------------------------------------------------------------------
Traceback (most recent call last):
  File "/jenkins/workspace/CE_gpkit_PR_research_models/buildnode/reynolds/optimizer/mosek/robust/robust/testing/t_two_term_approximation.py", line 202, in test_bad_relations
    self.assertEqual(actual_relations_mons, relations_mons)
AssertionError: {gpkit.Monomial(3.95·u_8^0.054·u_33^0.087·x_1^0.097·u_11^[38258 chars]: 8}} != {gpkit.Monomial(8.19·x_0^-3.2369635574898514·x_1^-1.99640[103928 chars] 11}}
Diff is 254750 characters long. Set self.maxDiff to None to see it.

----------------------------------------------------------------------
Ran 42 tests in 41.227s

FAILED (failures=8)

Generating XML reports...
.
----------------------------------------------------------------------
Ran 2 tests in 109.209s

OK

Generating XML reports...
Cloning into 'shopping'...
adding test for 'test.py'

Running tests...
----------------------------------------------------------------------
..Using solver 'mosek_cli'
 for 25 free variables
  in 40 posynomial inequalities.
Solving took 0.0434 seconds.
Using solver 'mosek_cli'
 for 25 free variables
  in 40 posynomial inequalities.
Solving took 0.0397 seconds.
.Using solver 'mosek_conif'
 for 25 free variables
  in 40 posynomial inequalities.
Solving took 0.0302 seconds.

----------------------------------------------------------------------
Ran 3 tests in 0.202s

OK

Generating XML reports...
Cloning into 'gassolar'...
Requirement already satisfied: pandas in /jenkins/workspace/CE_gpkit_PR_research_models/buildnode/reynolds/optimizer/mosek/venv_jenkins/lib/python3.8/site-packages (1.4.1)
Requirement already satisfied: pytz>=2020.1 in /jenkins/workspace/CE_gpkit_PR_research_models/buildnode/reynolds/optimizer/mosek/venv_jenkins/lib/python3.8/site-packages (from pandas) (2021.3)
Requirement already satisfied: numpy>=1.18.5 in /jenkins/workspace/CE_gpkit_PR_research_models/buildnode/reynolds/optimizer/mosek/venv_jenkins/lib/python3.8/site-packages (from pandas) (1.22.2)
Requirement already satisfied: python-dateutil>=2.8.1 in /jenkins/workspace/CE_gpkit_PR_research_models/buildnode/reynolds/optimizer/mosek/venv_jenkins/lib/python3.8/site-packages (from pandas) (2.8.2)
Requirement already satisfied: six>=1.5 in /jenkins/workspace/CE_gpkit_PR_research_models/buildnode/reynolds/optimizer/mosek/venv_jenkins/lib/python3.8/site-packages (from python-dateutil>=2.8.1->pandas) (1.16.0)
Collecting git+https://github.com/hoburg/gpfit.git
  Cloning https://github.com/hoburg/gpfit.git to /tmp/pip-req-build-am26dl7w
  Running command git clone --filter=blob:none --quiet https://github.com/hoburg/gpfit.git /tmp/pip-req-build-am26dl7w
  Resolved https://github.com/hoburg/gpfit.git to commit 3c8025f12ba5360fdeb71c270e55d4c93e1676fd
  Preparing metadata (setup.py): started
  Preparing metadata (setup.py): finished with status 'done'
Requirement already satisfied: gpkit in /jenkins/workspace/CE_gpkit_PR_research_models/buildnode/reynolds/optimizer/mosek (from gpfit==0.2.0) (1.1.1)
Requirement already satisfied: matplotlib>=3.3.2 in /jenkins/workspace/CE_gpkit_PR_research_models/buildnode/reynolds/optimizer/mosek/venv_jenkins/lib/python3.8/site-packages (from gpfit==0.2.0) (3.5.1)
Requirement already satisfied: numpy in /jenkins/workspace/CE_gpkit_PR_research_models/buildnode/reynolds/optimizer/mosek/venv_jenkins/lib/python3.8/site-packages (from gpfit==0.2.0) (1.22.2)
Collecting pytest-mpl>=0.13
  Using cached pytest_mpl-0.14.0-py3-none-any.whl (27 kB)
Requirement already satisfied: pytest>=6.2.5 in /jenkins/workspace/CE_gpkit_PR_research_models/buildnode/reynolds/optimizer/mosek/venv_jenkins/lib/python3.8/site-packages (from gpfit==0.2.0) (7.0.1)
Requirement already satisfied: scipy in /jenkins/workspace/CE_gpkit_PR_research_models/buildnode/reynolds/optimizer/mosek/venv_jenkins/lib/python3.8/site-packages (from gpfit==0.2.0) (1.8.0)
Requirement already satisfied: fonttools>=4.22.0 in /jenkins/workspace/CE_gpkit_PR_research_models/buildnode/reynolds/optimizer/mosek/venv_jenkins/lib/python3.8/site-packages (from matplotlib>=3.3.2->gpfit==0.2.0) (4.29.1)
Requirement already satisfied: kiwisolver>=1.0.1 in /jenkins/workspace/CE_gpkit_PR_research_models/buildnode/reynolds/optimizer/mosek/venv_jenkins/lib/python3.8/site-packages (from matplotlib>=3.3.2->gpfit==0.2.0) (1.3.2)
Requirement already satisfied: cycler>=0.10 in /jenkins/workspace/CE_gpkit_PR_research_models/buildnode/reynolds/optimizer/mosek/venv_jenkins/lib/python3.8/site-packages (from matplotlib>=3.3.2->gpfit==0.2.0) (0.11.0)
Requirement already satisfied: pillow>=6.2.0 in /jenkins/workspace/CE_gpkit_PR_research_models/buildnode/reynolds/optimizer/mosek/venv_jenkins/lib/python3.8/site-packages (from matplotlib>=3.3.2->gpfit==0.2.0) (9.0.1)
Requirement already satisfied: pyparsing>=2.2.1 in /jenkins/workspace/CE_gpkit_PR_research_models/buildnode/reynolds/optimizer/mosek/venv_jenkins/lib/python3.8/site-packages (from matplotlib>=3.3.2->gpfit==0.2.0) (3.0.7)
Requirement already satisfied: python-dateutil>=2.7 in /jenkins/workspace/CE_gpkit_PR_research_models/buildnode/reynolds/optimizer/mosek/venv_jenkins/lib/python3.8/site-packages (from matplotlib>=3.3.2->gpfit==0.2.0) (2.8.2)
Requirement already satisfied: packaging>=20.0 in /jenkins/workspace/CE_gpkit_PR_research_models/buildnode/reynolds/optimizer/mosek/venv_jenkins/lib/python3.8/site-packages (from matplotlib>=3.3.2->gpfit==0.2.0) (21.3)
Requirement already satisfied: iniconfig in /jenkins/workspace/CE_gpkit_PR_research_models/buildnode/reynolds/optimizer/mosek/venv_jenkins/lib/python3.8/site-packages (from pytest>=6.2.5->gpfit==0.2.0) (1.1.1)
Requirement already satisfied: py>=1.8.2 in /jenkins/workspace/CE_gpkit_PR_research_models/buildnode/reynolds/optimizer/mosek/venv_jenkins/lib/python3.8/site-packages (from pytest>=6.2.5->gpfit==0.2.0) (1.11.0)
Requirement already satisfied: attrs>=19.2.0 in /jenkins/workspace/CE_gpkit_PR_research_models/buildnode/reynolds/optimizer/mosek/venv_jenkins/lib/python3.8/site-packages (from pytest>=6.2.5->gpfit==0.2.0) (21.4.0)
Requirement already satisfied: tomli>=1.0.0 in /jenkins/workspace/CE_gpkit_PR_research_models/buildnode/reynolds/optimizer/mosek/venv_jenkins/lib/python3.8/site-packages (from pytest>=6.2.5->gpfit==0.2.0) (2.0.1)
Requirement already satisfied: pluggy<2.0,>=0.12 in /jenkins/workspace/CE_gpkit_PR_research_models/buildnode/reynolds/optimizer/mosek/venv_jenkins/lib/python3.8/site-packages (from pytest>=6.2.5->gpfit==0.2.0) (1.0.0)
Requirement already satisfied: Jinja2 in /jenkins/workspace/CE_gpkit_PR_research_models/buildnode/reynolds/optimizer/mosek/venv_jenkins/lib/python3.8/site-packages (from pytest-mpl>=0.13->gpfit==0.2.0) (3.0.3)
Requirement already satisfied: adce in /jenkins/workspace/CE_gpkit_PR_research_models/buildnode/reynolds/optimizer/mosek/venv_jenkins/lib/python3.8/site-packages (from gpkit->gpfit==0.2.0) (1.3.3.2)
Requirement already satisfied: cvxopt>=1.1.8 in /jenkins/workspace/CE_gpkit_PR_research_models/buildnode/reynolds/optimizer/mosek/venv_jenkins/lib/python3.8/site-packages (from gpkit->gpfit==0.2.0) (1.2.7)
Requirement already satisfied: pint>=0.8.1 in /jenkins/workspace/CE_gpkit_PR_research_models/buildnode/reynolds/optimizer/mosek/venv_jenkins/lib/python3.8/site-packages (from gpkit->gpfit==0.2.0) (0.18)
Requirement already satisfied: plotly in /jenkins/workspace/CE_gpkit_PR_research_models/buildnode/reynolds/optimizer/mosek/venv_jenkins/lib/python3.8/site-packages (from gpkit->gpfit==0.2.0) (5.6.0)
Requirement already satisfied: six>=1.5 in /jenkins/workspace/CE_gpkit_PR_research_models/buildnode/reynolds/optimizer/mosek/venv_jenkins/lib/python3.8/site-packages (from python-dateutil>=2.7->matplotlib>=3.3.2->gpfit==0.2.0) (1.16.0)
Requirement already satisfied: MarkupSafe>=2.0 in /jenkins/workspace/CE_gpkit_PR_research_models/buildnode/reynolds/optimizer/mosek/venv_jenkins/lib/python3.8/site-packages (from Jinja2->pytest-mpl>=0.13->gpfit==0.2.0) (2.1.0)
Requirement already satisfied: tenacity>=6.2.0 in /jenkins/workspace/CE_gpkit_PR_research_models/buildnode/reynolds/optimizer/mosek/venv_jenkins/lib/python3.8/site-packages (from plotly->gpkit->gpfit==0.2.0) (8.0.1)
Building wheels for collected packages: gpfit
  Building wheel for gpfit (setup.py): started
  Building wheel for gpfit (setup.py): finished with status 'done'
  Created wheel for gpfit: filename=gpfit-0.2.0-py3-none-any.whl size=493910 sha256=83622bf4e8473d0c8c27fad52cabd2cc11a8b91f7b1e29d7ff871598b8713a76
  Stored in directory: /tmp/pip-ephem-wheel-cache-rxri7zyb/wheels/af/cf/b2/2ac87fb831d125183f0d1ae3fcdb4499306dd5219d04dd6687
Successfully built gpfit
Installing collected packages: pytest-mpl, gpfit
Successfully installed gpfit-0.2.0 pytest-mpl-0.14.0
Processing /jenkins/workspace/CE_gpkit_PR_research_models/buildnode/reynolds/optimizer/mosek/gassolar
  Preparing metadata (setup.py): started
  Preparing metadata (setup.py): finished with status 'done'
Requirement already satisfied: gpfit in /jenkins/workspace/CE_gpkit_PR_research_models/buildnode/reynolds/optimizer/mosek/venv_jenkins/lib/python3.8/site-packages (from gassolar==0.0.0.0) (0.2.0)
Requirement already satisfied: gpkit in /jenkins/workspace/CE_gpkit_PR_research_models/buildnode/reynolds/optimizer/mosek (from gassolar==0.0.0.0) (1.1.1)
Requirement already satisfied: numpy in /jenkins/workspace/CE_gpkit_PR_research_models/buildnode/reynolds/optimizer/mosek/venv_jenkins/lib/python3.8/site-packages (from gassolar==0.0.0.0) (1.22.2)
Requirement already satisfied: pandas in /jenkins/workspace/CE_gpkit_PR_research_models/buildnode/reynolds/optimizer/mosek/venv_jenkins/lib/python3.8/site-packages (from gassolar==0.0.0.0) (1.4.1)
Requirement already satisfied: scipy in /jenkins/workspace/CE_gpkit_PR_research_models/buildnode/reynolds/optimizer/mosek/venv_jenkins/lib/python3.8/site-packages (from gassolar==0.0.0.0) (1.8.0)
Requirement already satisfied: pytest-mpl>=0.13 in /jenkins/workspace/CE_gpkit_PR_research_models/buildnode/reynolds/optimizer/mosek/venv_jenkins/lib/python3.8/site-packages (from gpfit->gassolar==0.0.0.0) (0.14.0)
Requirement already satisfied: pytest>=6.2.5 in /jenkins/workspace/CE_gpkit_PR_research_models/buildnode/reynolds/optimizer/mosek/venv_jenkins/lib/python3.8/site-packages (from gpfit->gassolar==0.0.0.0) (7.0.1)
Requirement already satisfied: matplotlib>=3.3.2 in /jenkins/workspace/CE_gpkit_PR_research_models/buildnode/reynolds/optimizer/mosek/venv_jenkins/lib/python3.8/site-packages (from gpfit->gassolar==0.0.0.0) (3.5.1)
Requirement already satisfied: adce in /jenkins/workspace/CE_gpkit_PR_research_models/buildnode/reynolds/optimizer/mosek/venv_jenkins/lib/python3.8/site-packages (from gpkit->gassolar==0.0.0.0) (1.3.3.2)
Requirement already satisfied: cvxopt>=1.1.8 in /jenkins/workspace/CE_gpkit_PR_research_models/buildnode/reynolds/optimizer/mosek/venv_jenkins/lib/python3.8/site-packages (from gpkit->gassolar==0.0.0.0) (1.2.7)
Requirement already satisfied: pint>=0.8.1 in /jenkins/workspace/CE_gpkit_PR_research_models/buildnode/reynolds/optimizer/mosek/venv_jenkins/lib/python3.8/site-packages (from gpkit->gassolar==0.0.0.0) (0.18)
Requirement already satisfied: plotly in /jenkins/workspace/CE_gpkit_PR_research_models/buildnode/reynolds/optimizer/mosek/venv_jenkins/lib/python3.8/site-packages (from gpkit->gassolar==0.0.0.0) (5.6.0)
Requirement already satisfied: pytz>=2020.1 in /jenkins/workspace/CE_gpkit_PR_research_models/buildnode/reynolds/optimizer/mosek/venv_jenkins/lib/python3.8/site-packages (from pandas->gassolar==0.0.0.0) (2021.3)
Requirement already satisfied: python-dateutil>=2.8.1 in /jenkins/workspace/CE_gpkit_PR_research_models/buildnode/reynolds/optimizer/mosek/venv_jenkins/lib/python3.8/site-packages (from pandas->gassolar==0.0.0.0) (2.8.2)
Requirement already satisfied: fonttools>=4.22.0 in /jenkins/workspace/CE_gpkit_PR_research_models/buildnode/reynolds/optimizer/mosek/venv_jenkins/lib/python3.8/site-packages (from matplotlib>=3.3.2->gpfit->gassolar==0.0.0.0) (4.29.1)
Requirement already satisfied: kiwisolver>=1.0.1 in /jenkins/workspace/CE_gpkit_PR_research_models/buildnode/reynolds/optimizer/mosek/venv_jenkins/lib/python3.8/site-packages (from matplotlib>=3.3.2->gpfit->gassolar==0.0.0.0) (1.3.2)
Requirement already satisfied: cycler>=0.10 in /jenkins/workspace/CE_gpkit_PR_research_models/buildnode/reynolds/optimizer/mosek/venv_jenkins/lib/python3.8/site-packages (from matplotlib>=3.3.2->gpfit->gassolar==0.0.0.0) (0.11.0)
Requirement already satisfied: pillow>=6.2.0 in /jenkins/workspace/CE_gpkit_PR_research_models/buildnode/reynolds/optimizer/mosek/venv_jenkins/lib/python3.8/site-packages (from matplotlib>=3.3.2->gpfit->gassolar==0.0.0.0) (9.0.1)
Requirement already satisfied: pyparsing>=2.2.1 in /jenkins/workspace/CE_gpkit_PR_research_models/buildnode/reynolds/optimizer/mosek/venv_jenkins/lib/python3.8/site-packages (from matplotlib>=3.3.2->gpfit->gassolar==0.0.0.0) (3.0.7)
Requirement already satisfied: packaging>=20.0 in /jenkins/workspace/CE_gpkit_PR_research_models/buildnode/reynolds/optimizer/mosek/venv_jenkins/lib/python3.8/site-packages (from matplotlib>=3.3.2->gpfit->gassolar==0.0.0.0) (21.3)
Requirement already satisfied: iniconfig in /jenkins/workspace/CE_gpkit_PR_research_models/buildnode/reynolds/optimizer/mosek/venv_jenkins/lib/python3.8/site-packages (from pytest>=6.2.5->gpfit->gassolar==0.0.0.0) (1.1.1)
Requirement already satisfied: py>=1.8.2 in /jenkins/workspace/CE_gpkit_PR_research_models/buildnode/reynolds/optimizer/mosek/venv_jenkins/lib/python3.8/site-packages (from pytest>=6.2.5->gpfit->gassolar==0.0.0.0) (1.11.0)
Requirement already satisfied: attrs>=19.2.0 in /jenkins/workspace/CE_gpkit_PR_research_models/buildnode/reynolds/optimizer/mosek/venv_jenkins/lib/python3.8/site-packages (from pytest>=6.2.5->gpfit->gassolar==0.0.0.0) (21.4.0)
Requirement already satisfied: tomli>=1.0.0 in /jenkins/workspace/CE_gpkit_PR_research_models/buildnode/reynolds/optimizer/mosek/venv_jenkins/lib/python3.8/site-packages (from pytest>=6.2.5->gpfit->gassolar==0.0.0.0) (2.0.1)
Requirement already satisfied: pluggy<2.0,>=0.12 in /jenkins/workspace/CE_gpkit_PR_research_models/buildnode/reynolds/optimizer/mosek/venv_jenkins/lib/python3.8/site-packages (from pytest>=6.2.5->gpfit->gassolar==0.0.0.0) (1.0.0)
Requirement already satisfied: Jinja2 in /jenkins/workspace/CE_gpkit_PR_research_models/buildnode/reynolds/optimizer/mosek/venv_jenkins/lib/python3.8/site-packages (from pytest-mpl>=0.13->gpfit->gassolar==0.0.0.0) (3.0.3)
Requirement already satisfied: six>=1.5 in /jenkins/workspace/CE_gpkit_PR_research_models/buildnode/reynolds/optimizer/mosek/venv_jenkins/lib/python3.8/site-packages (from python-dateutil>=2.8.1->pandas->gassolar==0.0.0.0) (1.16.0)
Requirement already satisfied: tenacity>=6.2.0 in /jenkins/workspace/CE_gpkit_PR_research_models/buildnode/reynolds/optimizer/mosek/venv_jenkins/lib/python3.8/site-packages (from plotly->gpkit->gassolar==0.0.0.0) (8.0.1)
Requirement already satisfied: MarkupSafe>=2.0 in /jenkins/workspace/CE_gpkit_PR_research_models/buildnode/reynolds/optimizer/mosek/venv_jenkins/lib/python3.8/site-packages (from Jinja2->pytest-mpl>=0.13->gpfit->gassolar==0.0.0.0) (2.1.0)
Building wheels for collected packages: gassolar
  Building wheel for gassolar (setup.py): started
  Building wheel for gassolar (setup.py): finished with status 'done'
  Created wheel for gassolar: filename=gassolar-0.0.0.0-py3-none-any.whl size=4876521 sha256=facd93f950e6e4b11bb510129803f427934e43771a69f14ceeedf0d938558d77
  Stored in directory: /tmp/pip-ephem-wheel-cache-dv9qymwv/wheels/88/62/ef/80e970cf47fd7bca52e3a215c705ae3a70c15dd885821f0542
Successfully built gassolar
Installing collected packages: gassolar
Successfully installed gassolar-0.0.0.0
adding test for 'gassolar/gas/gas.py'
adding test for 'gassolar/solar/solar.py'

Running tests...
----------------------------------------------------------------------
EEEE
======================================================================
ERROR [0.535s]: test_gassolar_gas_gas_py_mosek_cli (gpkit.tests.from_paths.TestFiles)
----------------------------------------------------------------------
Traceback (most recent call last):
  File "/jenkins/workspace/CE_gpkit_PR_research_models/buildnode/reynolds/optimizer/mosek/gpkit/tests/helpers.py", line 55, in test
    testfn(name, import_dict, path)(self)
  File "/jenkins/workspace/CE_gpkit_PR_research_models/buildnode/reynolds/optimizer/mosek/gpkit/tests/from_paths.py", line 48, in <lambda>
    lambda self: getattr(self, name)()))  # pylint:disable=undefined-variable
  File "/jenkins/workspace/CE_gpkit_PR_research_models/buildnode/reynolds/optimizer/mosek/gpkit/tests/from_paths.py", line 34, in test_fn
    mod = __import__(os.path.basename(path)[:-3])
  File "/jenkins/workspace/CE_gpkit_PR_research_models/buildnode/reynolds/optimizer/mosek/gassolar/gassolar/gas/gas.py", line 3, in <module>
    from gpkitmodels.GP.aircraft.engine.gas_engine import Engine
  File "/jenkins/workspace/CE_gpkit_PR_research_models/buildnode/reynolds/optimizer/mosek/gplibrary/gpkitmodels/GP/aircraft/engine/gas_engine.py", line 7, in <module>
    from gpfit.fit_constraintset import FitCS
ModuleNotFoundError: No module named 'gpfit.fit_constraintset'

======================================================================
ERROR [0.001s]: test_gassolar_gas_gas_py_mosek_conif (gpkit.tests.from_paths.TestFiles)
----------------------------------------------------------------------
Traceback (most recent call last):
  File "/jenkins/workspace/CE_gpkit_PR_research_models/buildnode/reynolds/optimizer/mosek/gpkit/tests/helpers.py", line 55, in test
    testfn(name, import_dict, path)(self)
  File "/jenkins/workspace/CE_gpkit_PR_research_models/buildnode/reynolds/optimizer/mosek/gpkit/tests/from_paths.py", line 48, in <lambda>
    lambda self: getattr(self, name)()))  # pylint:disable=undefined-variable
  File "/jenkins/workspace/CE_gpkit_PR_research_models/buildnode/reynolds/optimizer/mosek/gpkit/tests/from_paths.py", line 34, in test_fn
    mod = __import__(os.path.basename(path)[:-3])
  File "/jenkins/workspace/CE_gpkit_PR_research_models/buildnode/reynolds/optimizer/mosek/gassolar/gassolar/gas/gas.py", line 3, in <module>
    from gpkitmodels.GP.aircraft.engine.gas_engine import Engine
  File "/jenkins/workspace/CE_gpkit_PR_research_models/buildnode/reynolds/optimizer/mosek/gplibrary/gpkitmodels/GP/aircraft/engine/gas_engine.py", line 7, in <module>
    from gpfit.fit_constraintset import FitCS
ModuleNotFoundError: No module named 'gpfit.fit_constraintset'

======================================================================
ERROR [0.021s]: test_gassolar_solar_solar_py_mosek_cli (gpkit.tests.from_paths.TestFiles)
----------------------------------------------------------------------
Traceback (most recent call last):
  File "/jenkins/workspace/CE_gpkit_PR_research_models/buildnode/reynolds/optimizer/mosek/gpkit/tests/helpers.py", line 55, in test
    testfn(name, import_dict, path)(self)
  File "/jenkins/workspace/CE_gpkit_PR_research_models/buildnode/reynolds/optimizer/mosek/gpkit/tests/from_paths.py", line 48, in <lambda>
    lambda self: getattr(self, name)()))  # pylint:disable=undefined-variable
  File "/jenkins/workspace/CE_gpkit_PR_research_models/buildnode/reynolds/optimizer/mosek/gpkit/tests/from_paths.py", line 34, in test_fn
    mod = __import__(os.path.basename(path)[:-3])
  File "/jenkins/workspace/CE_gpkit_PR_research_models/buildnode/reynolds/optimizer/mosek/gassolar/gassolar/solar/solar.py", line 12, in <module>
    from gpkitmodels.GP.aircraft.wing.wing import Wing as WingGP
  File "/jenkins/workspace/CE_gpkit_PR_research_models/buildnode/reynolds/optimizer/mosek/gplibrary/gpkitmodels/GP/aircraft/wing/wing.py", line 10, in <module>
    from .capspar import CapSpar
  File "/jenkins/workspace/CE_gpkit_PR_research_models/buildnode/reynolds/optimizer/mosek/gplibrary/gpkitmodels/GP/aircraft/wing/capspar.py", line 4, in <module>
    from .gustloading import GustL
  File "/jenkins/workspace/CE_gpkit_PR_research_models/buildnode/reynolds/optimizer/mosek/gplibrary/gpkitmodels/GP/aircraft/wing/gustloading.py", line 4, in <module>
    from ad.admath import cos
ModuleNotFoundError: No module named 'ad'

======================================================================
ERROR [0.001s]: test_gassolar_solar_solar_py_mosek_conif (gpkit.tests.from_paths.TestFiles)
----------------------------------------------------------------------
Traceback (most recent call last):
  File "/jenkins/workspace/CE_gpkit_PR_research_models/buildnode/reynolds/optimizer/mosek/gpkit/tests/helpers.py", line 55, in test
    testfn(name, import_dict, path)(self)
  File "/jenkins/workspace/CE_gpkit_PR_research_models/buildnode/reynolds/optimizer/mosek/gpkit/tests/from_paths.py", line 48, in <lambda>
    lambda self: getattr(self, name)()))  # pylint:disable=undefined-variable
  File "/jenkins/workspace/CE_gpkit_PR_research_models/buildnode/reynolds/optimizer/mosek/gpkit/tests/from_paths.py", line 34, in test_fn
    mod = __import__(os.path.basename(path)[:-3])
  File "/jenkins/workspace/CE_gpkit_PR_research_models/buildnode/reynolds/optimizer/mosek/gassolar/gassolar/solar/solar.py", line 12, in <module>
    from gpkitmodels.GP.aircraft.wing.wing import Wing as WingGP
  File "/jenkins/workspace/CE_gpkit_PR_research_models/buildnode/reynolds/optimizer/mosek/gplibrary/gpkitmodels/GP/aircraft/wing/wing.py", line 10, in <module>
    from .capspar import CapSpar
  File "/jenkins/workspace/CE_gpkit_PR_research_models/buildnode/reynolds/optimizer/mosek/gplibrary/gpkitmodels/GP/aircraft/wing/capspar.py", line 4, in <module>
    from .gustloading import GustL
  File "/jenkins/workspace/CE_gpkit_PR_research_models/buildnode/reynolds/optimizer/mosek/gplibrary/gpkitmodels/GP/aircraft/wing/gustloading.py", line 4, in <module>
    from ad.admath import cos
ModuleNotFoundError: No module named 'ad'

----------------------------------------------------------------------
Ran 4 tests in 0.559s

FAILED (errors=4)

Generating XML reports...
Cloning into 'jho'...
Requirement already satisfied: pandas in /jenkins/workspace/CE_gpkit_PR_research_models/buildnode/reynolds/optimizer/mosek/venv_jenkins/lib/python3.8/site-packages (1.4.1)
Requirement already satisfied: pytz>=2020.1 in /jenkins/workspace/CE_gpkit_PR_research_models/buildnode/reynolds/optimizer/mosek/venv_jenkins/lib/python3.8/site-packages (from pandas) (2021.3)
Requirement already satisfied: numpy>=1.18.5 in /jenkins/workspace/CE_gpkit_PR_research_models/buildnode/reynolds/optimizer/mosek/venv_jenkins/lib/python3.8/site-packages (from pandas) (1.22.2)
Requirement already satisfied: python-dateutil>=2.8.1 in /jenkins/workspace/CE_gpkit_PR_research_models/buildnode/reynolds/optimizer/mosek/venv_jenkins/lib/python3.8/site-packages (from pandas) (2.8.2)
Requirement already satisfied: six>=1.5 in /jenkins/workspace/CE_gpkit_PR_research_models/buildnode/reynolds/optimizer/mosek/venv_jenkins/lib/python3.8/site-packages (from python-dateutil>=2.8.1->pandas) (1.16.0)
Collecting git+https://github.com/hoburg/gpfit.git
  Cloning https://github.com/hoburg/gpfit.git to /tmp/pip-req-build-3d79xfxn
  Running command git clone --filter=blob:none --quiet https://github.com/hoburg/gpfit.git /tmp/pip-req-build-3d79xfxn
  Resolved https://github.com/hoburg/gpfit.git to commit 3c8025f12ba5360fdeb71c270e55d4c93e1676fd
  Preparing metadata (setup.py): started
  Preparing metadata (setup.py): finished with status 'done'
Requirement already satisfied: gpkit in /jenkins/workspace/CE_gpkit_PR_research_models/buildnode/reynolds/optimizer/mosek (from gpfit==0.2.0) (1.1.1)
Requirement already satisfied: matplotlib>=3.3.2 in /jenkins/workspace/CE_gpkit_PR_research_models/buildnode/reynolds/optimizer/mosek/venv_jenkins/lib/python3.8/site-packages (from gpfit==0.2.0) (3.5.1)
Requirement already satisfied: numpy in /jenkins/workspace/CE_gpkit_PR_research_models/buildnode/reynolds/optimizer/mosek/venv_jenkins/lib/python3.8/site-packages (from gpfit==0.2.0) (1.22.2)
Requirement already satisfied: pytest-mpl>=0.13 in /jenkins/workspace/CE_gpkit_PR_research_models/buildnode/reynolds/optimizer/mosek/venv_jenkins/lib/python3.8/site-packages (from gpfit==0.2.0) (0.14.0)
Requirement already satisfied: pytest>=6.2.5 in /jenkins/workspace/CE_gpkit_PR_research_models/buildnode/reynolds/optimizer/mosek/venv_jenkins/lib/python3.8/site-packages (from gpfit==0.2.0) (7.0.1)
Requirement already satisfied: scipy in /jenkins/workspace/CE_gpkit_PR_research_models/buildnode/reynolds/optimizer/mosek/venv_jenkins/lib/python3.8/site-packages (from gpfit==0.2.0) (1.8.0)
Requirement already satisfied: fonttools>=4.22.0 in /jenkins/workspace/CE_gpkit_PR_research_models/buildnode/reynolds/optimizer/mosek/venv_jenkins/lib/python3.8/site-packages (from matplotlib>=3.3.2->gpfit==0.2.0) (4.29.1)
Requirement already satisfied: kiwisolver>=1.0.1 in /jenkins/workspace/CE_gpkit_PR_research_models/buildnode/reynolds/optimizer/mosek/venv_jenkins/lib/python3.8/site-packages (from matplotlib>=3.3.2->gpfit==0.2.0) (1.3.2)
Requirement already satisfied: cycler>=0.10 in /jenkins/workspace/CE_gpkit_PR_research_models/buildnode/reynolds/optimizer/mosek/venv_jenkins/lib/python3.8/site-packages (from matplotlib>=3.3.2->gpfit==0.2.0) (0.11.0)
Requirement already satisfied: pillow>=6.2.0 in /jenkins/workspace/CE_gpkit_PR_research_models/buildnode/reynolds/optimizer/mosek/venv_jenkins/lib/python3.8/site-packages (from matplotlib>=3.3.2->gpfit==0.2.0) (9.0.1)
Requirement already satisfied: pyparsing>=2.2.1 in /jenkins/workspace/CE_gpkit_PR_research_models/buildnode/reynolds/optimizer/mosek/venv_jenkins/lib/python3.8/site-packages (from matplotlib>=3.3.2->gpfit==0.2.0) (3.0.7)
Requirement already satisfied: python-dateutil>=2.7 in /jenkins/workspace/CE_gpkit_PR_research_models/buildnode/reynolds/optimizer/mosek/venv_jenkins/lib/python3.8/site-packages (from matplotlib>=3.3.2->gpfit==0.2.0) (2.8.2)
Requirement already satisfied: packaging>=20.0 in /jenkins/workspace/CE_gpkit_PR_research_models/buildnode/reynolds/optimizer/mosek/venv_jenkins/lib/python3.8/site-packages (from matplotlib>=3.3.2->gpfit==0.2.0) (21.3)
Requirement already satisfied: iniconfig in /jenkins/workspace/CE_gpkit_PR_research_models/buildnode/reynolds/optimizer/mosek/venv_jenkins/lib/python3.8/site-packages (from pytest>=6.2.5->gpfit==0.2.0) (1.1.1)
Requirement already satisfied: py>=1.8.2 in /jenkins/workspace/CE_gpkit_PR_research_models/buildnode/reynolds/optimizer/mosek/venv_jenkins/lib/python3.8/site-packages (from pytest>=6.2.5->gpfit==0.2.0) (1.11.0)
Requirement already satisfied: attrs>=19.2.0 in /jenkins/workspace/CE_gpkit_PR_research_models/buildnode/reynolds/optimizer/mosek/venv_jenkins/lib/python3.8/site-packages (from pytest>=6.2.5->gpfit==0.2.0) (21.4.0)
Requirement already satisfied: tomli>=1.0.0 in /jenkins/workspace/CE_gpkit_PR_research_models/buildnode/reynolds/optimizer/mosek/venv_jenkins/lib/python3.8/site-packages (from pytest>=6.2.5->gpfit==0.2.0) (2.0.1)
Requirement already satisfied: pluggy<2.0,>=0.12 in /jenkins/workspace/CE_gpkit_PR_research_models/buildnode/reynolds/optimizer/mosek/venv_jenkins/lib/python3.8/site-packages (from pytest>=6.2.5->gpfit==0.2.0) (1.0.0)
Requirement already satisfied: Jinja2 in /jenkins/workspace/CE_gpkit_PR_research_models/buildnode/reynolds/optimizer/mosek/venv_jenkins/lib/python3.8/site-packages (from pytest-mpl>=0.13->gpfit==0.2.0) (3.0.3)
Requirement already satisfied: adce in /jenkins/workspace/CE_gpkit_PR_research_models/buildnode/reynolds/optimizer/mosek/venv_jenkins/lib/python3.8/site-packages (from gpkit->gpfit==0.2.0) (1.3.3.2)
Requirement already satisfied: cvxopt>=1.1.8 in /jenkins/workspace/CE_gpkit_PR_research_models/buildnode/reynolds/optimizer/mosek/venv_jenkins/lib/python3.8/site-packages (from gpkit->gpfit==0.2.0) (1.2.7)
Requirement already satisfied: pint>=0.8.1 in /jenkins/workspace/CE_gpkit_PR_research_models/buildnode/reynolds/optimizer/mosek/venv_jenkins/lib/python3.8/site-packages (from gpkit->gpfit==0.2.0) (0.18)
Requirement already satisfied: plotly in /jenkins/workspace/CE_gpkit_PR_research_models/buildnode/reynolds/optimizer/mosek/venv_jenkins/lib/python3.8/site-packages (from gpkit->gpfit==0.2.0) (5.6.0)
Requirement already satisfied: six>=1.5 in /jenkins/workspace/CE_gpkit_PR_research_models/buildnode/reynolds/optimizer/mosek/venv_jenkins/lib/python3.8/site-packages (from python-dateutil>=2.7->matplotlib>=3.3.2->gpfit==0.2.0) (1.16.0)
Requirement already satisfied: MarkupSafe>=2.0 in /jenkins/workspace/CE_gpkit_PR_research_models/buildnode/reynolds/optimizer/mosek/venv_jenkins/lib/python3.8/site-packages (from Jinja2->pytest-mpl>=0.13->gpfit==0.2.0) (2.1.0)
Requirement already satisfied: tenacity>=6.2.0 in /jenkins/workspace/CE_gpkit_PR_research_models/buildnode/reynolds/optimizer/mosek/venv_jenkins/lib/python3.8/site-packages (from plotly->gpkit->gpfit==0.2.0) (8.0.1)
adding test for 'model/jho.py'
adding test for 'model/print_perf.py'

Running tests...
----------------------------------------------------------------------
EEEE
======================================================================
ERROR [0.539s]: test_model_jho_py_mosek_cli (gpkit.tests.from_paths.TestFiles)
----------------------------------------------------------------------
Traceback (most recent call last):
  File "/jenkins/workspace/CE_gpkit_PR_research_models/buildnode/reynolds/optimizer/mosek/gpkit/tests/helpers.py", line 55, in test
    testfn(name, import_dict, path)(self)
  File "/jenkins/workspace/CE_gpkit_PR_research_models/buildnode/reynolds/optimizer/mosek/gpkit/tests/from_paths.py", line 48, in <lambda>
    lambda self: getattr(self, name)()))  # pylint:disable=undefined-variable
  File "/jenkins/workspace/CE_gpkit_PR_research_models/buildnode/reynolds/optimizer/mosek/gpkit/tests/from_paths.py", line 34, in test_fn
    mod = __import__(os.path.basename(path)[:-3])
  File "/jenkins/workspace/CE_gpkit_PR_research_models/buildnode/reynolds/optimizer/mosek/jho/model/jho.py", line 5, in <module>
    from gpkitmodels.GP.aircraft.engine.gas_engine import Engine
  File "/jenkins/workspace/CE_gpkit_PR_research_models/buildnode/reynolds/optimizer/mosek/gplibrary/gpkitmodels/GP/aircraft/engine/gas_engine.py", line 7, in <module>
    from gpfit.fit_constraintset import FitCS
ModuleNotFoundError: No module named 'gpfit.fit_constraintset'

======================================================================
ERROR [0.001s]: test_model_jho_py_mosek_conif (gpkit.tests.from_paths.TestFiles)
----------------------------------------------------------------------
Traceback (most recent call last):
  File "/jenkins/workspace/CE_gpkit_PR_research_models/buildnode/reynolds/optimizer/mosek/gpkit/tests/helpers.py", line 55, in test
    testfn(name, import_dict, path)(self)
  File "/jenkins/workspace/CE_gpkit_PR_research_models/buildnode/reynolds/optimizer/mosek/gpkit/tests/from_paths.py", line 48, in <lambda>
    lambda self: getattr(self, name)()))  # pylint:disable=undefined-variable
  File "/jenkins/workspace/CE_gpkit_PR_research_models/buildnode/reynolds/optimizer/mosek/gpkit/tests/from_paths.py", line 34, in test_fn
    mod = __import__(os.path.basename(path)[:-3])
  File "/jenkins/workspace/CE_gpkit_PR_research_models/buildnode/reynolds/optimizer/mosek/jho/model/jho.py", line 5, in <module>
    from gpkitmodels.GP.aircraft.engine.gas_engine import Engine
  File "/jenkins/workspace/CE_gpkit_PR_research_models/buildnode/reynolds/optimizer/mosek/gplibrary/gpkitmodels/GP/aircraft/engine/gas_engine.py", line 7, in <module>
    from gpfit.fit_constraintset import FitCS
ModuleNotFoundError: No module named 'gpfit.fit_constraintset'

======================================================================
ERROR [0.003s]: test_model_print_perf_py_mosek_cli (gpkit.tests.from_paths.TestFiles)
----------------------------------------------------------------------
Traceback (most recent call last):
  File "/jenkins/workspace/CE_gpkit_PR_research_models/buildnode/reynolds/optimizer/mosek/gpkit/tests/helpers.py", line 55, in test
    testfn(name, import_dict, path)(self)
  File "/jenkins/workspace/CE_gpkit_PR_research_models/buildnode/reynolds/optimizer/mosek/gpkit/tests/from_paths.py", line 48, in <lambda>
    lambda self: getattr(self, name)()))  # pylint:disable=undefined-variable
  File "/jenkins/workspace/CE_gpkit_PR_research_models/buildnode/reynolds/optimizer/mosek/gpkit/tests/from_paths.py", line 34, in test_fn
    mod = __import__(os.path.basename(path)[:-3])
  File "/jenkins/workspace/CE_gpkit_PR_research_models/buildnode/reynolds/optimizer/mosek/jho/model/print_perf.py", line 4, in <module>
    from jho import Mission
  File "/jenkins/workspace/CE_gpkit_PR_research_models/buildnode/reynolds/optimizer/mosek/jho/model/jho.py", line 5, in <module>
    from gpkitmodels.GP.aircraft.engine.gas_engine import Engine
  File "/jenkins/workspace/CE_gpkit_PR_research_models/buildnode/reynolds/optimizer/mosek/gplibrary/gpkitmodels/GP/aircraft/engine/gas_engine.py", line 7, in <module>
    from gpfit.fit_constraintset import FitCS
ModuleNotFoundError: No module named 'gpfit.fit_constraintset'

======================================================================
ERROR [0.001s]: test_model_print_perf_py_mosek_conif (gpkit.tests.from_paths.TestFiles)
----------------------------------------------------------------------
Traceback (most recent call last):
  File "/jenkins/workspace/CE_gpkit_PR_research_models/buildnode/reynolds/optimizer/mosek/gpkit/tests/helpers.py", line 55, in test
    testfn(name, import_dict, path)(self)
  File "/jenkins/workspace/CE_gpkit_PR_research_models/buildnode/reynolds/optimizer/mosek/gpkit/tests/from_paths.py", line 48, in <lambda>
    lambda self: getattr(self, name)()))  # pylint:disable=undefined-variable
  File "/jenkins/workspace/CE_gpkit_PR_research_models/buildnode/reynolds/optimizer/mosek/gpkit/tests/from_paths.py", line 34, in test_fn
    mod = __import__(os.path.basename(path)[:-3])
  File "/jenkins/workspace/CE_gpkit_PR_research_models/buildnode/reynolds/optimizer/mosek/jho/model/print_perf.py", line 4, in <module>
    from jho import Mission
  File "/jenkins/workspace/CE_gpkit_PR_research_models/buildnode/reynolds/optimizer/mosek/jho/model/jho.py", line 5, in <module>
    from gpkitmodels.GP.aircraft.engine.gas_engine import Engine
  File "/jenkins/workspace/CE_gpkit_PR_research_models/buildnode/reynolds/optimizer/mosek/gplibrary/gpkitmodels/GP/aircraft/engine/gas_engine.py", line 7, in <module>
    from gpfit.fit_constraintset import FitCS
ModuleNotFoundError: No module named 'gpfit.fit_constraintset'

----------------------------------------------------------------------
Ran 4 tests in 0.545s

FAILED (errors=4)

Generating XML reports...
Cloning into 'turbofan'...
Processing /jenkins/workspace/CE_gpkit_PR_research_models/buildnode/reynolds/optimizer/mosek/turbofan
  Preparing metadata (setup.py): started
  Preparing metadata (setup.py): finished with status 'done'
Requirement already satisfied: future in /jenkins/workspace/CE_gpkit_PR_research_models/buildnode/reynolds/optimizer/mosek/venv_jenkins/lib/python3.8/site-packages (from turbofan==0.0.0.0) (0.18.2)
Requirement already satisfied: numpy in /jenkins/workspace/CE_gpkit_PR_research_models/buildnode/reynolds/optimizer/mosek/venv_jenkins/lib/python3.8/site-packages (from turbofan==0.0.0.0) (1.22.2)
Requirement already satisfied: pint in /jenkins/workspace/CE_gpkit_PR_research_models/buildnode/reynolds/optimizer/mosek/venv_jenkins/lib/python3.8/site-packages (from turbofan==0.0.0.0) (0.18)
Requirement already satisfied: scipy in /jenkins/workspace/CE_gpkit_PR_research_models/buildnode/reynolds/optimizer/mosek/venv_jenkins/lib/python3.8/site-packages (from turbofan==0.0.0.0) (1.8.0)
Requirement already satisfied: packaging in /jenkins/workspace/CE_gpkit_PR_research_models/buildnode/reynolds/optimizer/mosek/venv_jenkins/lib/python3.8/site-packages (from pint->turbofan==0.0.0.0) (21.3)
Requirement already satisfied: pyparsing!=3.0.5,>=2.0.2 in /jenkins/workspace/CE_gpkit_PR_research_models/buildnode/reynolds/optimizer/mosek/venv_jenkins/lib/python3.8/site-packages (from packaging->pint->turbofan==0.0.0.0) (3.0.7)
Building wheels for collected packages: turbofan
  Building wheel for turbofan (setup.py): started
  Building wheel for turbofan (setup.py): finished with status 'done'
  Created wheel for turbofan: filename=turbofan-0.0.0.0-py3-none-any.whl size=43844 sha256=ae15e6bf7ce6f81d7abece758a6a6b83c08b5e06ae28d958a922a6bb4d7555c4
  Stored in directory: /tmp/pip-ephem-wheel-cache-88alrakg/wheels/f4/bd/30/317826677ea091f59f56135bdbe483327f484a0ff5045863a3
Successfully built turbofan
Installing collected packages: turbofan
  Attempting uninstall: turbofan
    Found existing installation: turbofan 0.0.0.0
    Uninstalling turbofan-0.0.0.0:
      Successfully uninstalled turbofan-0.0.0.0
Successfully installed turbofan-0.0.0.0
adding test for 'turbofan/engine_test.py'

Running tests...
----------------------------------------------------------------------
.Starting a sequence of GP solves
 for 43 free variables
  in 14 locally-GP constraints
  and for 244 free variables
       in 492 posynomial inequalities.

GP Solve 1
Using solver 'mosek_conif'
 for 244 free variables
  in 492 posynomial inequalities.
Solving took 0.0536 seconds.
Solved cost was 7.929e+13.

GP Solve 2
Using solver 'mosek_conif'
 for 244 free variables
  in 492 posynomial inequalities.
Solving took 0.0291 seconds.
Solved cost was 31.13.

GP Solve 3
Using solver 'mosek_conif'
 for 244 free variables
  in 492 posynomial inequalities.
Solving took 0.0267 seconds.
Solved cost was 10.16.

GP Solve 4
Using solver 'mosek_conif'
 for 244 free variables
  in 492 posynomial inequalities.
Solving took 0.0264 seconds.
Solved cost was 7.827.

GP Solve 5
Using solver 'mosek_conif'
 for 244 free variables
  in 492 posynomial inequalities.
Solving took 0.0243 seconds.
Solved cost was 7.281.

GP Solve 6
Using solver 'mosek_conif'
 for 244 free variables
  in 492 posynomial inequalities.
Solving took 0.0237 seconds.
Solved cost was 7.108.

GP Solve 7
Using solver 'mosek_conif'
 for 244 free variables
  in 492 posynomial inequalities.
Solving took 0.0247 seconds.
Solved cost was 7.029.

GP Solve 8
Using solver 'mosek_conif'
 for 244 free variables
  in 492 posynomial inequalities.
Solving took 0.0245 seconds.
Solved cost was 6.991.

GP Solve 9
Using solver 'mosek_conif'
 for 244 free variables
  in 492 posynomial inequalities.
Solving took 0.0236 seconds.
Solved cost was 6.973.

GP Solve 10
Using solver 'mosek_conif'
 for 244 free variables
  in 492 posynomial inequalities.
Solving took 0.0222 seconds.
Solved cost was 6.965.

GP Solve 11
Using solver 'mosek_conif'
 for 244 free variables
  in 492 posynomial inequalities.
Solving took 0.025 seconds.
Solved cost was 6.96.

GP Solve 12
Using solver 'mosek_conif'
 for 244 free variables
  in 492 posynomial inequalities.
Solving took 0.025 seconds.
Solved cost was 6.958.

GP Solve 13
Using solver 'mosek_conif'
 for 244 free variables
  in 492 posynomial inequalities.
Solving took 0.0246 seconds.
Solved cost was 6.957.

Solving took 0.526 seconds and 13 GP solves.

----------------------------------------------------------------------
Ran 1 test in 0.705s

OK

Generating XML reports...
Cloning into 'solar'...
Requirement already satisfied: pandas in /jenkins/workspace/CE_gpkit_PR_research_models/buildnode/reynolds/optimizer/mosek/venv_jenkins/lib/python3.8/site-packages (1.4.1)
Requirement already satisfied: pytz>=2020.1 in /jenkins/workspace/CE_gpkit_PR_research_models/buildnode/reynolds/optimizer/mosek/venv_jenkins/lib/python3.8/site-packages (from pandas) (2021.3)
Requirement already satisfied: numpy>=1.18.5 in /jenkins/workspace/CE_gpkit_PR_research_models/buildnode/reynolds/optimizer/mosek/venv_jenkins/lib/python3.8/site-packages (from pandas) (1.22.2)
Requirement already satisfied: python-dateutil>=2.8.1 in /jenkins/workspace/CE_gpkit_PR_research_models/buildnode/reynolds/optimizer/mosek/venv_jenkins/lib/python3.8/site-packages (from pandas) (2.8.2)
Requirement already satisfied: six>=1.5 in /jenkins/workspace/CE_gpkit_PR_research_models/buildnode/reynolds/optimizer/mosek/venv_jenkins/lib/python3.8/site-packages (from python-dateutil>=2.8.1->pandas) (1.16.0)
Collecting git+https://github.com/convexengineering/gpfit.git
  Cloning https://github.com/convexengineering/gpfit.git to /tmp/pip-req-build-fh8dgta0
  Running command git clone --filter=blob:none --quiet https://github.com/convexengineering/gpfit.git /tmp/pip-req-build-fh8dgta0
  Resolved https://github.com/convexengineering/gpfit.git to commit 3c8025f12ba5360fdeb71c270e55d4c93e1676fd
  Preparing metadata (setup.py): started
  Preparing metadata (setup.py): finished with status 'done'
Requirement already satisfied: gpkit in /jenkins/workspace/CE_gpkit_PR_research_models/buildnode/reynolds/optimizer/mosek (from gpfit==0.2.0) (1.1.1)
Requirement already satisfied: matplotlib>=3.3.2 in /jenkins/workspace/CE_gpkit_PR_research_models/buildnode/reynolds/optimizer/mosek/venv_jenkins/lib/python3.8/site-packages (from gpfit==0.2.0) (3.5.1)
Requirement already satisfied: numpy in /jenkins/workspace/CE_gpkit_PR_research_models/buildnode/reynolds/optimizer/mosek/venv_jenkins/lib/python3.8/site-packages (from gpfit==0.2.0) (1.22.2)
Requirement already satisfied: pytest-mpl>=0.13 in /jenkins/workspace/CE_gpkit_PR_research_models/buildnode/reynolds/optimizer/mosek/venv_jenkins/lib/python3.8/site-packages (from gpfit==0.2.0) (0.14.0)
Requirement already satisfied: pytest>=6.2.5 in /jenkins/workspace/CE_gpkit_PR_research_models/buildnode/reynolds/optimizer/mosek/venv_jenkins/lib/python3.8/site-packages (from gpfit==0.2.0) (7.0.1)
Requirement already satisfied: scipy in /jenkins/workspace/CE_gpkit_PR_research_models/buildnode/reynolds/optimizer/mosek/venv_jenkins/lib/python3.8/site-packages (from gpfit==0.2.0) (1.8.0)
Requirement already satisfied: fonttools>=4.22.0 in /jenkins/workspace/CE_gpkit_PR_research_models/buildnode/reynolds/optimizer/mosek/venv_jenkins/lib/python3.8/site-packages (from matplotlib>=3.3.2->gpfit==0.2.0) (4.29.1)
Requirement already satisfied: kiwisolver>=1.0.1 in /jenkins/workspace/CE_gpkit_PR_research_models/buildnode/reynolds/optimizer/mosek/venv_jenkins/lib/python3.8/site-packages (from matplotlib>=3.3.2->gpfit==0.2.0) (1.3.2)
Requirement already satisfied: cycler>=0.10 in /jenkins/workspace/CE_gpkit_PR_research_models/buildnode/reynolds/optimizer/mosek/venv_jenkins/lib/python3.8/site-packages (from matplotlib>=3.3.2->gpfit==0.2.0) (0.11.0)
Requirement already satisfied: pillow>=6.2.0 in /jenkins/workspace/CE_gpkit_PR_research_models/buildnode/reynolds/optimizer/mosek/venv_jenkins/lib/python3.8/site-packages (from matplotlib>=3.3.2->gpfit==0.2.0) (9.0.1)
Requirement already satisfied: pyparsing>=2.2.1 in /jenkins/workspace/CE_gpkit_PR_research_models/buildnode/reynolds/optimizer/mosek/venv_jenkins/lib/python3.8/site-packages (from matplotlib>=3.3.2->gpfit==0.2.0) (3.0.7)
Requirement already satisfied: python-dateutil>=2.7 in /jenkins/workspace/CE_gpkit_PR_research_models/buildnode/reynolds/optimizer/mosek/venv_jenkins/lib/python3.8/site-packages (from matplotlib>=3.3.2->gpfit==0.2.0) (2.8.2)
Requirement already satisfied: packaging>=20.0 in /jenkins/workspace/CE_gpkit_PR_research_models/buildnode/reynolds/optimizer/mosek/venv_jenkins/lib/python3.8/site-packages (from matplotlib>=3.3.2->gpfit==0.2.0) (21.3)
Requirement already satisfied: iniconfig in /jenkins/workspace/CE_gpkit_PR_research_models/buildnode/reynolds/optimizer/mosek/venv_jenkins/lib/python3.8/site-packages (from pytest>=6.2.5->gpfit==0.2.0) (1.1.1)
Requirement already satisfied: py>=1.8.2 in /jenkins/workspace/CE_gpkit_PR_research_models/buildnode/reynolds/optimizer/mosek/venv_jenkins/lib/python3.8/site-packages (from pytest>=6.2.5->gpfit==0.2.0) (1.11.0)
Requirement already satisfied: attrs>=19.2.0 in /jenkins/workspace/CE_gpkit_PR_research_models/buildnode/reynolds/optimizer/mosek/venv_jenkins/lib/python3.8/site-packages (from pytest>=6.2.5->gpfit==0.2.0) (21.4.0)
Requirement already satisfied: tomli>=1.0.0 in /jenkins/workspace/CE_gpkit_PR_research_models/buildnode/reynolds/optimizer/mosek/venv_jenkins/lib/python3.8/site-packages (from pytest>=6.2.5->gpfit==0.2.0) (2.0.1)
Requirement already satisfied: pluggy<2.0,>=0.12 in /jenkins/workspace/CE_gpkit_PR_research_models/buildnode/reynolds/optimizer/mosek/venv_jenkins/lib/python3.8/site-packages (from pytest>=6.2.5->gpfit==0.2.0) (1.0.0)
Requirement already satisfied: Jinja2 in /jenkins/workspace/CE_gpkit_PR_research_models/buildnode/reynolds/optimizer/mosek/venv_jenkins/lib/python3.8/site-packages (from pytest-mpl>=0.13->gpfit==0.2.0) (3.0.3)
Requirement already satisfied: adce in /jenkins/workspace/CE_gpkit_PR_research_models/buildnode/reynolds/optimizer/mosek/venv_jenkins/lib/python3.8/site-packages (from gpkit->gpfit==0.2.0) (1.3.3.2)
Requirement already satisfied: cvxopt>=1.1.8 in /jenkins/workspace/CE_gpkit_PR_research_models/buildnode/reynolds/optimizer/mosek/venv_jenkins/lib/python3.8/site-packages (from gpkit->gpfit==0.2.0) (1.2.7)
Requirement already satisfied: pint>=0.8.1 in /jenkins/workspace/CE_gpkit_PR_research_models/buildnode/reynolds/optimizer/mosek/venv_jenkins/lib/python3.8/site-packages (from gpkit->gpfit==0.2.0) (0.18)
Requirement already satisfied: plotly in /jenkins/workspace/CE_gpkit_PR_research_models/buildnode/reynolds/optimizer/mosek/venv_jenkins/lib/python3.8/site-packages (from gpkit->gpfit==0.2.0) (5.6.0)
Requirement already satisfied: six>=1.5 in /jenkins/workspace/CE_gpkit_PR_research_models/buildnode/reynolds/optimizer/mosek/venv_jenkins/lib/python3.8/site-packages (from python-dateutil>=2.7->matplotlib>=3.3.2->gpfit==0.2.0) (1.16.0)
Requirement already satisfied: MarkupSafe>=2.0 in /jenkins/workspace/CE_gpkit_PR_research_models/buildnode/reynolds/optimizer/mosek/venv_jenkins/lib/python3.8/site-packages (from Jinja2->pytest-mpl>=0.13->gpfit==0.2.0) (2.1.0)
Requirement already satisfied: tenacity>=6.2.0 in /jenkins/workspace/CE_gpkit_PR_research_models/buildnode/reynolds/optimizer/mosek/venv_jenkins/lib/python3.8/site-packages (from plotly->gpkit->gpfit==0.2.0) (8.0.1)
Collecting git+https://github.com/convexengineering/gassolar.git
  Cloning https://github.com/convexengineering/gassolar.git to /tmp/pip-req-build-73k4hhlo
  Running command git clone --filter=blob:none --quiet https://github.com/convexengineering/gassolar.git /tmp/pip-req-build-73k4hhlo
  Resolved https://github.com/convexengineering/gassolar.git to commit 90c91cc6b980b44bedaf87ad004654b67a11431c
  Preparing metadata (setup.py): started
  Preparing metadata (setup.py): finished with status 'done'
Requirement already satisfied: gpfit in /jenkins/workspace/CE_gpkit_PR_research_models/buildnode/reynolds/optimizer/mosek/venv_jenkins/lib/python3.8/site-packages (from gassolar==0.0.0.0) (0.2.0)
Requirement already satisfied: gpkit in /jenkins/workspace/CE_gpkit_PR_research_models/buildnode/reynolds/optimizer/mosek (from gassolar==0.0.0.0) (1.1.1)
Requirement already satisfied: numpy in /jenkins/workspace/CE_gpkit_PR_research_models/buildnode/reynolds/optimizer/mosek/venv_jenkins/lib/python3.8/site-packages (from gassolar==0.0.0.0) (1.22.2)
Requirement already satisfied: pandas in /jenkins/workspace/CE_gpkit_PR_research_models/buildnode/reynolds/optimizer/mosek/venv_jenkins/lib/python3.8/site-packages (from gassolar==0.0.0.0) (1.4.1)
Requirement already satisfied: scipy in /jenkins/workspace/CE_gpkit_PR_research_models/buildnode/reynolds/optimizer/mosek/venv_jenkins/lib/python3.8/site-packages (from gassolar==0.0.0.0) (1.8.0)
Requirement already satisfied: pytest-mpl>=0.13 in /jenkins/workspace/CE_gpkit_PR_research_models/buildnode/reynolds/optimizer/mosek/venv_jenkins/lib/python3.8/site-packages (from gpfit->gassolar==0.0.0.0) (0.14.0)
Requirement already satisfied: pytest>=6.2.5 in /jenkins/workspace/CE_gpkit_PR_research_models/buildnode/reynolds/optimizer/mosek/venv_jenkins/lib/python3.8/site-packages (from gpfit->gassolar==0.0.0.0) (7.0.1)
Requirement already satisfied: matplotlib>=3.3.2 in /jenkins/workspace/CE_gpkit_PR_research_models/buildnode/reynolds/optimizer/mosek/venv_jenkins/lib/python3.8/site-packages (from gpfit->gassolar==0.0.0.0) (3.5.1)
Requirement already satisfied: adce in /jenkins/workspace/CE_gpkit_PR_research_models/buildnode/reynolds/optimizer/mosek/venv_jenkins/lib/python3.8/site-packages (from gpkit->gassolar==0.0.0.0) (1.3.3.2)
Requirement already satisfied: cvxopt>=1.1.8 in /jenkins/workspace/CE_gpkit_PR_research_models/buildnode/reynolds/optimizer/mosek/venv_jenkins/lib/python3.8/site-packages (from gpkit->gassolar==0.0.0.0) (1.2.7)
Requirement already satisfied: pint>=0.8.1 in /jenkins/workspace/CE_gpkit_PR_research_models/buildnode/reynolds/optimizer/mosek/venv_jenkins/lib/python3.8/site-packages (from gpkit->gassolar==0.0.0.0) (0.18)
Requirement already satisfied: plotly in /jenkins/workspace/CE_gpkit_PR_research_models/buildnode/reynolds/optimizer/mosek/venv_jenkins/lib/python3.8/site-packages (from gpkit->gassolar==0.0.0.0) (5.6.0)
Requirement already satisfied: pytz>=2020.1 in /jenkins/workspace/CE_gpkit_PR_research_models/buildnode/reynolds/optimizer/mosek/venv_jenkins/lib/python3.8/site-packages (from pandas->gassolar==0.0.0.0) (2021.3)
Requirement already satisfied: python-dateutil>=2.8.1 in /jenkins/workspace/CE_gpkit_PR_research_models/buildnode/reynolds/optimizer/mosek/venv_jenkins/lib/python3.8/site-packages (from pandas->gassolar==0.0.0.0) (2.8.2)
Requirement already satisfied: fonttools>=4.22.0 in /jenkins/workspace/CE_gpkit_PR_research_models/buildnode/reynolds/optimizer/mosek/venv_jenkins/lib/python3.8/site-packages (from matplotlib>=3.3.2->gpfit->gassolar==0.0.0.0) (4.29.1)
Requirement already satisfied: kiwisolver>=1.0.1 in /jenkins/workspace/CE_gpkit_PR_research_models/buildnode/reynolds/optimizer/mosek/venv_jenkins/lib/python3.8/site-packages (from matplotlib>=3.3.2->gpfit->gassolar==0.0.0.0) (1.3.2)
Requirement already satisfied: cycler>=0.10 in /jenkins/workspace/CE_gpkit_PR_research_models/buildnode/reynolds/optimizer/mosek/venv_jenkins/lib/python3.8/site-packages (from matplotlib>=3.3.2->gpfit->gassolar==0.0.0.0) (0.11.0)
Requirement already satisfied: pillow>=6.2.0 in /jenkins/workspace/CE_gpkit_PR_research_models/buildnode/reynolds/optimizer/mosek/venv_jenkins/lib/python3.8/site-packages (from matplotlib>=3.3.2->gpfit->gassolar==0.0.0.0) (9.0.1)
Requirement already satisfied: pyparsing>=2.2.1 in /jenkins/workspace/CE_gpkit_PR_research_models/buildnode/reynolds/optimizer/mosek/venv_jenkins/lib/python3.8/site-packages (from matplotlib>=3.3.2->gpfit->gassolar==0.0.0.0) (3.0.7)
Requirement already satisfied: packaging>=20.0 in /jenkins/workspace/CE_gpkit_PR_research_models/buildnode/reynolds/optimizer/mosek/venv_jenkins/lib/python3.8/site-packages (from matplotlib>=3.3.2->gpfit->gassolar==0.0.0.0) (21.3)
Requirement already satisfied: iniconfig in /jenkins/workspace/CE_gpkit_PR_research_models/buildnode/reynolds/optimizer/mosek/venv_jenkins/lib/python3.8/site-packages (from pytest>=6.2.5->gpfit->gassolar==0.0.0.0) (1.1.1)
Requirement already satisfied: py>=1.8.2 in /jenkins/workspace/CE_gpkit_PR_research_models/buildnode/reynolds/optimizer/mosek/venv_jenkins/lib/python3.8/site-packages (from pytest>=6.2.5->gpfit->gassolar==0.0.0.0) (1.11.0)
Requirement already satisfied: attrs>=19.2.0 in /jenkins/workspace/CE_gpkit_PR_research_models/buildnode/reynolds/optimizer/mosek/venv_jenkins/lib/python3.8/site-packages (from pytest>=6.2.5->gpfit->gassolar==0.0.0.0) (21.4.0)
Requirement already satisfied: tomli>=1.0.0 in /jenkins/workspace/CE_gpkit_PR_research_models/buildnode/reynolds/optimizer/mosek/venv_jenkins/lib/python3.8/site-packages (from pytest>=6.2.5->gpfit->gassolar==0.0.0.0) (2.0.1)
Requirement already satisfied: pluggy<2.0,>=0.12 in /jenkins/workspace/CE_gpkit_PR_research_models/buildnode/reynolds/optimizer/mosek/venv_jenkins/lib/python3.8/site-packages (from pytest>=6.2.5->gpfit->gassolar==0.0.0.0) (1.0.0)
Requirement already satisfied: Jinja2 in /jenkins/workspace/CE_gpkit_PR_research_models/buildnode/reynolds/optimizer/mosek/venv_jenkins/lib/python3.8/site-packages (from pytest-mpl>=0.13->gpfit->gassolar==0.0.0.0) (3.0.3)
Requirement already satisfied: six>=1.5 in /jenkins/workspace/CE_gpkit_PR_research_models/buildnode/reynolds/optimizer/mosek/venv_jenkins/lib/python3.8/site-packages (from python-dateutil>=2.8.1->pandas->gassolar==0.0.0.0) (1.16.0)
Requirement already satisfied: tenacity>=6.2.0 in /jenkins/workspace/CE_gpkit_PR_research_models/buildnode/reynolds/optimizer/mosek/venv_jenkins/lib/python3.8/site-packages (from plotly->gpkit->gassolar==0.0.0.0) (8.0.1)
Requirement already satisfied: MarkupSafe>=2.0 in /jenkins/workspace/CE_gpkit_PR_research_models/buildnode/reynolds/optimizer/mosek/venv_jenkins/lib/python3.8/site-packages (from Jinja2->pytest-mpl>=0.13->gpfit->gassolar==0.0.0.0) (2.1.0)
Processing /jenkins/workspace/CE_gpkit_PR_research_models/buildnode/reynolds/optimizer/mosek/solar
  Preparing metadata (setup.py): started
  Preparing metadata (setup.py): finished with status 'done'
Requirement already satisfied: gpfit in /jenkins/workspace/CE_gpkit_PR_research_models/buildnode/reynolds/optimizer/mosek/venv_jenkins/lib/python3.8/site-packages (from solar==0.0.0.0) (0.2.0)
Requirement already satisfied: gpkit in /jenkins/workspace/CE_gpkit_PR_research_models/buildnode/reynolds/optimizer/mosek (from solar==0.0.0.0) (1.1.1)
Requirement already satisfied: gpkitmodels in /jenkins/workspace/CE_gpkit_PR_research_models/buildnode/reynolds/optimizer/mosek/gplibrary (from solar==0.0.0.0) (0.0.0.0)
Requirement already satisfied: numpy in /jenkins/workspace/CE_gpkit_PR_research_models/buildnode/reynolds/optimizer/mosek/venv_jenkins/lib/python3.8/site-packages (from solar==0.0.0.0) (1.22.2)
Requirement already satisfied: pandas in /jenkins/workspace/CE_gpkit_PR_research_models/buildnode/reynolds/optimizer/mosek/venv_jenkins/lib/python3.8/site-packages (from solar==0.0.0.0) (1.4.1)
Requirement already satisfied: scipy in /jenkins/workspace/CE_gpkit_PR_research_models/buildnode/reynolds/optimizer/mosek/venv_jenkins/lib/python3.8/site-packages (from solar==0.0.0.0) (1.8.0)
Requirement already satisfied: pytest-mpl>=0.13 in /jenkins/workspace/CE_gpkit_PR_research_models/buildnode/reynolds/optimizer/mosek/venv_jenkins/lib/python3.8/site-packages (from gpfit->solar==0.0.0.0) (0.14.0)
Requirement already satisfied: pytest>=6.2.5 in /jenkins/workspace/CE_gpkit_PR_research_models/buildnode/reynolds/optimizer/mosek/venv_jenkins/lib/python3.8/site-packages (from gpfit->solar==0.0.0.0) (7.0.1)
Requirement already satisfied: matplotlib>=3.3.2 in /jenkins/workspace/CE_gpkit_PR_research_models/buildnode/reynolds/optimizer/mosek/venv_jenkins/lib/python3.8/site-packages (from gpfit->solar==0.0.0.0) (3.5.1)
Requirement already satisfied: adce in /jenkins/workspace/CE_gpkit_PR_research_models/buildnode/reynolds/optimizer/mosek/venv_jenkins/lib/python3.8/site-packages (from gpkit->solar==0.0.0.0) (1.3.3.2)
Requirement already satisfied: cvxopt>=1.1.8 in /jenkins/workspace/CE_gpkit_PR_research_models/buildnode/reynolds/optimizer/mosek/venv_jenkins/lib/python3.8/site-packages (from gpkit->solar==0.0.0.0) (1.2.7)
Requirement already satisfied: pint>=0.8.1 in /jenkins/workspace/CE_gpkit_PR_research_models/buildnode/reynolds/optimizer/mosek/venv_jenkins/lib/python3.8/site-packages (from gpkit->solar==0.0.0.0) (0.18)
Requirement already satisfied: plotly in /jenkins/workspace/CE_gpkit_PR_research_models/buildnode/reynolds/optimizer/mosek/venv_jenkins/lib/python3.8/site-packages (from gpkit->solar==0.0.0.0) (5.6.0)
Requirement already satisfied: future in /jenkins/workspace/CE_gpkit_PR_research_models/buildnode/reynolds/optimizer/mosek/venv_jenkins/lib/python3.8/site-packages (from gpkitmodels->solar==0.0.0.0) (0.18.2)
Requirement already satisfied: pytz>=2020.1 in /jenkins/workspace/CE_gpkit_PR_research_models/buildnode/reynolds/optimizer/mosek/venv_jenkins/lib/python3.8/site-packages (from pandas->solar==0.0.0.0) (2021.3)
Requirement already satisfied: python-dateutil>=2.8.1 in /jenkins/workspace/CE_gpkit_PR_research_models/buildnode/reynolds/optimizer/mosek/venv_jenkins/lib/python3.8/site-packages (from pandas->solar==0.0.0.0) (2.8.2)
Requirement already satisfied: fonttools>=4.22.0 in /jenkins/workspace/CE_gpkit_PR_research_models/buildnode/reynolds/optimizer/mosek/venv_jenkins/lib/python3.8/site-packages (from matplotlib>=3.3.2->gpfit->solar==0.0.0.0) (4.29.1)
Requirement already satisfied: kiwisolver>=1.0.1 in /jenkins/workspace/CE_gpkit_PR_research_models/buildnode/reynolds/optimizer/mosek/venv_jenkins/lib/python3.8/site-packages (from matplotlib>=3.3.2->gpfit->solar==0.0.0.0) (1.3.2)
Requirement already satisfied: cycler>=0.10 in /jenkins/workspace/CE_gpkit_PR_research_models/buildnode/reynolds/optimizer/mosek/venv_jenkins/lib/python3.8/site-packages (from matplotlib>=3.3.2->gpfit->solar==0.0.0.0) (0.11.0)
Requirement already satisfied: pillow>=6.2.0 in /jenkins/workspace/CE_gpkit_PR_research_models/buildnode/reynolds/optimizer/mosek/venv_jenkins/lib/python3.8/site-packages (from matplotlib>=3.3.2->gpfit->solar==0.0.0.0) (9.0.1)
Requirement already satisfied: pyparsing>=2.2.1 in /jenkins/workspace/CE_gpkit_PR_research_models/buildnode/reynolds/optimizer/mosek/venv_jenkins/lib/python3.8/site-packages (from matplotlib>=3.3.2->gpfit->solar==0.0.0.0) (3.0.7)
Requirement already satisfied: packaging>=20.0 in /jenkins/workspace/CE_gpkit_PR_research_models/buildnode/reynolds/optimizer/mosek/venv_jenkins/lib/python3.8/site-packages (from matplotlib>=3.3.2->gpfit->solar==0.0.0.0) (21.3)
Requirement already satisfied: iniconfig in /jenkins/workspace/CE_gpkit_PR_research_models/buildnode/reynolds/optimizer/mosek/venv_jenkins/lib/python3.8/site-packages (from pytest>=6.2.5->gpfit->solar==0.0.0.0) (1.1.1)
Requirement already satisfied: py>=1.8.2 in /jenkins/workspace/CE_gpkit_PR_research_models/buildnode/reynolds/optimizer/mosek/venv_jenkins/lib/python3.8/site-packages (from pytest>=6.2.5->gpfit->solar==0.0.0.0) (1.11.0)
Requirement already satisfied: attrs>=19.2.0 in /jenkins/workspace/CE_gpkit_PR_research_models/buildnode/reynolds/optimizer/mosek/venv_jenkins/lib/python3.8/site-packages (from pytest>=6.2.5->gpfit->solar==0.0.0.0) (21.4.0)
Requirement already satisfied: tomli>=1.0.0 in /jenkins/workspace/CE_gpkit_PR_research_models/buildnode/reynolds/optimizer/mosek/venv_jenkins/lib/python3.8/site-packages (from pytest>=6.2.5->gpfit->solar==0.0.0.0) (2.0.1)
Requirement already satisfied: pluggy<2.0,>=0.12 in /jenkins/workspace/CE_gpkit_PR_research_models/buildnode/reynolds/optimizer/mosek/venv_jenkins/lib/python3.8/site-packages (from pytest>=6.2.5->gpfit->solar==0.0.0.0) (1.0.0)
Requirement already satisfied: Jinja2 in /jenkins/workspace/CE_gpkit_PR_research_models/buildnode/reynolds/optimizer/mosek/venv_jenkins/lib/python3.8/site-packages (from pytest-mpl>=0.13->gpfit->solar==0.0.0.0) (3.0.3)
Requirement already satisfied: six>=1.5 in /jenkins/workspace/CE_gpkit_PR_research_models/buildnode/reynolds/optimizer/mosek/venv_jenkins/lib/python3.8/site-packages (from python-dateutil>=2.8.1->pandas->solar==0.0.0.0) (1.16.0)
Requirement already satisfied: tenacity>=6.2.0 in /jenkins/workspace/CE_gpkit_PR_research_models/buildnode/reynolds/optimizer/mosek/venv_jenkins/lib/python3.8/site-packages (from plotly->gpkit->solar==0.0.0.0) (8.0.1)
Requirement already satisfied: MarkupSafe>=2.0 in /jenkins/workspace/CE_gpkit_PR_research_models/buildnode/reynolds/optimizer/mosek/venv_jenkins/lib/python3.8/site-packages (from Jinja2->pytest-mpl>=0.13->gpfit->solar==0.0.0.0) (2.1.0)
Building wheels for collected packages: solar
  Building wheel for solar (setup.py): started
  Building wheel for solar (setup.py): finished with status 'done'
  Created wheel for solar: filename=solar-0.0.0.0-py3-none-any.whl size=14840 sha256=a0932b9f94a448226a38e325cb61c4c83b2c7588f223eecd15537bd172718b2d
  Stored in directory: /tmp/pip-ephem-wheel-cache-i7nxbt0f/wheels/f4/3f/86/d0d77b1c7fe2951a84fdcd8c6b788c12b2e6af60fdd6ec3804
Successfully built solar
Installing collected packages: solar
Successfully installed solar-0.0.0.0
adding test for 'solar/sens_chart.py'
adding test for 'solar/season.py'
adding test for 'solar/npod_trade.py'

Running tests...
----------------------------------------------------------------------
/jenkins/workspace/CE_gpkit_PR_research_models/buildnode/reynolds/optimizer/mosek/solar/solar/solar.py:127: SyntaxWarning: "is not" with a literal. Did you mean "!="?
  if static.Npod is not 0:
/jenkins/workspace/CE_gpkit_PR_research_models/buildnode/reynolds/optimizer/mosek/solar/solar/solar.py:276: SyntaxWarning: "is not" with a literal. Did you mean "!="?
  if self.Npod is not 0:
/jenkins/workspace/CE_gpkit_PR_research_models/buildnode/reynolds/optimizer/mosek/solar/solar/solar.py:469: SyntaxWarning: "is not" with a literal. Did you mean "!="?
  if aircraft.Npod is not 0 and aircraft.Npod is not 1:
/jenkins/workspace/CE_gpkit_PR_research_models/buildnode/reynolds/optimizer/mosek/solar/solar/solar.py:469: SyntaxWarning: "is not" with a literal. Did you mean "!="?
  if aircraft.Npod is not 0 and aircraft.Npod is not 1:
/jenkins/workspace/CE_gpkit_PR_research_models/buildnode/reynolds/optimizer/mosek/solar/solar/solar.py:524: SyntaxWarning: "is not" with a literal. Did you mean "!="?
  if self.aircraft.Npod is not 0 and self.aircraft.Npod is not 1:
/jenkins/workspace/CE_gpkit_PR_research_models/buildnode/reynolds/optimizer/mosek/solar/solar/solar.py:524: SyntaxWarning: "is not" with a literal. Did you mean "!="?
  if self.aircraft.Npod is not 0 and self.aircraft.Npod is not 1:
E
N=1

N=1
EEEEE
======================================================================
ERROR [0.523s]: test_solar_npod_trade_py_mosek_cli (gpkit.tests.from_paths.TestFiles)
----------------------------------------------------------------------
Traceback (most recent call last):
  File "/jenkins/workspace/CE_gpkit_PR_research_models/buildnode/reynolds/optimizer/mosek/gpkit/tests/helpers.py", line 55, in test
    testfn(name, import_dict, path)(self)
  File "/jenkins/workspace/CE_gpkit_PR_research_models/buildnode/reynolds/optimizer/mosek/gpkit/tests/from_paths.py", line 48, in <lambda>
    lambda self: getattr(self, name)()))  # pylint:disable=undefined-variable
  File "/jenkins/workspace/CE_gpkit_PR_research_models/buildnode/reynolds/optimizer/mosek/gpkit/tests/from_paths.py", line 37, in test_fn
    mod.test()
  File "/jenkins/workspace/CE_gpkit_PR_research_models/buildnode/reynolds/optimizer/mosek/solar/solar/npod_trade.py", line 91, in test
    pods(Nplot=100)
  File "/jenkins/workspace/CE_gpkit_PR_research_models/buildnode/reynolds/optimizer/mosek/solar/solar/npod_trade.py", line 16, in pods
    from solar import Mission, Aircraft
  File "/jenkins/workspace/CE_gpkit_PR_research_models/buildnode/reynolds/optimizer/mosek/solar/solar/solar.py", line 9, in <module>
    from ad.admath import exp
ModuleNotFoundError: No module named 'ad'

======================================================================
ERROR [0.001s]: test_solar_npod_trade_py_mosek_conif (gpkit.tests.from_paths.TestFiles)
----------------------------------------------------------------------
Traceback (most recent call last):
  File "/jenkins/workspace/CE_gpkit_PR_research_models/buildnode/reynolds/optimizer/mosek/gpkit/tests/helpers.py", line 55, in test
    testfn(name, import_dict, path)(self)
  File "/jenkins/workspace/CE_gpkit_PR_research_models/buildnode/reynolds/optimizer/mosek/gpkit/tests/from_paths.py", line 48, in <lambda>
    lambda self: getattr(self, name)()))  # pylint:disable=undefined-variable
  File "/jenkins/workspace/CE_gpkit_PR_research_models/buildnode/reynolds/optimizer/mosek/gpkit/tests/from_paths.py", line 37, in test_fn
    mod.test()
  File "/jenkins/workspace/CE_gpkit_PR_research_models/buildnode/reynolds/optimizer/mosek/solar/solar/npod_trade.py", line 91, in test
    pods(Nplot=100)
  File "/jenkins/workspace/CE_gpkit_PR_research_models/buildnode/reynolds/optimizer/mosek/solar/solar/npod_trade.py", line 16, in pods
    from solar import Mission, Aircraft
  File "/jenkins/workspace/CE_gpkit_PR_research_models/buildnode/reynolds/optimizer/mosek/solar/solar/solar.py", line 9, in <module>
    from ad.admath import exp
ModuleNotFoundError: No module named 'ad'

======================================================================
ERROR [0.002s]: test_solar_season_py_mosek_cli (gpkit.tests.from_paths.TestFiles)
----------------------------------------------------------------------
Traceback (most recent call last):
  File "/jenkins/workspace/CE_gpkit_PR_research_models/buildnode/reynolds/optimizer/mosek/gpkit/tests/helpers.py", line 55, in test
    testfn(name, import_dict, path)(self)
  File "/jenkins/workspace/CE_gpkit_PR_research_models/buildnode/reynolds/optimizer/mosek/gpkit/tests/from_paths.py", line 48, in <lambda>
    lambda self: getattr(self, name)()))  # pylint:disable=undefined-variable
  File "/jenkins/workspace/CE_gpkit_PR_research_models/buildnode/reynolds/optimizer/mosek/gpkit/tests/from_paths.py", line 34, in test_fn
    mod = __import__(os.path.basename(path)[:-3])
  File "/jenkins/workspace/CE_gpkit_PR_research_models/buildnode/reynolds/optimizer/mosek/solar/solar/season.py", line 6, in <module>
    from solar import Mission, Aircraft
  File "/jenkins/workspace/CE_gpkit_PR_research_models/buildnode/reynolds/optimizer/mosek/solar/solar/solar.py", line 9, in <module>
    from ad.admath import exp
ModuleNotFoundError: No module named 'ad'

======================================================================
ERROR [0.001s]: test_solar_season_py_mosek_conif (gpkit.tests.from_paths.TestFiles)
----------------------------------------------------------------------
Traceback (most recent call last):
  File "/jenkins/workspace/CE_gpkit_PR_research_models/buildnode/reynolds/optimizer/mosek/gpkit/tests/helpers.py", line 55, in test
    testfn(name, import_dict, path)(self)
  File "/jenkins/workspace/CE_gpkit_PR_research_models/buildnode/reynolds/optimizer/mosek/gpkit/tests/from_paths.py", line 48, in <lambda>
    lambda self: getattr(self, name)()))  # pylint:disable=undefined-variable
  File "/jenkins/workspace/CE_gpkit_PR_research_models/buildnode/reynolds/optimizer/mosek/gpkit/tests/from_paths.py", line 34, in test_fn
    mod = __import__(os.path.basename(path)[:-3])
  File "/jenkins/workspace/CE_gpkit_PR_research_models/buildnode/reynolds/optimizer/mosek/solar/solar/season.py", line 6, in <module>
    from solar import Mission, Aircraft
  File "/jenkins/workspace/CE_gpkit_PR_research_models/buildnode/reynolds/optimizer/mosek/solar/solar/solar.py", line 9, in <module>
    from ad.admath import exp
ModuleNotFoundError: No module named 'ad'

======================================================================
ERROR [0.002s]: test_solar_sens_chart_py_mosek_cli (gpkit.tests.from_paths.TestFiles)
----------------------------------------------------------------------
Traceback (most recent call last):
  File "/jenkins/workspace/CE_gpkit_PR_research_models/buildnode/reynolds/optimizer/mosek/gpkit/tests/helpers.py", line 55, in test
    testfn(name, import_dict, path)(self)
  File "/jenkins/workspace/CE_gpkit_PR_research_models/buildnode/reynolds/optimizer/mosek/gpkit/tests/from_paths.py", line 48, in <lambda>
    lambda self: getattr(self, name)()))  # pylint:disable=undefined-variable
  File "/jenkins/workspace/CE_gpkit_PR_research_models/buildnode/reynolds/optimizer/mosek/gpkit/tests/from_paths.py", line 34, in test_fn
    mod = __import__(os.path.basename(path)[:-3])
  File "/jenkins/workspace/CE_gpkit_PR_research_models/buildnode/reynolds/optimizer/mosek/solar/solar/sens_chart.py", line 7, in <module>
    from solar import Mission, Aircraft
  File "/jenkins/workspace/CE_gpkit_PR_research_models/buildnode/reynolds/optimizer/mosek/solar/solar/solar.py", line 9, in <module>
    from ad.admath import exp
ModuleNotFoundError: No module named 'ad'

======================================================================
ERROR [0.001s]: test_solar_sens_chart_py_mosek_conif (gpkit.tests.from_paths.TestFiles)
----------------------------------------------------------------------
Traceback (most recent call last):
  File "/jenkins/workspace/CE_gpkit_PR_research_models/buildnode/reynolds/optimizer/mosek/gpkit/tests/helpers.py", line 55, in test
    testfn(name, import_dict, path)(self)
  File "/jenkins/workspace/CE_gpkit_PR_research_models/buildnode/reynolds/optimizer/mosek/gpkit/tests/from_paths.py", line 48, in <lambda>
    lambda self: getattr(self, name)()))  # pylint:disable=undefined-variable
  File "/jenkins/workspace/CE_gpkit_PR_research_models/buildnode/reynolds/optimizer/mosek/gpkit/tests/from_paths.py", line 34, in test_fn
    mod = __import__(os.path.basename(path)[:-3])
  File "/jenkins/workspace/CE_gpkit_PR_research_models/buildnode/reynolds/optimizer/mosek/solar/solar/sens_chart.py", line 7, in <module>
    from solar import Mission, Aircraft
  File "/jenkins/workspace/CE_gpkit_PR_research_models/buildnode/reynolds/optimizer/mosek/solar/solar/solar.py", line 9, in <module>
    from ad.admath import exp
ModuleNotFoundError: No module named 'ad'

----------------------------------------------------------------------
Ran 6 tests in 0.531s

FAILED (errors=6)

Generating XML reports...
fatal: destination path 'gplibrary' already exists and is not an empty directory.
fatal: destination path 'gplibrary' already exists and is not an empty directory.
fatal: destination path 'gplibrary' already exists and is not an empty directory.
fatal: destination path 'gplibrary' already exists and is not an empty directory.
fatal: destination path 'gplibrary' already exists and is not an empty directory.
Requirement already satisfied: pandas in /jenkins/workspace/CE_gpkit_PR_research_models/buildnode/reynolds/optimizer/mosek/venv_jenkins/lib/python3.8/site-packages (1.4.1)
Requirement already satisfied: pytz>=2020.1 in /jenkins/workspace/CE_gpkit_PR_research_models/buildnode/reynolds/optimizer/mosek/venv_jenkins/lib/python3.8/site-packages (from pandas) (2021.3)
Requirement already satisfied: numpy>=1.18.5 in /jenkins/workspace/CE_gpkit_PR_research_models/buildnode/reynolds/optimizer/mosek/venv_jenkins/lib/python3.8/site-packages (from pandas) (1.22.2)
Requirement already satisfied: python-dateutil>=2.8.1 in /jenkins/workspace/CE_gpkit_PR_research_models/buildnode/reynolds/optimizer/mosek/venv_jenkins/lib/python3.8/site-packages (from pandas) (2.8.2)
Requirement already satisfied: six>=1.5 in /jenkins/workspace/CE_gpkit_PR_research_models/buildnode/reynolds/optimizer/mosek/venv_jenkins/lib/python3.8/site-packages (from python-dateutil>=2.8.1->pandas) (1.16.0)
Collecting git+https://github.com/hoburg/gpfit.git
  Cloning https://github.com/hoburg/gpfit.git to /tmp/pip-req-build-1frnnffg
  Running command git clone --filter=blob:none --quiet https://github.com/hoburg/gpfit.git /tmp/pip-req-build-1frnnffg
  Resolved https://github.com/hoburg/gpfit.git to commit 3c8025f12ba5360fdeb71c270e55d4c93e1676fd
  Preparing metadata (setup.py): started
  Preparing metadata (setup.py): finished with status 'done'
Requirement already satisfied: gpkit in /jenkins/workspace/CE_gpkit_PR_research_models/buildnode/reynolds/optimizer/mosek (from gpfit==0.2.0) (1.1.1)
Requirement already satisfied: matplotlib>=3.3.2 in /jenkins/workspace/CE_gpkit_PR_research_models/buildnode/reynolds/optimizer/mosek/venv_jenkins/lib/python3.8/site-packages (from gpfit==0.2.0) (3.5.1)
Requirement already satisfied: numpy in /jenkins/workspace/CE_gpkit_PR_research_models/buildnode/reynolds/optimizer/mosek/venv_jenkins/lib/python3.8/site-packages (from gpfit==0.2.0) (1.22.2)
Requirement already satisfied: pytest-mpl>=0.13 in /jenkins/workspace/CE_gpkit_PR_research_models/buildnode/reynolds/optimizer/mosek/venv_jenkins/lib/python3.8/site-packages (from gpfit==0.2.0) (0.14.0)
Requirement already satisfied: pytest>=6.2.5 in /jenkins/workspace/CE_gpkit_PR_research_models/buildnode/reynolds/optimizer/mosek/venv_jenkins/lib/python3.8/site-packages (from gpfit==0.2.0) (7.0.1)
Requirement already satisfied: scipy in /jenkins/workspace/CE_gpkit_PR_research_models/buildnode/reynolds/optimizer/mosek/venv_jenkins/lib/python3.8/site-packages (from gpfit==0.2.0) (1.8.0)
Requirement already satisfied: fonttools>=4.22.0 in /jenkins/workspace/CE_gpkit_PR_research_models/buildnode/reynolds/optimizer/mosek/venv_jenkins/lib/python3.8/site-packages (from matplotlib>=3.3.2->gpfit==0.2.0) (4.29.1)
Requirement already satisfied: kiwisolver>=1.0.1 in /jenkins/workspace/CE_gpkit_PR_research_models/buildnode/reynolds/optimizer/mosek/venv_jenkins/lib/python3.8/site-packages (from matplotlib>=3.3.2->gpfit==0.2.0) (1.3.2)
Requirement already satisfied: cycler>=0.10 in /jenkins/workspace/CE_gpkit_PR_research_models/buildnode/reynolds/optimizer/mosek/venv_jenkins/lib/python3.8/site-packages (from matplotlib>=3.3.2->gpfit==0.2.0) (0.11.0)
Requirement already satisfied: pillow>=6.2.0 in /jenkins/workspace/CE_gpkit_PR_research_models/buildnode/reynolds/optimizer/mosek/venv_jenkins/lib/python3.8/site-packages (from matplotlib>=3.3.2->gpfit==0.2.0) (9.0.1)
Requirement already satisfied: pyparsing>=2.2.1 in /jenkins/workspace/CE_gpkit_PR_research_models/buildnode/reynolds/optimizer/mosek/venv_jenkins/lib/python3.8/site-packages (from matplotlib>=3.3.2->gpfit==0.2.0) (3.0.7)
Requirement already satisfied: python-dateutil>=2.7 in /jenkins/workspace/CE_gpkit_PR_research_models/buildnode/reynolds/optimizer/mosek/venv_jenkins/lib/python3.8/site-packages (from matplotlib>=3.3.2->gpfit==0.2.0) (2.8.2)
Requirement already satisfied: packaging>=20.0 in /jenkins/workspace/CE_gpkit_PR_research_models/buildnode/reynolds/optimizer/mosek/venv_jenkins/lib/python3.8/site-packages (from matplotlib>=3.3.2->gpfit==0.2.0) (21.3)
Requirement already satisfied: iniconfig in /jenkins/workspace/CE_gpkit_PR_research_models/buildnode/reynolds/optimizer/mosek/venv_jenkins/lib/python3.8/site-packages (from pytest>=6.2.5->gpfit==0.2.0) (1.1.1)
Requirement already satisfied: py>=1.8.2 in /jenkins/workspace/CE_gpkit_PR_research_models/buildnode/reynolds/optimizer/mosek/venv_jenkins/lib/python3.8/site-packages (from pytest>=6.2.5->gpfit==0.2.0) (1.11.0)
Requirement already satisfied: attrs>=19.2.0 in /jenkins/workspace/CE_gpkit_PR_research_models/buildnode/reynolds/optimizer/mosek/venv_jenkins/lib/python3.8/site-packages (from pytest>=6.2.5->gpfit==0.2.0) (21.4.0)
Requirement already satisfied: tomli>=1.0.0 in /jenkins/workspace/CE_gpkit_PR_research_models/buildnode/reynolds/optimizer/mosek/venv_jenkins/lib/python3.8/site-packages (from pytest>=6.2.5->gpfit==0.2.0) (2.0.1)
Requirement already satisfied: pluggy<2.0,>=0.12 in /jenkins/workspace/CE_gpkit_PR_research_models/buildnode/reynolds/optimizer/mosek/venv_jenkins/lib/python3.8/site-packages (from pytest>=6.2.5->gpfit==0.2.0) (1.0.0)
Requirement already satisfied: Jinja2 in /jenkins/workspace/CE_gpkit_PR_research_models/buildnode/reynolds/optimizer/mosek/venv_jenkins/lib/python3.8/site-packages (from pytest-mpl>=0.13->gpfit==0.2.0) (3.0.3)
Requirement already satisfied: adce in /jenkins/workspace/CE_gpkit_PR_research_models/buildnode/reynolds/optimizer/mosek/venv_jenkins/lib/python3.8/site-packages (from gpkit->gpfit==0.2.0) (1.3.3.2)
Requirement already satisfied: cvxopt>=1.1.8 in /jenkins/workspace/CE_gpkit_PR_research_models/buildnode/reynolds/optimizer/mosek/venv_jenkins/lib/python3.8/site-packages (from gpkit->gpfit==0.2.0) (1.2.7)
Requirement already satisfied: pint>=0.8.1 in /jenkins/workspace/CE_gpkit_PR_research_models/buildnode/reynolds/optimizer/mosek/venv_jenkins/lib/python3.8/site-packages (from gpkit->gpfit==0.2.0) (0.18)
Requirement already satisfied: plotly in /jenkins/workspace/CE_gpkit_PR_research_models/buildnode/reynolds/optimizer/mosek/venv_jenkins/lib/python3.8/site-packages (from gpkit->gpfit==0.2.0) (5.6.0)
Requirement already satisfied: six>=1.5 in /jenkins/workspace/CE_gpkit_PR_research_models/buildnode/reynolds/optimizer/mosek/venv_jenkins/lib/python3.8/site-packages (from python-dateutil>=2.7->matplotlib>=3.3.2->gpfit==0.2.0) (1.16.0)
Requirement already satisfied: MarkupSafe>=2.0 in /jenkins/workspace/CE_gpkit_PR_research_models/buildnode/reynolds/optimizer/mosek/venv_jenkins/lib/python3.8/site-packages (from Jinja2->pytest-mpl>=0.13->gpfit==0.2.0) (2.1.0)
Requirement already satisfied: tenacity>=6.2.0 in /jenkins/workspace/CE_gpkit_PR_research_models/buildnode/reynolds/optimizer/mosek/venv_jenkins/lib/python3.8/site-packages (from plotly->gpkit->gpfit==0.2.0) (8.0.1)
Processing /jenkins/workspace/CE_gpkit_PR_research_models/buildnode/reynolds/optimizer/mosek/gplibrary
  Preparing metadata (setup.py): started
  Preparing metadata (setup.py): finished with status 'done'
Requirement already satisfied: future in /jenkins/workspace/CE_gpkit_PR_research_models/buildnode/reynolds/optimizer/mosek/venv_jenkins/lib/python3.8/site-packages (from gpkitmodels==0.0.0.0) (0.18.2)
Requirement already satisfied: numpy>=1.12 in /jenkins/workspace/CE_gpkit_PR_research_models/buildnode/reynolds/optimizer/mosek/venv_jenkins/lib/python3.8/site-packages (from gpkitmodels==0.0.0.0) (1.22.2)
Requirement already satisfied: pint in /jenkins/workspace/CE_gpkit_PR_research_models/buildnode/reynolds/optimizer/mosek/venv_jenkins/lib/python3.8/site-packages (from gpkitmodels==0.0.0.0) (0.18)
Requirement already satisfied: scipy in /jenkins/workspace/CE_gpkit_PR_research_models/buildnode/reynolds/optimizer/mosek/venv_jenkins/lib/python3.8/site-packages (from gpkitmodels==0.0.0.0) (1.8.0)
Requirement already satisfied: packaging in /jenkins/workspace/CE_gpkit_PR_research_models/buildnode/reynolds/optimizer/mosek/venv_jenkins/lib/python3.8/site-packages (from pint->gpkitmodels==0.0.0.0) (21.3)
Requirement already satisfied: pyparsing!=3.0.5,>=2.0.2 in /jenkins/workspace/CE_gpkit_PR_research_models/buildnode/reynolds/optimizer/mosek/venv_jenkins/lib/python3.8/site-packages (from packaging->pint->gpkitmodels==0.0.0.0) (3.0.7)
Building wheels for collected packages: gpkitmodels
  Building wheel for gpkitmodels (setup.py): started
  Building wheel for gpkitmodels (setup.py): finished with status 'done'
  Created wheel for gpkitmodels: filename=gpkitmodels-0.0.0.0-py3-none-any.whl size=66150 sha256=64457348715dc1e6141ffbfcc1aedb5987eef7ba34d913bc30a9ea6fb82769ee
  Stored in directory: /tmp/pip-ephem-wheel-cache-spd4u9ao/wheels/4d/49/07/40e2f1bfcb4f0ca5bbb41af26e102a248064ca600be9e7b61b
Successfully built gpkitmodels
Installing collected packages: gpkitmodels
  Attempting uninstall: gpkitmodels
    Found existing installation: gpkitmodels 0.0.0.0
    Uninstalling gpkitmodels-0.0.0.0:
      Successfully uninstalled gpkitmodels-0.0.0.0
Successfully installed gpkitmodels-0.0.0.0
adding test for 'gpkitmodels/GP/aircraft/wing/wing_test.py'
adding test for 'gpkitmodels/GP/aircraft/tail/tail_tests.py'
adding test for 'gpkitmodels/GP/aircraft/fuselage/test_fuselage.py'
adding test for 'gpkitmodels/GP/aircraft/prop/prop_test.py'
adding test for 'gpkitmodels/GP/aircraft/motor/motor_test.py'
adding test for 'gpkitmodels/SP/SimPleAC/SimPleAC.py'
adding test for 'gpkitmodels/SP/SimPleAC/SimPleAC_mission.py'
adding test for 'gpkitmodels/SP/SimPleAC/SimPleAC_multimission.py'

Running tests...
----------------------------------------------------------------------
EEEEEEEEEE/jenkins/workspace/CE_gpkit_PR_research_models/buildnode/reynolds/optimizer/mosek/gpkit/constraints/sgp.py:177: UserWarning: SGP not convergent: Cost rose by 6.1% (1588.61 to 1685.18) on GP solve 2. Details can be found in `m.program.results` or by solving at a higher verbosity. Note convergence is not guaranteed for models with SignomialEqualities.
  pywarnings.warn(
./jenkins/workspace/CE_gpkit_PR_research_models/buildnode/reynolds/optimizer/mosek/gpkit/constraints/sgp.py:177: UserWarning: SGP not convergent: Cost rose by 6.1% (1588.61 to 1685.18) on GP solve 2. Details can be found in `m.program.results` or by solving at a higher verbosity. Note convergence is not guaranteed for models with SignomialEqualities.
  pywarnings.warn(
./jenkins/workspace/CE_gpkit_PR_research_models/buildnode/reynolds/optimizer/mosek/gpkit/constraints/sgp.py:177: UserWarning: SGP not convergent: Cost rose by 25% (3053.31 to 3816.15) on GP solve 2. Details can be found in `m.program.results` or by solving at a higher verbosity. Note convergence is not guaranteed for models with SignomialEqualities.
  pywarnings.warn(
/jenkins/workspace/CE_gpkit_PR_research_models/buildnode/reynolds/optimizer/mosek/gpkit/constraints/sgp.py:177: UserWarning: SGP not convergent: Cost rose by 0.32% (3808.98 to 3821.21) on GP solve 4. Details can be found in `m.program.results` or by solving at a higher verbosity. Note convergence is not guaranteed for models with SignomialEqualities.
  pywarnings.warn(
./jenkins/workspace/CE_gpkit_PR_research_models/buildnode/reynolds/optimizer/mosek/gpkit/constraints/sgp.py:177: UserWarning: SGP not convergent: Cost rose by 25% (3053.31 to 3816.14) on GP solve 2. Details can be found in `m.program.results` or by solving at a higher verbosity. Note convergence is not guaranteed for models with SignomialEqualities.
  pywarnings.warn(
/jenkins/workspace/CE_gpkit_PR_research_models/buildnode/reynolds/optimizer/mosek/gpkit/constraints/sgp.py:177: UserWarning: SGP not convergent: Cost rose by 0.32% (3808.98 to 3821.21) on GP solve 4. Details can be found in `m.program.results` or by solving at a higher verbosity. Note convergence is not guaranteed for models with SignomialEqualities.
  pywarnings.warn(
...Starting a sequence of GP solves
 for 4 free variables
  in 1 locally-GP constraints
  and for 21 free variables
       in 22 posynomial inequalities.

GP Solve 1
Using solver 'mosek_cli'
 for 21 free variables
  in 22 posynomial inequalities.
Solving took 0.0376 seconds.
Solved cost was 5717.

GP Solve 2
Using solver 'mosek_cli'
 for 21 free variables
  in 22 posynomial inequalities.
Solving took 0.0373 seconds.
Solved cost was 4538.

GP Solve 3
Using solver 'mosek_cli'
 for 21 free variables
  in 22 posynomial inequalities.
Solving took 0.0347 seconds.
Solved cost was 4536.

GP Solve 4
Using solver 'mosek_cli'
 for 21 free variables
  in 22 posynomial inequalities.
Solving took 0.0354 seconds.
Solved cost was 4536.

Solving took 0.155 seconds and 4 GP solves.
Starting a sequence of GP solves
 for 4 free variables
  in 1 locally-GP constraints
  and for 21 free variables
       in 22 posynomial inequalities.

GP Solve 1
Using solver 'mosek_conif'
 for 21 free variables
  in 22 posynomial inequalities.
Solving took 0.0275 seconds.
Solved cost was 5717.

GP Solve 2
Using solver 'mosek_conif'
 for 21 free variables
  in 22 posynomial inequalities.
Solving took 0.0181 seconds.
Solved cost was 4538.

GP Solve 3
Using solver 'mosek_conif'
 for 21 free variables
  in 22 posynomial inequalities.
Solving took 0.0169 seconds.
Solved cost was 4536.

GP Solve 4
Using solver 'mosek_conif'
 for 21 free variables
  in 22 posynomial inequalities.
Solving took 0.0171 seconds.
Solved cost was 4536.

Solving took 0.0835 seconds and 4 GP solves.

======================================================================
ERROR [0.018s]: test_gpkitmodels_GP_aircraft_fuselage_test_fuselage_py_mosek_cli (gpkit.tests.from_paths.TestFiles)
----------------------------------------------------------------------
Traceback (most recent call last):
  File "/jenkins/workspace/CE_gpkit_PR_research_models/buildnode/reynolds/optimizer/mosek/gpkit/tests/helpers.py", line 55, in test
    testfn(name, import_dict, path)(self)
  File "/jenkins/workspace/CE_gpkit_PR_research_models/buildnode/reynolds/optimizer/mosek/gpkit/tests/from_paths.py", line 48, in <lambda>
    lambda self: getattr(self, name)()))  # pylint:disable=undefined-variable
  File "/jenkins/workspace/CE_gpkit_PR_research_models/buildnode/reynolds/optimizer/mosek/gpkit/tests/from_paths.py", line 34, in test_fn
    mod = __import__(os.path.basename(path)[:-3])
  File "/jenkins/workspace/CE_gpkit_PR_research_models/buildnode/reynolds/optimizer/mosek/gplibrary/gpkitmodels/GP/aircraft/fuselage/test_fuselage.py", line 3, in <module>
    from gpkitmodels.GP.aircraft.wing.wing_test import FlightState
  File "/jenkins/workspace/CE_gpkit_PR_research_models/buildnode/reynolds/optimizer/mosek/venv_jenkins/lib/python3.8/site-packages/gpkitmodels/GP/aircraft/wing/wing_test.py", line 2, in <module>
    from gpkitmodels.GP.aircraft.wing.wing import Wing
  File "/jenkins/workspace/CE_gpkit_PR_research_models/buildnode/reynolds/optimizer/mosek/venv_jenkins/lib/python3.8/site-packages/gpkitmodels/GP/aircraft/wing/wing.py", line 10, in <module>
    from .capspar import CapSpar
  File "/jenkins/workspace/CE_gpkit_PR_research_models/buildnode/reynolds/optimizer/mosek/venv_jenkins/lib/python3.8/site-packages/gpkitmodels/GP/aircraft/wing/capspar.py", line 4, in <module>
    from .gustloading import GustL
  File "/jenkins/workspace/CE_gpkit_PR_research_models/buildnode/reynolds/optimizer/mosek/venv_jenkins/lib/python3.8/site-packages/gpkitmodels/GP/aircraft/wing/gustloading.py", line 4, in <module>
    from ad.admath import cos
ModuleNotFoundError: No module named 'ad'

======================================================================
ERROR [0.002s]: test_gpkitmodels_GP_aircraft_fuselage_test_fuselage_py_mosek_conif (gpkit.tests.from_paths.TestFiles)
----------------------------------------------------------------------
Traceback (most recent call last):
  File "/jenkins/workspace/CE_gpkit_PR_research_models/buildnode/reynolds/optimizer/mosek/gpkit/tests/helpers.py", line 55, in test
    testfn(name, import_dict, path)(self)
  File "/jenkins/workspace/CE_gpkit_PR_research_models/buildnode/reynolds/optimizer/mosek/gpkit/tests/from_paths.py", line 48, in <lambda>
    lambda self: getattr(self, name)()))  # pylint:disable=undefined-variable
  File "/jenkins/workspace/CE_gpkit_PR_research_models/buildnode/reynolds/optimizer/mosek/gpkit/tests/from_paths.py", line 34, in test_fn
    mod = __import__(os.path.basename(path)[:-3])
  File "/jenkins/workspace/CE_gpkit_PR_research_models/buildnode/reynolds/optimizer/mosek/gplibrary/gpkitmodels/GP/aircraft/fuselage/test_fuselage.py", line 3, in <module>
    from gpkitmodels.GP.aircraft.wing.wing_test import FlightState
  File "/jenkins/workspace/CE_gpkit_PR_research_models/buildnode/reynolds/optimizer/mosek/venv_jenkins/lib/python3.8/site-packages/gpkitmodels/GP/aircraft/wing/wing_test.py", line 2, in <module>
    from gpkitmodels.GP.aircraft.wing.wing import Wing
  File "/jenkins/workspace/CE_gpkit_PR_research_models/buildnode/reynolds/optimizer/mosek/venv_jenkins/lib/python3.8/site-packages/gpkitmodels/GP/aircraft/wing/wing.py", line 10, in <module>
    from .capspar import CapSpar
  File "/jenkins/workspace/CE_gpkit_PR_research_models/buildnode/reynolds/optimizer/mosek/venv_jenkins/lib/python3.8/site-packages/gpkitmodels/GP/aircraft/wing/capspar.py", line 4, in <module>
    from .gustloading import GustL
  File "/jenkins/workspace/CE_gpkit_PR_research_models/buildnode/reynolds/optimizer/mosek/venv_jenkins/lib/python3.8/site-packages/gpkitmodels/GP/aircraft/wing/gustloading.py", line 4, in <module>
    from ad.admath import cos
ModuleNotFoundError: No module named 'ad'

======================================================================
ERROR [0.530s]: test_gpkitmodels_GP_aircraft_motor_motor_test_py_mosek_cli (gpkit.tests.from_paths.TestFiles)
----------------------------------------------------------------------
Traceback (most recent call last):
  File "/jenkins/workspace/CE_gpkit_PR_research_models/buildnode/reynolds/optimizer/mosek/gpkit/tests/helpers.py", line 55, in test
    testfn(name, import_dict, path)(self)
  File "/jenkins/workspace/CE_gpkit_PR_research_models/buildnode/reynolds/optimizer/mosek/gpkit/tests/from_paths.py", line 48, in <lambda>
    lambda self: getattr(self, name)()))  # pylint:disable=undefined-variable
  File "/jenkins/workspace/CE_gpkit_PR_research_models/buildnode/reynolds/optimizer/mosek/gpkit/tests/from_paths.py", line 34, in test_fn
    mod = __import__(os.path.basename(path)[:-3])
  File "/jenkins/workspace/CE_gpkit_PR_research_models/buildnode/reynolds/optimizer/mosek/gplibrary/gpkitmodels/GP/aircraft/motor/motor_test.py", line 2, in <module>
    from gpkitmodels.GP.aircraft.motor.motor import Propulsor, Motor, MotorPerf
  File "/jenkins/workspace/CE_gpkit_PR_research_models/buildnode/reynolds/optimizer/mosek/venv_jenkins/lib/python3.8/site-packages/gpkitmodels/GP/aircraft/motor/motor.py", line 4, in <module>
    from gpkitmodels.GP.aircraft.prop.propeller import Propeller, ActuatorProp
  File "/jenkins/workspace/CE_gpkit_PR_research_models/buildnode/reynolds/optimizer/mosek/venv_jenkins/lib/python3.8/site-packages/gpkitmodels/GP/aircraft/prop/propeller.py", line 5, in <module>
    from gpfit.fit_constraintset import XfoilFit
ModuleNotFoundError: No module named 'gpfit.fit_constraintset'

======================================================================
ERROR [0.001s]: test_gpkitmodels_GP_aircraft_motor_motor_test_py_mosek_conif (gpkit.tests.from_paths.TestFiles)
----------------------------------------------------------------------
Traceback (most recent call last):
  File "/jenkins/workspace/CE_gpkit_PR_research_models/buildnode/reynolds/optimizer/mosek/gpkit/tests/helpers.py", line 55, in test
    testfn(name, import_dict, path)(self)
  File "/jenkins/workspace/CE_gpkit_PR_research_models/buildnode/reynolds/optimizer/mosek/gpkit/tests/from_paths.py", line 48, in <lambda>
    lambda self: getattr(self, name)()))  # pylint:disable=undefined-variable
  File "/jenkins/workspace/CE_gpkit_PR_research_models/buildnode/reynolds/optimizer/mosek/gpkit/tests/from_paths.py", line 34, in test_fn
    mod = __import__(os.path.basename(path)[:-3])
  File "/jenkins/workspace/CE_gpkit_PR_research_models/buildnode/reynolds/optimizer/mosek/gplibrary/gpkitmodels/GP/aircraft/motor/motor_test.py", line 2, in <module>
    from gpkitmodels.GP.aircraft.motor.motor import Propulsor, Motor, MotorPerf
  File "/jenkins/workspace/CE_gpkit_PR_research_models/buildnode/reynolds/optimizer/mosek/venv_jenkins/lib/python3.8/site-packages/gpkitmodels/GP/aircraft/motor/motor.py", line 4, in <module>
    from gpkitmodels.GP.aircraft.prop.propeller import Propeller, ActuatorProp
  File "/jenkins/workspace/CE_gpkit_PR_research_models/buildnode/reynolds/optimizer/mosek/venv_jenkins/lib/python3.8/site-packages/gpkitmodels/GP/aircraft/prop/propeller.py", line 5, in <module>
    from gpfit.fit_constraintset import XfoilFit
ModuleNotFoundError: No module named 'gpfit.fit_constraintset'

======================================================================
ERROR [0.002s]: test_gpkitmodels_GP_aircraft_prop_prop_test_py_mosek_cli (gpkit.tests.from_paths.TestFiles)
----------------------------------------------------------------------
Traceback (most recent call last):
  File "/jenkins/workspace/CE_gpkit_PR_research_models/buildnode/reynolds/optimizer/mosek/gpkit/tests/helpers.py", line 55, in test
    testfn(name, import_dict, path)(self)
  File "/jenkins/workspace/CE_gpkit_PR_research_models/buildnode/reynolds/optimizer/mosek/gpkit/tests/from_paths.py", line 48, in <lambda>
    lambda self: getattr(self, name)()))  # pylint:disable=undefined-variable
  File "/jenkins/workspace/CE_gpkit_PR_research_models/buildnode/reynolds/optimizer/mosek/gpkit/tests/from_paths.py", line 34, in test_fn
    mod = __import__(os.path.basename(path)[:-3])
  File "/jenkins/workspace/CE_gpkit_PR_research_models/buildnode/reynolds/optimizer/mosek/gplibrary/gpkitmodels/GP/aircraft/prop/prop_test.py", line 2, in <module>
    from gpkitmodels.GP.aircraft.prop.propeller import Propeller, ActuatorProp
  File "/jenkins/workspace/CE_gpkit_PR_research_models/buildnode/reynolds/optimizer/mosek/venv_jenkins/lib/python3.8/site-packages/gpkitmodels/GP/aircraft/prop/propeller.py", line 5, in <module>
    from gpfit.fit_constraintset import XfoilFit
ModuleNotFoundError: No module named 'gpfit.fit_constraintset'

======================================================================
ERROR [0.001s]: test_gpkitmodels_GP_aircraft_prop_prop_test_py_mosek_conif (gpkit.tests.from_paths.TestFiles)
----------------------------------------------------------------------
Traceback (most recent call last):
  File "/jenkins/workspace/CE_gpkit_PR_research_models/buildnode/reynolds/optimizer/mosek/gpkit/tests/helpers.py", line 55, in test
    testfn(name, import_dict, path)(self)
  File "/jenkins/workspace/CE_gpkit_PR_research_models/buildnode/reynolds/optimizer/mosek/gpkit/tests/from_paths.py", line 48, in <lambda>
    lambda self: getattr(self, name)()))  # pylint:disable=undefined-variable
  File "/jenkins/workspace/CE_gpkit_PR_research_models/buildnode/reynolds/optimizer/mosek/gpkit/tests/from_paths.py", line 34, in test_fn
    mod = __import__(os.path.basename(path)[:-3])
  File "/jenkins/workspace/CE_gpkit_PR_research_models/buildnode/reynolds/optimizer/mosek/gplibrary/gpkitmodels/GP/aircraft/prop/prop_test.py", line 2, in <module>
    from gpkitmodels.GP.aircraft.prop.propeller import Propeller, ActuatorProp
  File "/jenkins/workspace/CE_gpkit_PR_research_models/buildnode/reynolds/optimizer/mosek/venv_jenkins/lib/python3.8/site-packages/gpkitmodels/GP/aircraft/prop/propeller.py", line 5, in <module>
    from gpfit.fit_constraintset import XfoilFit
ModuleNotFoundError: No module named 'gpfit.fit_constraintset'

======================================================================
ERROR [0.003s]: test_gpkitmodels_GP_aircraft_tail_tail_tests_py_mosek_cli (gpkit.tests.from_paths.TestFiles)
----------------------------------------------------------------------
Traceback (most recent call last):
  File "/jenkins/workspace/CE_gpkit_PR_research_models/buildnode/reynolds/optimizer/mosek/gpkit/tests/helpers.py", line 55, in test
    testfn(name, import_dict, path)(self)
  File "/jenkins/workspace/CE_gpkit_PR_research_models/buildnode/reynolds/optimizer/mosek/gpkit/tests/from_paths.py", line 48, in <lambda>
    lambda self: getattr(self, name)()))  # pylint:disable=undefined-variable
  File "/jenkins/workspace/CE_gpkit_PR_research_models/buildnode/reynolds/optimizer/mosek/gpkit/tests/from_paths.py", line 34, in test_fn
    mod = __import__(os.path.basename(path)[:-3])
  File "/jenkins/workspace/CE_gpkit_PR_research_models/buildnode/reynolds/optimizer/mosek/gplibrary/gpkitmodels/GP/aircraft/tail/tail_tests.py", line 2, in <module>
    from gpkitmodels.GP.aircraft.tail.horizontal_tail import HorizontalTail
  File "/jenkins/workspace/CE_gpkit_PR_research_models/buildnode/reynolds/optimizer/mosek/venv_jenkins/lib/python3.8/site-packages/gpkitmodels/GP/aircraft/tail/horizontal_tail.py", line 4, in <module>
    from .tail_aero import TailAero
  File "/jenkins/workspace/CE_gpkit_PR_research_models/buildnode/reynolds/optimizer/mosek/venv_jenkins/lib/python3.8/site-packages/gpkitmodels/GP/aircraft/tail/tail_aero.py", line 5, in <module>
    from gpfit.fit_constraintset import XfoilFit
ModuleNotFoundError: No module named 'gpfit.fit_constraintset'

======================================================================
ERROR [0.001s]: test_gpkitmodels_GP_aircraft_tail_tail_tests_py_mosek_conif (gpkit.tests.from_paths.TestFiles)
----------------------------------------------------------------------
Traceback (most recent call last):
  File "/jenkins/workspace/CE_gpkit_PR_research_models/buildnode/reynolds/optimizer/mosek/gpkit/tests/helpers.py", line 55, in test
    testfn(name, import_dict, path)(self)
  File "/jenkins/workspace/CE_gpkit_PR_research_models/buildnode/reynolds/optimizer/mosek/gpkit/tests/from_paths.py", line 48, in <lambda>
    lambda self: getattr(self, name)()))  # pylint:disable=undefined-variable
  File "/jenkins/workspace/CE_gpkit_PR_research_models/buildnode/reynolds/optimizer/mosek/gpkit/tests/from_paths.py", line 34, in test_fn
    mod = __import__(os.path.basename(path)[:-3])
  File "/jenkins/workspace/CE_gpkit_PR_research_models/buildnode/reynolds/optimizer/mosek/gplibrary/gpkitmodels/GP/aircraft/tail/tail_tests.py", line 2, in <module>
    from gpkitmodels.GP.aircraft.tail.horizontal_tail import HorizontalTail
  File "/jenkins/workspace/CE_gpkit_PR_research_models/buildnode/reynolds/optimizer/mosek/venv_jenkins/lib/python3.8/site-packages/gpkitmodels/GP/aircraft/tail/horizontal_tail.py", line 4, in <module>
    from .tail_aero import TailAero
  File "/jenkins/workspace/CE_gpkit_PR_research_models/buildnode/reynolds/optimizer/mosek/venv_jenkins/lib/python3.8/site-packages/gpkitmodels/GP/aircraft/tail/tail_aero.py", line 5, in <module>
    from gpfit.fit_constraintset import XfoilFit
ModuleNotFoundError: No module named 'gpfit.fit_constraintset'

======================================================================
ERROR [0.002s]: test_gpkitmodels_GP_aircraft_wing_wing_test_py_mosek_cli (gpkit.tests.from_paths.TestFiles)
----------------------------------------------------------------------
Traceback (most recent call last):
  File "/jenkins/workspace/CE_gpkit_PR_research_models/buildnode/reynolds/optimizer/mosek/gpkit/tests/helpers.py", line 55, in test
    testfn(name, import_dict, path)(self)
  File "/jenkins/workspace/CE_gpkit_PR_research_models/buildnode/reynolds/optimizer/mosek/gpkit/tests/from_paths.py", line 48, in <lambda>
    lambda self: getattr(self, name)()))  # pylint:disable=undefined-variable
  File "/jenkins/workspace/CE_gpkit_PR_research_models/buildnode/reynolds/optimizer/mosek/gpkit/tests/from_paths.py", line 34, in test_fn
    mod = __import__(os.path.basename(path)[:-3])
  File "/jenkins/workspace/CE_gpkit_PR_research_models/buildnode/reynolds/optimizer/mosek/gplibrary/gpkitmodels/GP/aircraft/wing/wing_test.py", line 2, in <module>
    from gpkitmodels.GP.aircraft.wing.wing import Wing
  File "/jenkins/workspace/CE_gpkit_PR_research_models/buildnode/reynolds/optimizer/mosek/venv_jenkins/lib/python3.8/site-packages/gpkitmodels/GP/aircraft/wing/wing.py", line 10, in <module>
    from .capspar import CapSpar
  File "/jenkins/workspace/CE_gpkit_PR_research_models/buildnode/reynolds/optimizer/mosek/venv_jenkins/lib/python3.8/site-packages/gpkitmodels/GP/aircraft/wing/capspar.py", line 4, in <module>
    from .gustloading import GustL
  File "/jenkins/workspace/CE_gpkit_PR_research_models/buildnode/reynolds/optimizer/mosek/venv_jenkins/lib/python3.8/site-packages/gpkitmodels/GP/aircraft/wing/gustloading.py", line 4, in <module>
    from ad.admath import cos
ModuleNotFoundError: No module named 'ad'

======================================================================
ERROR [0.001s]: test_gpkitmodels_GP_aircraft_wing_wing_test_py_mosek_conif (gpkit.tests.from_paths.TestFiles)
----------------------------------------------------------------------
Traceback (most recent call last):
  File "/jenkins/workspace/CE_gpkit_PR_research_models/buildnode/reynolds/optimizer/mosek/gpkit/tests/helpers.py", line 55, in test
    testfn(name, import_dict, path)(self)
  File "/jenkins/workspace/CE_gpkit_PR_research_models/buildnode/reynolds/optimizer/mosek/gpkit/tests/from_paths.py", line 48, in <lambda>
    lambda self: getattr(self, name)()))  # pylint:disable=undefined-variable
  File "/jenkins/workspace/CE_gpkit_PR_research_models/buildnode/reynolds/optimizer/mosek/gpkit/tests/from_paths.py", line 34, in test_fn
    mod = __import__(os.path.basename(path)[:-3])
  File "/jenkins/workspace/CE_gpkit_PR_research_models/buildnode/reynolds/optimizer/mosek/gplibrary/gpkitmodels/GP/aircraft/wing/wing_test.py", line 2, in <module>
    from gpkitmodels.GP.aircraft.wing.wing import Wing
  File "/jenkins/workspace/CE_gpkit_PR_research_models/buildnode/reynolds/optimizer/mosek/venv_jenkins/lib/python3.8/site-packages/gpkitmodels/GP/aircraft/wing/wing.py", line 10, in <module>
    from .capspar import CapSpar
  File "/jenkins/workspace/CE_gpkit_PR_research_models/buildnode/reynolds/optimizer/mosek/venv_jenkins/lib/python3.8/site-packages/gpkitmodels/GP/aircraft/wing/capspar.py", line 4, in <module>
    from .gustloading import GustL
  File "/jenkins/workspace/CE_gpkit_PR_research_models/buildnode/reynolds/optimizer/mosek/venv_jenkins/lib/python3.8/site-packages/gpkitmodels/GP/aircraft/wing/gustloading.py", line 4, in <module>
    from ad.admath import cos
ModuleNotFoundError: No module named 'ad'

----------------------------------------------------------------------
Ran 16 tests in 3.168s

FAILED (errors=10)

Generating XML reports...
Cloning into 'eVTOL'...
adding test for 'models/model_tests.py'

Running tests...
----------------------------------------------------------------------
..
----------------------------------------------------------------------
Ran 2 tests in 2.923s

OK

Generating XML reports...

----------------------------------------------------------------------
Ran 283 tests in 25.351s

OK
Found no installed solvers, beginning a build.
# Building GPkit version 1.1
# Moving to the directory from which GPkit was imported.

Attempting to find and build solvers:

# Looking for `mosek_cli`
#   (A "success" is if mskexpopt complains that
#    we haven't specified a file for it to open.)
#     Calling 'mskexpopt'
##
### CALL BEGINS
### CALL ENDS
##
# Looks like `mskexpopt` was not found in the default PATH,
#  so let's try locating that binary ourselves.
#   Adding /home/jenkins/mosek/8/tools/platform/linux64x86/bin to the PATH
#     Calling 'mskexpopt'
##
### CALL BEGINS
### CALL ENDS
##

Found mosek_cli in /home/jenkins/mosek/8/tools/platform/linux64x86/bin

# Looking for `mosek_conif`
#   Trying to import mosek...

Found mosek_conif in the default PYTHONPATH

# Looking for `cvxopt`
#   Trying to import cvxopt...

Found cvxopt in the default PYTHONPATH
Replaced found solvers (['mosek_cli', 'mosek_conif', 'cvxopt']) with environment var GPKITSOLVERS (mosek_cli, mosek_conif)

Found the following solvers: mosek_cli, mosek_conif
#     Replacing directory env

GPkit is now installed with solver(s) ['mosek_cli', 'mosek_conif']
To incorporate new solvers at a later date, run `gpkit.build()`.

If any tests didn't pass, please post the output above
(starting from "Found no installed solvers, beginning a build.")
to gpkit@mit.edu or https://github.com/convexengineering/gpkit/issues/new
so we can prevent others from having these errors.

The same goes for any other bugs you encounter with GPkit:
send 'em our way, along with any interesting models, speculative features,
comments, discussions, or clarifications you feel like sharing.

Finally, we hope you find our documentation (https://gpkit.readthedocs.io/)
and engineering-design models (https://github.com/convexengineering/gplibrary/)
to be useful resources for your own applications.

Enjoy!

calling ['git', 'clone', '--depth', '1', '-b', 'master', 'https://github.com/convexengineering/gplibrary.git']
  attempt 1
calling ['python', '/jenkins/workspace/CE_gpkit_PR_research_models/buildnode/reynolds/optimizer/mosek/venv_jenkins/bin/pip', 'install', '--no-cache-dir', '--no-deps', '-e', 'gplibrary']
  attempt 1
calling ['git', 'clone', '--depth', '1', '-b', 'master', 'https://github.com/convexengineering/SPaircraft.git']
  attempt 1

SETTINGS
defaultdict(<class 'str'>, {'skipsolvers': 'cvxopt', 'pip install': 'git+https://github.com/hoburg/turbofan.git', 'gpkit-models branch': 'master'})

calling ['python', '/jenkins/workspace/CE_gpkit_PR_research_models/buildnode/reynolds/optimizer/mosek/venv_jenkins/bin/pip', 'install', 'git+https://github.com/hoburg/turbofan.git']
  attempt 1
calling ['python', '/jenkins/workspace/CE_gpkit_PR_research_models/buildnode/reynolds/optimizer/mosek/venv_jenkins/bin/pip', 'install', '.']
  attempt 1
calling ['git', 'clone', '--depth', '1', '-b', 'master', 'https://github.com/convexengineering/robust.git']
  attempt 1

SETTINGS
defaultdict(<class 'str'>, {})

calling ['python', '/jenkins/workspace/CE_gpkit_PR_research_models/buildnode/reynolds/optimizer/mosek/venv_jenkins/bin/pip', 'install', '.']
  attempt 1
  attempt 2
  attempt 3
  attempt 4
  attempt 5
calling ['git', 'clone', '--depth', '1', '-b', 'master', 'https://github.com/convexengineering/shopping.git']
  attempt 1

SETTINGS
defaultdict(<class 'str'>, {})

calling ['git', 'clone', '--depth', '1', '-b', 'master', 'https://github.com/convexengineering/gassolar.git']
  attempt 1

SETTINGS
defaultdict(<class 'str'>, {'pip install': 'pandas, git+https://github.com/hoburg/gpfit.git', 'gpkit-models branch': 'master', 'skipsolvers': 'cvxopt'})

calling ['python', '/jenkins/workspace/CE_gpkit_PR_research_models/buildnode/reynolds/optimizer/mosek/venv_jenkins/bin/pip', 'install', 'pandas']
  attempt 1
calling ['python', '/jenkins/workspace/CE_gpkit_PR_research_models/buildnode/reynolds/optimizer/mosek/venv_jenkins/bin/pip', 'install', 'git+https://github.com/hoburg/gpfit.git']
  attempt 1
calling ['python', '/jenkins/workspace/CE_gpkit_PR_research_models/buildnode/reynolds/optimizer/mosek/venv_jenkins/bin/pip', 'install', '.']
  attempt 1
calling ['git', 'clone', '--depth', '1', '-b', 'master', 'https://github.com/convexengineering/jho.git']
  attempt 1

SETTINGS
defaultdict(<class 'str'>, {'pip install': 'pandas, git+https://github.com/hoburg/gpfit.git', 'gpkit-models branch': 'master', 'skipsolvers': 'cvxopt'})

calling ['python', '/jenkins/workspace/CE_gpkit_PR_research_models/buildnode/reynolds/optimizer/mosek/venv_jenkins/bin/pip', 'install', 'pandas']
  attempt 1
calling ['python', '/jenkins/workspace/CE_gpkit_PR_research_models/buildnode/reynolds/optimizer/mosek/venv_jenkins/bin/pip', 'install', 'git+https://github.com/hoburg/gpfit.git']
  attempt 1
calling ['git', 'clone', '--depth', '1', '-b', 'master', 'https://github.com/convexengineering/turbofan.git']
  attempt 1

SETTINGS
defaultdict(<class 'str'>, {'skipsolvers': 'cvxopt, mosek_cli', 'gpkit-models branch': 'master'})

calling ['python', '/jenkins/workspace/CE_gpkit_PR_research_models/buildnode/reynolds/optimizer/mosek/venv_jenkins/bin/pip', 'install', '.']
  attempt 1
calling ['git', 'clone', '--depth', '1', '-b', 'master', 'https://github.com/convexengineering/solar.git']
  attempt 1

SETTINGS
defaultdict(<class 'str'>, {'pip install': 'pandas, git+https://github.com/convexengineering/gpfit.git, git+https://github.com/convexengineering/gassolar.git', 'gpkit-models branch': 'master', 'skipsolvers': 'cvxopt'})

calling ['python', '/jenkins/workspace/CE_gpkit_PR_research_models/buildnode/reynolds/optimizer/mosek/venv_jenkins/bin/pip', 'install', 'pandas']
  attempt 1
calling ['python', '/jenkins/workspace/CE_gpkit_PR_research_models/buildnode/reynolds/optimizer/mosek/venv_jenkins/bin/pip', 'install', 'git+https://github.com/convexengineering/gpfit.git']
  attempt 1
calling ['python', '/jenkins/workspace/CE_gpkit_PR_research_models/buildnode/reynolds/optimizer/mosek/venv_jenkins/bin/pip', 'install', 'git+https://github.com/convexengineering/gassolar.git']
  attempt 1
calling ['python', '/jenkins/workspace/CE_gpkit_PR_research_models/buildnode/reynolds/optimizer/mosek/venv_jenkins/bin/pip', 'install', '.']
  attempt 1
calling ['git', 'clone', '--depth', '1', '-b', 'master', 'https://github.com/convexengineering/gplibrary.git']
  attempt 1
  attempt 2
  attempt 3
  attempt 4
  attempt 5

SETTINGS
defaultdict(<class 'str'>, {'pip install': 'pandas, git+https://github.com/hoburg/gpfit.git'})

calling ['python', '/jenkins/workspace/CE_gpkit_PR_research_models/buildnode/reynolds/optimizer/mosek/venv_jenkins/bin/pip', 'install', 'pandas']
  attempt 1
calling ['python', '/jenkins/workspace/CE_gpkit_PR_research_models/buildnode/reynolds/optimizer/mosek/venv_jenkins/bin/pip', 'install', 'git+https://github.com/hoburg/gpfit.git']
  attempt 1
calling ['python', '/jenkins/workspace/CE_gpkit_PR_research_models/buildnode/reynolds/optimizer/mosek/venv_jenkins/bin/pip', 'install', '.']
  attempt 1
calling ['git', 'clone', '--depth', '1', '-b', 'master', 'https://github.com/convexengineering/eVTOL.git']
  attempt 1

SETTINGS
defaultdict(<class 'str'>, {'skipsolvers': 'cvxopt'})

[Execution node] check if [reynolds] is in [[windows10x64]]
Run condition [Execution node ] preventing perform for step [Execute Windows batch command]
Build step 'Console output (build log) parsing' changed build result to FAILURE
Recording test results
[Checks API] No suitable checks publisher found.
[WS-CLEANUP] Deleting project workspace...
[WS-CLEANUP] Deferred wipeout is used...
[WS-CLEANUP] done
Finished: FAILURE