Console Output

Started by upstream project "gplibrary_PR_Models" build number 101
originally caused by:
 GitHub pull request #176 of commit 333803220bcb170d227c43a0705df9f61e3a4e3a, no merge conflicts.
Running as SYSTEM
[EnvInject] - Loading node environment variables.
Building remotely on macys_VM in workspace /Users/jenkins/workspace/gplibrary_PR_Models/mosek
No credentials specified
Wiping out workspace first.
Cloning the remote Git repository
Cloning repository https://github.com/convexengineering/gplibrary
 > git init /Users/jenkins/workspace/gplibrary_PR_Models/mosek # timeout=10
Fetching upstream changes from https://github.com/convexengineering/gplibrary
 > git --version # timeout=10
 > git fetch --tags --progress https://github.com/convexengineering/gplibrary +refs/heads/*:refs/remotes/origin/* # timeout=10
 > git config remote.origin.url https://github.com/convexengineering/gplibrary # timeout=10
 > git config --add remote.origin.fetch +refs/heads/*:refs/remotes/origin/* # timeout=10
 > git config remote.origin.url https://github.com/convexengineering/gplibrary # timeout=10
Fetching upstream changes from https://github.com/convexengineering/gplibrary
 > git fetch --tags --progress https://github.com/convexengineering/gplibrary +refs/pull/*:refs/remotes/origin/pr/* +refs/heads/master:refs/remotes/origin/master # timeout=10
Merging Revision ae5467efe73dfd63300666f23535fc77b6688568 (refs/remotes/origin/pr/176/merge) to origin/master, UserMergeOptions{mergeRemote='origin', mergeTarget='master', mergeStrategy='DEFAULT', fastForwardMode='FF'}
 > git rev-parse origin/master^{commit} # timeout=10
 > git config core.sparsecheckout # timeout=10
 > git checkout -f origin/master # timeout=3
 > git merge --ff ae5467efe73dfd63300666f23535fc77b6688568 # timeout=10
 > git rev-parse HEAD^{commit} # timeout=10
Seen branch in repository origin/1682literate
Seen branch in repository origin/1682master
Seen branch in repository origin/Breakdown
Seen branch in repository origin/aerosurf
Seen branch in repository origin/atmosphere
Seen branch in repository origin/bounds5
Seen branch in repository origin/boxspar
Seen branch in repository origin/breguet_range
Seen branch in repository origin/breguetsetup
Seen branch in repository origin/climb
Seen branch in repository origin/commercial_sizing
Seen branch in repository origin/compress-aero
Seen branch in repository origin/d8
Seen branch in repository origin/electric_motor
Seen branch in repository origin/firefly
Seen branch in repository origin/fits
Seen branch in repository origin/flightsegments
Seen branch in repository origin/interactive_simpleflight
Seen branch in repository origin/libRename
Seen branch in repository origin/master
Seen branch in repository origin/materials
Seen branch in repository origin/md_template
Seen branch in repository origin/motor
Seen branch in repository origin/ncrit
Seen branch in repository origin/performance
Seen branch in repository origin/pr/10/head
Seen branch in repository origin/pr/100/head
Seen branch in repository origin/pr/103/head
Seen branch in repository origin/pr/105/head
Seen branch in repository origin/pr/105/merge
Seen branch in repository origin/pr/107/head
Seen branch in repository origin/pr/109/head
Seen branch in repository origin/pr/11/head
Seen branch in repository origin/pr/11/merge
Seen branch in repository origin/pr/110/head
Seen branch in repository origin/pr/112/head
Seen branch in repository origin/pr/113/head
Seen branch in repository origin/pr/113/merge
Seen branch in repository origin/pr/114/head
Seen branch in repository origin/pr/115/head
Seen branch in repository origin/pr/115/merge
Seen branch in repository origin/pr/116/head
Seen branch in repository origin/pr/118/head
Seen branch in repository origin/pr/119/head
Seen branch in repository origin/pr/119/merge
Seen branch in repository origin/pr/12/head
Seen branch in repository origin/pr/120/head
Seen branch in repository origin/pr/121/head
Seen branch in repository origin/pr/121/merge
Seen branch in repository origin/pr/122/head
Seen branch in repository origin/pr/123/head
Seen branch in repository origin/pr/124/head
Seen branch in repository origin/pr/125/head
Seen branch in repository origin/pr/127/head
Seen branch in repository origin/pr/128/head
Seen branch in repository origin/pr/129/head
Seen branch in repository origin/pr/13/head
Seen branch in repository origin/pr/13/merge
Seen branch in repository origin/pr/131/head
Seen branch in repository origin/pr/132/head
Seen branch in repository origin/pr/133/head
Seen branch in repository origin/pr/134/head
Seen branch in repository origin/pr/135/head
Seen branch in repository origin/pr/136/head
Seen branch in repository origin/pr/137/head
Seen branch in repository origin/pr/138/head
Seen branch in repository origin/pr/139/head
Seen branch in repository origin/pr/14/head
Seen branch in repository origin/pr/14/merge
Seen branch in repository origin/pr/141/head
Seen branch in repository origin/pr/143/head
Seen branch in repository origin/pr/144/head
Seen branch in repository origin/pr/144/merge
Seen branch in repository origin/pr/145/head
Seen branch in repository origin/pr/145/merge
Seen branch in repository origin/pr/146/head
Seen branch in repository origin/pr/147/head
Seen branch in repository origin/pr/149/head
Seen branch in repository origin/pr/15/head
Seen branch in repository origin/pr/150/head
Seen branch in repository origin/pr/151/head
Seen branch in repository origin/pr/152/head
Seen branch in repository origin/pr/153/head
Seen branch in repository origin/pr/154/head
Seen branch in repository origin/pr/154/merge
Seen branch in repository origin/pr/155/head
Seen branch in repository origin/pr/156/head
Seen branch in repository origin/pr/157/head
Seen branch in repository origin/pr/158/head
Seen branch in repository origin/pr/159/head
Seen branch in repository origin/pr/16/head
Seen branch in repository origin/pr/160/head
Seen branch in repository origin/pr/160/merge
Seen branch in repository origin/pr/161/head
Seen branch in repository origin/pr/162/head
Seen branch in repository origin/pr/163/head
Seen branch in repository origin/pr/165/head
Seen branch in repository origin/pr/166/head
Seen branch in repository origin/pr/166/merge
Seen branch in repository origin/pr/167/head
Seen branch in repository origin/pr/168/head
Seen branch in repository origin/pr/169/head
Seen branch in repository origin/pr/17/head
Seen branch in repository origin/pr/17/merge
Seen branch in repository origin/pr/171/head
Seen branch in repository origin/pr/172/head
Seen branch in repository origin/pr/173/head
Seen branch in repository origin/pr/173/merge
Seen branch in repository origin/pr/174/head
Seen branch in repository origin/pr/174/merge
Seen branch in repository origin/pr/175/head
Seen branch in repository origin/pr/176/head
Seen branch in repository origin/pr/176/merge
Seen branch in repository origin/pr/19/head
Seen branch in repository origin/pr/19/merge
Seen branch in repository origin/pr/20/head
Seen branch in repository origin/pr/22/head
Seen branch in repository origin/pr/22/merge
Seen branch in repository origin/pr/23/head
Seen branch in repository origin/pr/23/merge
Seen branch in repository origin/pr/24/head
Seen branch in repository origin/pr/25/head
Seen branch in repository origin/pr/26/head
Seen branch in repository origin/pr/26/merge
Seen branch in repository origin/pr/27/head
Seen branch in repository origin/pr/29/head
Seen branch in repository origin/pr/30/head
Seen branch in repository origin/pr/31/head
Seen branch in repository origin/pr/33/head
Seen branch in repository origin/pr/34/head
Seen branch in repository origin/pr/35/head
Seen branch in repository origin/pr/36/head
Seen branch in repository origin/pr/37/head
Seen branch in repository origin/pr/38/head
Seen branch in repository origin/pr/39/head
Seen branch in repository origin/pr/40/head
Seen branch in repository origin/pr/40/merge
Seen branch in repository origin/pr/42/head
Seen branch in repository origin/pr/42/merge
Seen branch in repository origin/pr/43/head
Seen branch in repository origin/pr/44/head
Seen branch in repository origin/pr/44/merge
Seen branch in repository origin/pr/45/head
Seen branch in repository origin/pr/46/head
Seen branch in repository origin/pr/46/merge
Seen branch in repository origin/pr/47/head
Seen branch in repository origin/pr/47/merge
Seen branch in repository origin/pr/5/head
Seen branch in repository origin/pr/54/head
Seen branch in repository origin/pr/54/merge
Seen branch in repository origin/pr/55/head
Seen branch in repository origin/pr/57/head
Seen branch in repository origin/pr/58/head
Seen branch in repository origin/pr/60/head
Seen branch in repository origin/pr/61/head
Seen branch in repository origin/pr/62/head
Seen branch in repository origin/pr/63/head
Seen branch in repository origin/pr/63/merge
Seen branch in repository origin/pr/64/head
Seen branch in repository origin/pr/69/head
Seen branch in repository origin/pr/70/head
Seen branch in repository origin/pr/70/merge
Seen branch in repository origin/pr/71/head
Seen branch in repository origin/pr/72/head
Seen branch in repository origin/pr/72/merge
Seen branch in repository origin/pr/73/head
Seen branch in repository origin/pr/73/merge
Seen branch in repository origin/pr/75/head
Seen branch in repository origin/pr/75/merge
Seen branch in repository origin/pr/77/head
Seen branch in repository origin/pr/77/merge
Seen branch in repository origin/pr/78/head
Seen branch in repository origin/pr/78/merge
Seen branch in repository origin/pr/80/head
Seen branch in repository origin/pr/82/head
Seen branch in repository origin/pr/82/merge
Seen branch in repository origin/pr/83/head
Seen branch in repository origin/pr/83/merge
Seen branch in repository origin/pr/85/head
Seen branch in repository origin/pr/85/merge
Seen branch in repository origin/pr/86/head
Seen branch in repository origin/pr/88/head
Seen branch in repository origin/pr/88/merge
Seen branch in repository origin/pr/89/head
Seen branch in repository origin/pr/89/merge
Seen branch in repository origin/pr/9/head
Seen branch in repository origin/pr/90/head
Seen branch in repository origin/pr/90/merge
Seen branch in repository origin/pr/91/head
Seen branch in repository origin/pr/91/merge
Seen branch in repository origin/pr/92/head
Seen branch in repository origin/pr/92/merge
Seen branch in repository origin/pr/94/head
Seen branch in repository origin/pr/96/head
Seen branch in repository origin/pr/96/merge
Seen branch in repository origin/pr/97/head
Seen branch in repository origin/pr/97/merge
Seen branch in repository origin/pr/98/head
Seen branch in repository origin/pr/99/head
Seen branch in repository origin/prop_beta
Seen branch in repository origin/python3
Seen branch in repository origin/qstr
Seen branch in repository origin/quadrotor
Seen branch in repository origin/robustSPpaper
Seen branch in repository origin/robustSPpaper2
Seen branch in repository origin/rockets
Seen branch in repository origin/sigeq_paper
Seen branch in repository origin/simple_HT_sizing
Seen branch in repository origin/simple_flight_profile
Seen branch in repository origin/standard_atmosphere
Seen branch in repository origin/sutherland
Seen branch in repository origin/troposphere
Seen branch in repository origin/uncertain
Seen branch in repository origin/vectorizeplanform
Seen branch in repository origin/wide_body
Seen branch in repository origin/wvl
Seen 216 remote branches
 > git show-ref --tags -d # timeout=10
Checking out Revision ae5467efe73dfd63300666f23535fc77b6688568 (origin/pr/176/merge, origin/master)
 > git config core.sparsecheckout # timeout=10
 > git checkout -f ae5467efe73dfd63300666f23535fc77b6688568 # timeout=3
Commit message: "Merge 333803220bcb170d227c43a0705df9f61e3a4e3a into f3027d71c558db6f128bf22f9e0490a2520aa3c0"
Using 'Changelog to branch' strategy.
Run condition [Execution node ] enabling prebuild for step [Execute shell]
Run condition [Execution node ] enabling prebuild for step [Execute Windows batch command]
[description-setter] Description set: <a title="python3 compatibility" href="https://github.com/convexengineering/gplibrary/pull/176">PR 176</a>: python3 compatibility
[Execution node] check if [macys_VM] is in [[macys, macys_VM, reynolds, reynolds-ubuntu16]]
Run condition [Execution node ] enabling perform for step [Execute shell]
[mosek] $ /bin/bash -xe /var/folders/42/s1whb7rd4mddfcnzk96g_d9h0000gp/T/jenkins8042392052971895784.sh
+ [[ macys_VM == *macys* ]]
+ export PATH=/usr/bin:/bin:/usr/sbin:/sbin:/usr/local/bin/
+ PATH=/usr/bin:/bin:/usr/sbin:/sbin:/usr/local/bin/
+ virtualenv /Users/jenkins/workspace/gplibrary_PR_Models/mosek/venv2_gpkit
New python executable in /Users/jenkins/workspace/gplibrary_PR_Models/mosek/venv2_gpkit/bin/python
Installing setuptools, pip, wheel...done.
+ . /Users/jenkins/workspace/gplibrary_PR_Models/mosek/venv2_gpkit/bin/activate
++ deactivate nondestructive
++ unset -f pydoc
++ '[' -z '' ']'
++ '[' -z '' ']'
++ '[' -n /bin/bash ']'
++ hash -r
++ '[' -z '' ']'
++ unset VIRTUAL_ENV
++ '[' '!' nondestructive = nondestructive ']'
++ VIRTUAL_ENV=/Users/jenkins/workspace/gplibrary_PR_Models/mosek/venv2_gpkit
++ export VIRTUAL_ENV
++ _OLD_VIRTUAL_PATH=/usr/bin:/bin:/usr/sbin:/sbin:/usr/local/bin/
++ PATH=/Users/jenkins/workspace/gplibrary_PR_Models/mosek/venv2_gpkit/bin:/usr/bin:/bin:/usr/sbin:/sbin:/usr/local/bin/
++ export PATH
++ '[' -z '' ']'
++ '[' -z '' ']'
++ _OLD_VIRTUAL_PS1=
++ '[' x '!=' x ']'
+++ basename /Users/jenkins/workspace/gplibrary_PR_Models/mosek/venv2_gpkit
++ PS1='(venv2_gpkit) '
++ export PS1
++ alias pydoc
++ '[' -n /bin/bash ']'
++ hash -r
++ which pip
+ export PIP=/Users/jenkins/workspace/gplibrary_PR_Models/mosek/venv2_gpkit/bin/pip
+ PIP=/Users/jenkins/workspace/gplibrary_PR_Models/mosek/venv2_gpkit/bin/pip
+ pip_install pip
+ python /Users/jenkins/workspace/gplibrary_PR_Models/mosek/venv2_gpkit/bin/pip install --upgrade pip
DEPRECATION: Python 2.7 will reach the end of its life on January 1st, 2020. Please upgrade your Python as Python 2.7 won't be maintained after that date. A future version of pip will drop support for Python 2.7. More details about Python 2 support in pip, can be found at https://pip.pypa.io/en/latest/development/release-process/#python-2-support
Requirement already up-to-date: pip in ./venv2_gpkit/lib/python2.7/site-packages (19.2.3)
+ [[ macys_VM == *reynolds* ]]
+ [[ macys_VM == *macys* ]]
+ [[ mosek == mosek ]]
+ [[ macys_VM == macys ]]
+ export PATH=/Users/jenkins/workspace/gplibrary_PR_Models/mosek/venv2_gpkit/bin:/usr/bin:/bin:/usr/sbin:/sbin:/usr/local/bin/:/Users/jenkins/mosek/7/tools/platform/osx64x86/bin
+ PATH=/Users/jenkins/workspace/gplibrary_PR_Models/mosek/venv2_gpkit/bin:/usr/bin:/bin:/usr/sbin:/sbin:/usr/local/bin/:/Users/jenkins/mosek/7/tools/platform/osx64x86/bin
+ export DYLD_LIBRARY_PATH=:/Users/jenkins/mosek/7/tools/platform/osx64x86/bin
+ DYLD_LIBRARY_PATH=:/Users/jenkins/mosek/7/tools/platform/osx64x86/bin
+ python /Users/jenkins/mosek/7/tools/platform/osx64x86/python/2/setup.py install
running install
running build
running build_py
running install_lib
creating /Users/jenkins/workspace/gplibrary_PR_Models/mosek/venv2_gpkit/lib/python2.7/site-packages/mosek
copying build/lib/mosek/__init__.py -> /Users/jenkins/workspace/gplibrary_PR_Models/mosek/venv2_gpkit/lib/python2.7/site-packages/mosek
copying build/lib/mosek/array.py -> /Users/jenkins/workspace/gplibrary_PR_Models/mosek/venv2_gpkit/lib/python2.7/site-packages/mosek
creating /Users/jenkins/workspace/gplibrary_PR_Models/mosek/venv2_gpkit/lib/python2.7/site-packages/mosek/fusion
copying build/lib/mosek/fusion/__init__.py -> /Users/jenkins/workspace/gplibrary_PR_Models/mosek/venv2_gpkit/lib/python2.7/site-packages/mosek/fusion
copying build/lib/mosek/fusion/SolverInfo.py -> /Users/jenkins/workspace/gplibrary_PR_Models/mosek/venv2_gpkit/lib/python2.7/site-packages/mosek/fusion
copying build/lib/mosek/fusion/Utils.py -> /Users/jenkins/workspace/gplibrary_PR_Models/mosek/venv2_gpkit/lib/python2.7/site-packages/mosek/fusion
byte-compiling /Users/jenkins/workspace/gplibrary_PR_Models/mosek/venv2_gpkit/lib/python2.7/site-packages/mosek/__init__.py to __init__.pyc
byte-compiling /Users/jenkins/workspace/gplibrary_PR_Models/mosek/venv2_gpkit/lib/python2.7/site-packages/mosek/array.py to array.pyc
byte-compiling /Users/jenkins/workspace/gplibrary_PR_Models/mosek/venv2_gpkit/lib/python2.7/site-packages/mosek/fusion/__init__.py to __init__.pyc
byte-compiling /Users/jenkins/workspace/gplibrary_PR_Models/mosek/venv2_gpkit/lib/python2.7/site-packages/mosek/fusion/SolverInfo.py to SolverInfo.pyc
byte-compiling /Users/jenkins/workspace/gplibrary_PR_Models/mosek/venv2_gpkit/lib/python2.7/site-packages/mosek/fusion/Utils.py to Utils.pyc
running install_data
copying /Users/jenkins/mosek/7/tools/platform/osx64x86/python/2/../../bin/libmosek64.7.1.dylib -> /Users/jenkins/workspace/gplibrary_PR_Models/mosek/venv2_gpkit/lib/python2.7/site-packages/mosek
copying /Users/jenkins/mosek/7/tools/platform/osx64x86/python/2/../../bin/libmosekglb64.7.1.dylib -> /Users/jenkins/workspace/gplibrary_PR_Models/mosek/venv2_gpkit/lib/python2.7/site-packages/mosek
copying /Users/jenkins/mosek/7/tools/platform/osx64x86/python/2/../../bin/libiomp5.dylib -> /Users/jenkins/workspace/gplibrary_PR_Models/mosek/venv2_gpkit/lib/python2.7/site-packages/mosek
copying /Users/jenkins/mosek/7/tools/platform/osx64x86/python/2/../../bin/libmosekxx7_1.dylib -> /Users/jenkins/workspace/gplibrary_PR_Models/mosek/venv2_gpkit/lib/python2.7/site-packages/mosek
copying /Users/jenkins/mosek/7/tools/platform/osx64x86/python/2/../../../../../license.pdf -> /Users/jenkins/workspace/gplibrary_PR_Models/mosek/venv2_gpkit/lib/python2.7/site-packages/mosek
running install_egg_info
Writing /Users/jenkins/workspace/gplibrary_PR_Models/mosek/venv2_gpkit/lib/python2.7/site-packages/Mosek-7.1.28-py2.7.egg-info
Please review the MOSEK license conditions in license.pdf
+ [[ mosek == mosek ]]
+ python -c '__import__("mosek").Env()'
+ msktestlic
Computer
  Platform               : MACOSX/64-X86   
  Cores                  : 4               

Problem
  Name                   :                 
  Objective sense        : min             
  Type                   : LO (linear optimization problem)
  Constraints            : 1               
  Cones                  : 0               
  Scalar variables       : 5000            
  Matrix variables       : 0               
  Integer variables      : 0               

Optimizer started.
Interior-point optimizer started.
Presolve started.
Linear dependency checker started.
Linear dependency checker terminated.
Eliminator - tries                  : 0                 time                   : 0.00            
Eliminator - elim's                 : 0               
Lin. dep.  - tries                  : 1                 time                   : 0.00            
Lin. dep.  - number                 : 0               
Presolve terminated. Time: 0.00    
Interior-point optimizer terminated. Time: 0.00. 

Optimizer terminated. Time: 0.03    
************************************
A license was checked out correctly.
************************************
+ export 'GPKITSOLVERS=mosek, mosek_cli'
+ GPKITSOLVERS='mosek, mosek_cli'
+ [[ mosek == cvxopt ]]
+ pip_install xmlrunner
+ python /Users/jenkins/workspace/gplibrary_PR_Models/mosek/venv2_gpkit/bin/pip install --upgrade xmlrunner
DEPRECATION: Python 2.7 will reach the end of its life on January 1st, 2020. Please upgrade your Python as Python 2.7 won't be maintained after that date. A future version of pip will drop support for Python 2.7. More details about Python 2 support in pip, can be found at https://pip.pypa.io/en/latest/development/release-process/#python-2-support
Collecting xmlrunner
Installing collected packages: xmlrunner
Successfully installed xmlrunner-1.7.7
+ pip_install pint
+ python /Users/jenkins/workspace/gplibrary_PR_Models/mosek/venv2_gpkit/bin/pip install --upgrade pint
DEPRECATION: Python 2.7 will reach the end of its life on January 1st, 2020. Please upgrade your Python as Python 2.7 won't be maintained after that date. A future version of pip will drop support for Python 2.7. More details about Python 2 support in pip, can be found at https://pip.pypa.io/en/latest/development/release-process/#python-2-support
Collecting pint
  Using cached https://files.pythonhosted.org/packages/15/9d/bf177ebbc57d25e9e296addc14a1303d1e34d7964af5df428a8332349c42/Pint-0.9-py2.py3-none-any.whl
Collecting funcsigs; python_version == "2.7" (from pint)
  Using cached https://files.pythonhosted.org/packages/69/cb/f5be453359271714c01b9bd06126eaf2e368f1fddfff30818754b5ac2328/funcsigs-1.0.2-py2.py3-none-any.whl
Installing collected packages: funcsigs, pint
Successfully installed funcsigs-1.0.2 pint-0.9
+ pip_install numpy
+ python /Users/jenkins/workspace/gplibrary_PR_Models/mosek/venv2_gpkit/bin/pip install --upgrade numpy
DEPRECATION: Python 2.7 will reach the end of its life on January 1st, 2020. Please upgrade your Python as Python 2.7 won't be maintained after that date. A future version of pip will drop support for Python 2.7. More details about Python 2 support in pip, can be found at https://pip.pypa.io/en/latest/development/release-process/#python-2-support
Collecting numpy
  Using cached https://files.pythonhosted.org/packages/51/67/8907005262f493e356195bcbd61b41988eecf63cb1d97ea2f6e55fe24205/numpy-1.16.5-cp27-cp27m-macosx_10_9_x86_64.whl
Installing collected packages: numpy
Successfully installed numpy-1.16.5
+ pip_install scipy
+ python /Users/jenkins/workspace/gplibrary_PR_Models/mosek/venv2_gpkit/bin/pip install --upgrade scipy
DEPRECATION: Python 2.7 will reach the end of its life on January 1st, 2020. Please upgrade your Python as Python 2.7 won't be maintained after that date. A future version of pip will drop support for Python 2.7. More details about Python 2 support in pip, can be found at https://pip.pypa.io/en/latest/development/release-process/#python-2-support
Collecting scipy
  Using cached https://files.pythonhosted.org/packages/a3/cf/36b77de4ccb1b841acd4c3c03abe38843c63c3a657cedee9e8fb19a02dc8/scipy-1.2.2-cp27-cp27m-macosx_10_6_intel.macosx_10_9_intel.macosx_10_9_x86_64.macosx_10_10_intel.macosx_10_10_x86_64.whl
Requirement already satisfied, skipping upgrade: numpy>=1.8.2 in ./venv2_gpkit/lib/python2.7/site-packages (from scipy) (1.16.5)
Installing collected packages: scipy
Successfully installed scipy-1.2.2
+ pip_install ad
+ python /Users/jenkins/workspace/gplibrary_PR_Models/mosek/venv2_gpkit/bin/pip install --upgrade ad
DEPRECATION: Python 2.7 will reach the end of its life on January 1st, 2020. Please upgrade your Python as Python 2.7 won't be maintained after that date. A future version of pip will drop support for Python 2.7. More details about Python 2 support in pip, can be found at https://pip.pypa.io/en/latest/development/release-process/#python-2-support
Collecting ad
Installing collected packages: ad
Successfully installed ad-1.3.2
+ pip_install ctypesgen
+ python /Users/jenkins/workspace/gplibrary_PR_Models/mosek/venv2_gpkit/bin/pip install --upgrade ctypesgen
DEPRECATION: Python 2.7 will reach the end of its life on January 1st, 2020. Please upgrade your Python as Python 2.7 won't be maintained after that date. A future version of pip will drop support for Python 2.7. More details about Python 2 support in pip, can be found at https://pip.pypa.io/en/latest/development/release-process/#python-2-support
Collecting ctypesgen
  Using cached https://files.pythonhosted.org/packages/77/e8/73c5636dd329bcb781e3fc8762342ce4c543c279ceab9eeb06f3f2a4b241/ctypesgen-1.0.0.post4-py2.py3-none-any.whl
Installing collected packages: ctypesgen
Successfully installed ctypesgen-1.0.0.post4
+ pip_install pandas
+ python /Users/jenkins/workspace/gplibrary_PR_Models/mosek/venv2_gpkit/bin/pip install --upgrade pandas
DEPRECATION: Python 2.7 will reach the end of its life on January 1st, 2020. Please upgrade your Python as Python 2.7 won't be maintained after that date. A future version of pip will drop support for Python 2.7. More details about Python 2 support in pip, can be found at https://pip.pypa.io/en/latest/development/release-process/#python-2-support
Collecting pandas
  Using cached https://files.pythonhosted.org/packages/52/ff/912fe03a623a70bcf297d466013a0b4f4c68c3b60f86bf226682d061fc09/pandas-0.24.2-cp27-cp27m-macosx_10_6_intel.macosx_10_9_intel.macosx_10_9_x86_64.macosx_10_10_intel.macosx_10_10_x86_64.whl
Collecting pytz>=2011k (from pandas)
  Using cached https://files.pythonhosted.org/packages/87/76/46d697698a143e05f77bec5a526bf4e56a0be61d63425b68f4ba553b51f2/pytz-2019.2-py2.py3-none-any.whl
Requirement already satisfied, skipping upgrade: numpy>=1.12.0 in ./venv2_gpkit/lib/python2.7/site-packages (from pandas) (1.16.5)
Collecting python-dateutil>=2.5.0 (from pandas)
  Using cached https://files.pythonhosted.org/packages/41/17/c62faccbfbd163c7f57f3844689e3a78bae1f403648a6afb1d0866d87fbb/python_dateutil-2.8.0-py2.py3-none-any.whl
Collecting six>=1.5 (from python-dateutil>=2.5.0->pandas)
  Using cached https://files.pythonhosted.org/packages/73/fb/00a976f728d0d1fecfe898238ce23f502a721c0ac0ecfedb80e0d88c64e9/six-1.12.0-py2.py3-none-any.whl
Installing collected packages: pytz, six, python-dateutil, pandas
Successfully installed pandas-0.24.2 python-dateutil-2.8.0 pytz-2019.2 six-1.12.0
+ pip_install matplotlib
+ python /Users/jenkins/workspace/gplibrary_PR_Models/mosek/venv2_gpkit/bin/pip install --upgrade matplotlib
DEPRECATION: Python 2.7 will reach the end of its life on January 1st, 2020. Please upgrade your Python as Python 2.7 won't be maintained after that date. A future version of pip will drop support for Python 2.7. More details about Python 2 support in pip, can be found at https://pip.pypa.io/en/latest/development/release-process/#python-2-support
Collecting matplotlib
  Using cached https://files.pythonhosted.org/packages/3e/d6/4c949597c4186599cc8be08cd11b1e83fe7966676aeee3868bf3e581d852/matplotlib-2.2.4-cp27-cp27m-macosx_10_6_intel.macosx_10_9_intel.macosx_10_9_x86_64.macosx_10_10_intel.macosx_10_10_x86_64.whl
Collecting backports.functools-lru-cache (from matplotlib)
  Using cached https://files.pythonhosted.org/packages/03/8e/2424c0e65c4a066e28f539364deee49b6451f8fcd4f718fefa50cc3dcf48/backports.functools_lru_cache-1.5-py2.py3-none-any.whl
Requirement already satisfied, skipping upgrade: six>=1.10 in ./venv2_gpkit/lib/python2.7/site-packages (from matplotlib) (1.12.0)
Requirement already satisfied, skipping upgrade: pytz in ./venv2_gpkit/lib/python2.7/site-packages (from matplotlib) (2019.2)
Collecting subprocess32 (from matplotlib)
  Using cached https://files.pythonhosted.org/packages/35/f3/7cdeeef9cb05c42fadcc8aa040dd3b80d94e0f6a8dedc4bacebf796c2385/subprocess32-3.5.4-cp27-cp27m-macosx_10_6_intel.whl
Collecting cycler>=0.10 (from matplotlib)
  Using cached https://files.pythonhosted.org/packages/f7/d2/e07d3ebb2bd7af696440ce7e754c59dd546ffe1bbe732c8ab68b9c834e61/cycler-0.10.0-py2.py3-none-any.whl
Collecting kiwisolver>=1.0.1 (from matplotlib)
  Using cached https://files.pythonhosted.org/packages/0d/15/ec5f70ac79f378ed0ef5ed8b71e8a04e382115426b2cda9a3ab5ffcf467f/kiwisolver-1.1.0-cp27-cp27m-macosx_10_6_intel.macosx_10_9_intel.macosx_10_9_x86_64.macosx_10_10_intel.macosx_10_10_x86_64.whl
Requirement already satisfied, skipping upgrade: python-dateutil>=2.1 in ./venv2_gpkit/lib/python2.7/site-packages (from matplotlib) (2.8.0)
Collecting pyparsing!=2.0.4,!=2.1.2,!=2.1.6,>=2.0.1 (from matplotlib)
  Using cached https://files.pythonhosted.org/packages/11/fa/0160cd525c62d7abd076a070ff02b2b94de589f1a9789774f17d7c54058e/pyparsing-2.4.2-py2.py3-none-any.whl
Requirement already satisfied, skipping upgrade: numpy>=1.7.1 in ./venv2_gpkit/lib/python2.7/site-packages (from matplotlib) (1.16.5)
Requirement already satisfied, skipping upgrade: setuptools in ./venv2_gpkit/lib/python2.7/site-packages (from kiwisolver>=1.0.1->matplotlib) (41.2.0)
Installing collected packages: backports.functools-lru-cache, subprocess32, cycler, kiwisolver, pyparsing, matplotlib
Successfully installed backports.functools-lru-cache-1.5 cycler-0.10.0 kiwisolver-1.1.0 matplotlib-2.2.4 pyparsing-2.4.2 subprocess32-3.5.4
+ export GPKITBUILD=/Users/jenkins/workspace/gplibrary_PR_Models/mosek/build_gpkit
+ GPKITBUILD=/Users/jenkins/workspace/gplibrary_PR_Models/mosek/build_gpkit
+ python -c 'import scipy; print scipy.__version__'
1.2.2
+ python -c 'import numpy; print numpy.__version__'
1.16.5
+ python -c 'import pint; print pint.__version__'
0.9
+ git clone --depth 1 https://github.com/convexengineering/gpkit.git
Cloning into 'gpkit'...
+ python /Users/jenkins/workspace/gplibrary_PR_Models/mosek/venv2_gpkit/bin/pip install --no-cache-dir -e /Users/jenkins/workspace/gplibrary_PR_Models/mosek/gpkit
DEPRECATION: Python 2.7 will reach the end of its life on January 1st, 2020. Please upgrade your Python as Python 2.7 won't be maintained after that date. A future version of pip will drop support for Python 2.7. More details about Python 2 support in pip, can be found at https://pip.pypa.io/en/latest/development/release-process/#python-2-support
Obtaining file:///Users/jenkins/workspace/gplibrary_PR_Models/mosek/gpkit
Requirement already satisfied: numpy>=1.13.3 in ./venv2_gpkit/lib/python2.7/site-packages (from gpkit==0.9.1.0) (1.16.5)
Requirement already satisfied: pint>=0.8.1 in ./venv2_gpkit/lib/python2.7/site-packages (from gpkit==0.9.1.0) (0.9)
Requirement already satisfied: scipy in ./venv2_gpkit/lib/python2.7/site-packages (from gpkit==0.9.1.0) (1.2.2)
Requirement already satisfied: ad in ./venv2_gpkit/lib/python2.7/site-packages (from gpkit==0.9.1.0) (1.3.2)
Collecting cvxopt>=1.1.8 (from gpkit==0.9.1.0)
  Downloading https://files.pythonhosted.org/packages/69/4f/167a7f5b11274eb8722e93b26c687c71499ae563083104c5b25dd2252990/cvxopt-1.2.3-cp27-cp27m-macosx_10_6_intel.macosx_10_9_intel.macosx_10_9_x86_64.macosx_10_10_intel.macosx_10_10_x86_64.whl (5.7MB)
Requirement already satisfied: six in ./venv2_gpkit/lib/python2.7/site-packages (from gpkit==0.9.1.0) (1.12.0)
Requirement already satisfied: funcsigs; python_version == "2.7" in ./venv2_gpkit/lib/python2.7/site-packages (from pint>=0.8.1->gpkit==0.9.1.0) (1.0.2)
Installing collected packages: cvxopt, gpkit
  Running setup.py develop for gpkit
Successfully installed cvxopt-1.2.3 gpkit
+ python /Users/jenkins/workspace/gplibrary_PR_Models/mosek/venv2_gpkit/bin/pip install --no-cache-dir -e /Users/jenkins/workspace/gplibrary_PR_Models/mosek
DEPRECATION: Python 2.7 will reach the end of its life on January 1st, 2020. Please upgrade your Python as Python 2.7 won't be maintained after that date. A future version of pip will drop support for Python 2.7. More details about Python 2 support in pip, can be found at https://pip.pypa.io/en/latest/development/release-process/#python-2-support
Obtaining file:///Users/jenkins/workspace/gplibrary_PR_Models/mosek
Requirement already satisfied: numpy>=1.12 in ./venv2_gpkit/lib/python2.7/site-packages (from gpkitmodels==0.0.0.0) (1.16.5)
Requirement already satisfied: scipy in ./venv2_gpkit/lib/python2.7/site-packages (from gpkitmodels==0.0.0.0) (1.2.2)
Requirement already satisfied: pint in ./venv2_gpkit/lib/python2.7/site-packages (from gpkitmodels==0.0.0.0) (0.9)
Collecting future (from gpkitmodels==0.0.0.0)
  Downloading https://files.pythonhosted.org/packages/90/52/e20466b85000a181e1e144fd8305caf2cf475e2f9674e797b222f8105f5f/future-0.17.1.tar.gz (829kB)
Requirement already satisfied: funcsigs; python_version == "2.7" in ./venv2_gpkit/lib/python2.7/site-packages (from pint->gpkitmodels==0.0.0.0) (1.0.2)
Building wheels for collected packages: future
  Building wheel for future (setup.py): started
  Building wheel for future (setup.py): finished with status 'done'
  Created wheel for future: filename=future-0.17.1-cp27-none-any.whl size=500237 sha256=fd1ae8657c77bceeaa9099a14af9b5b674bba7716c960ea68a795adc636e45cc
  Stored in directory: /private/var/folders/42/s1whb7rd4mddfcnzk96g_d9h0000gp/T/pip-ephem-wheel-cache-WKsUWR/wheels/0c/61/d2/d6b7317325828fbb39ee6ad559dbe4664d0896da4721bf379e
Successfully built future
Installing collected packages: future, gpkitmodels
  Running setup.py develop for gpkitmodels
Successfully installed future-0.17.1 gpkitmodels
+ export MSK_IPAR_NUM_THREADS=2
+ MSK_IPAR_NUM_THREADS=2
+ export MKL_NUM_THREADS=2
+ MKL_NUM_THREADS=2
+ export NUMEXPR_NUM_THREADS=2
+ NUMEXPR_NUM_THREADS=2
+ export OPENBLAS_NUM_THREADS=2
+ OPENBLAS_NUM_THREADS=2
+ export OMP_NUM_THREADS=2
+ OMP_NUM_THREADS=2
+ python -c 'from gpkit.tests.test_repo import test_repos; test_repos(xmloutput=True, ingpkitmodels=True)'
No filename given.
Usage:
     mskexpopt FILENAME [-primal] [-dual] [-p parameterfile]
Return code: 1052
Description: MSK_RES_ERR_FILE_OPEN [An error occurred while opening a file.]
...................................................................................................................................................................................................................................................
----------------------------------------------------------------------
Ran 243 tests in 41.599s

OK
DEPRECATION: Python 2.7 will reach the end of its life on January 1st, 2020. Please upgrade your Python as Python 2.7 won't be maintained after that date. A future version of pip will drop support for Python 2.7. More details about Python 2 support in pip, can be found at https://pip.pypa.io/en/latest/development/release-process/#python-2-support
Obtaining file:///Users/jenkins/workspace/gplibrary_PR_Models/mosek
Installing collected packages: gpkitmodels
  Found existing installation: gpkitmodels 0.0.0.0
    Uninstalling gpkitmodels-0.0.0.0:
      Successfully uninstalled gpkitmodels-0.0.0.0
  Running setup.py develop for gpkitmodels
Successfully installed gpkitmodels
Cloning into 'robust'...
DEPRECATION: Python 2.7 will reach the end of its life on January 1st, 2020. Please upgrade your Python as Python 2.7 won't be maintained after that date. A future version of pip will drop support for Python 2.7. More details about Python 2 support in pip, can be found at https://pip.pypa.io/en/latest/development/release-process/#python-2-support
Processing /Users/jenkins/workspace/gplibrary_PR_Models/mosek/robust
Requirement already satisfied: gpkit in /Users/jenkins/workspace/gplibrary_PR_Models/mosek/gpkit (from robust==0.0.0) (0.9.1.0)
Requirement already satisfied: numpy in /Users/jenkins/workspace/gplibrary_PR_Models/mosek/venv2_gpkit/lib/python2.7/site-packages (from robust==0.0.0) (1.16.5)
Requirement already satisfied: matplotlib in /Users/jenkins/workspace/gplibrary_PR_Models/mosek/venv2_gpkit/lib/python2.7/site-packages (from robust==0.0.0) (2.2.4)
Requirement already satisfied: scipy in /Users/jenkins/workspace/gplibrary_PR_Models/mosek/venv2_gpkit/lib/python2.7/site-packages (from robust==0.0.0) (1.2.2)
Requirement already satisfied: pint>=0.8.1 in /Users/jenkins/workspace/gplibrary_PR_Models/mosek/venv2_gpkit/lib/python2.7/site-packages (from gpkit->robust==0.0.0) (0.9)
Requirement already satisfied: ad in /Users/jenkins/workspace/gplibrary_PR_Models/mosek/venv2_gpkit/lib/python2.7/site-packages (from gpkit->robust==0.0.0) (1.3.2)
Requirement already satisfied: cvxopt>=1.1.8 in /Users/jenkins/workspace/gplibrary_PR_Models/mosek/venv2_gpkit/lib/python2.7/site-packages (from gpkit->robust==0.0.0) (1.2.3)
Requirement already satisfied: six in /Users/jenkins/workspace/gplibrary_PR_Models/mosek/venv2_gpkit/lib/python2.7/site-packages (from gpkit->robust==0.0.0) (1.12.0)
Requirement already satisfied: backports.functools-lru-cache in /Users/jenkins/workspace/gplibrary_PR_Models/mosek/venv2_gpkit/lib/python2.7/site-packages (from matplotlib->robust==0.0.0) (1.5)
Requirement already satisfied: pytz in /Users/jenkins/workspace/gplibrary_PR_Models/mosek/venv2_gpkit/lib/python2.7/site-packages (from matplotlib->robust==0.0.0) (2019.2)
Requirement already satisfied: subprocess32 in /Users/jenkins/workspace/gplibrary_PR_Models/mosek/venv2_gpkit/lib/python2.7/site-packages (from matplotlib->robust==0.0.0) (3.5.4)
Requirement already satisfied: cycler>=0.10 in /Users/jenkins/workspace/gplibrary_PR_Models/mosek/venv2_gpkit/lib/python2.7/site-packages (from matplotlib->robust==0.0.0) (0.10.0)
Requirement already satisfied: kiwisolver>=1.0.1 in /Users/jenkins/workspace/gplibrary_PR_Models/mosek/venv2_gpkit/lib/python2.7/site-packages (from matplotlib->robust==0.0.0) (1.1.0)
Requirement already satisfied: python-dateutil>=2.1 in /Users/jenkins/workspace/gplibrary_PR_Models/mosek/venv2_gpkit/lib/python2.7/site-packages (from matplotlib->robust==0.0.0) (2.8.0)
Requirement already satisfied: pyparsing!=2.0.4,!=2.1.2,!=2.1.6,>=2.0.1 in /Users/jenkins/workspace/gplibrary_PR_Models/mosek/venv2_gpkit/lib/python2.7/site-packages (from matplotlib->robust==0.0.0) (2.4.2)
Requirement already satisfied: funcsigs; python_version == "2.7" in /Users/jenkins/workspace/gplibrary_PR_Models/mosek/venv2_gpkit/lib/python2.7/site-packages (from pint>=0.8.1->gpkit->robust==0.0.0) (1.0.2)
Requirement already satisfied: setuptools in /Users/jenkins/workspace/gplibrary_PR_Models/mosek/venv2_gpkit/lib/python2.7/site-packages (from kiwisolver>=1.0.1->matplotlib->robust==0.0.0) (41.2.0)
Building wheels for collected packages: robust
  Building wheel for robust (setup.py): started
  Building wheel for robust (setup.py): finished with status 'done'
  Created wheel for robust: filename=robust-0.0.0-cp27-none-any.whl size=219042 sha256=2d3057a7d40a60caaec49d62e0e455c35dac082de7633a5417f1b45f7546f926
  Stored in directory: /private/var/folders/42/s1whb7rd4mddfcnzk96g_d9h0000gp/T/pip-ephem-wheel-cache-aTn5R9/wheels/22/12/0d/4cd87212a5369939713bc87a1d35b7ec6802444dd917e80b58
Successfully built robust
Installing collected packages: robust
Successfully installed robust-0.0.0

Running tests...
----------------------------------------------------------------------
.................
----------------------------------------------------------------------
Ran 17 tests in 16.046s

OK
..................
----------------------------------------------------------------------
Ran 17 tests in 41.135s

OK
.
----------------------------------------------------------------------
Ran 2 tests in 57.651s

OK

Generating XML reports...
adding test for 'run_tests.py'
Cloning into 'shopping'...

Running tests...
----------------------------------------------------------------------
...
----------------------------------------------------------------------
Ran 3 tests in 0.723s

OK

Generating XML reports...
adding test for 'test.py'
Using solver 'mosek'
Solving for 25 variables.
Solving took 0.0203 seconds.
Using solver 'mosek'
Solving for 25 variables.
Solving took 0.201 seconds.
Using solver 'mosek_cli'
Solving for 25 variables.
Solving took 0.251 seconds.
Cloning into 'gassolar'...
DEPRECATION: Python 2.7 will reach the end of its life on January 1st, 2020. Please upgrade your Python as Python 2.7 won't be maintained after that date. A future version of pip will drop support for Python 2.7. More details about Python 2 support in pip, can be found at https://pip.pypa.io/en/latest/development/release-process/#python-2-support
Requirement already satisfied: pandas in /Users/jenkins/workspace/gplibrary_PR_Models/mosek/venv2_gpkit/lib/python2.7/site-packages (0.24.2)
Requirement already satisfied: pytz>=2011k in /Users/jenkins/workspace/gplibrary_PR_Models/mosek/venv2_gpkit/lib/python2.7/site-packages (from pandas) (2019.2)
Requirement already satisfied: numpy>=1.12.0 in /Users/jenkins/workspace/gplibrary_PR_Models/mosek/venv2_gpkit/lib/python2.7/site-packages (from pandas) (1.16.5)
Requirement already satisfied: python-dateutil>=2.5.0 in /Users/jenkins/workspace/gplibrary_PR_Models/mosek/venv2_gpkit/lib/python2.7/site-packages (from pandas) (2.8.0)
Requirement already satisfied: six>=1.5 in /Users/jenkins/workspace/gplibrary_PR_Models/mosek/venv2_gpkit/lib/python2.7/site-packages (from python-dateutil>=2.5.0->pandas) (1.12.0)
DEPRECATION: Python 2.7 will reach the end of its life on January 1st, 2020. Please upgrade your Python as Python 2.7 won't be maintained after that date. A future version of pip will drop support for Python 2.7. More details about Python 2 support in pip, can be found at https://pip.pypa.io/en/latest/development/release-process/#python-2-support
Collecting git+https://github.com/hoburg/gpfit.git
  Cloning https://github.com/hoburg/gpfit.git to /private/var/folders/42/s1whb7rd4mddfcnzk96g_d9h0000gp/T/pip-req-build-dYaFEQ
  Running command git clone -q https://github.com/hoburg/gpfit.git /private/var/folders/42/s1whb7rd4mddfcnzk96g_d9h0000gp/T/pip-req-build-dYaFEQ
Requirement already satisfied: numpy in /Users/jenkins/workspace/gplibrary_PR_Models/mosek/venv2_gpkit/lib/python2.7/site-packages (from gpfit==0.1) (1.16.5)
Requirement already satisfied: scipy in /Users/jenkins/workspace/gplibrary_PR_Models/mosek/venv2_gpkit/lib/python2.7/site-packages (from gpfit==0.1) (1.2.2)
Requirement already satisfied: gpkit in /Users/jenkins/workspace/gplibrary_PR_Models/mosek/gpkit (from gpfit==0.1) (0.9.1.0)
Requirement already satisfied: pint>=0.8.1 in /Users/jenkins/workspace/gplibrary_PR_Models/mosek/venv2_gpkit/lib/python2.7/site-packages (from gpkit->gpfit==0.1) (0.9)
Requirement already satisfied: ad in /Users/jenkins/workspace/gplibrary_PR_Models/mosek/venv2_gpkit/lib/python2.7/site-packages (from gpkit->gpfit==0.1) (1.3.2)
Requirement already satisfied: cvxopt>=1.1.8 in /Users/jenkins/workspace/gplibrary_PR_Models/mosek/venv2_gpkit/lib/python2.7/site-packages (from gpkit->gpfit==0.1) (1.2.3)
Requirement already satisfied: six in /Users/jenkins/workspace/gplibrary_PR_Models/mosek/venv2_gpkit/lib/python2.7/site-packages (from gpkit->gpfit==0.1) (1.12.0)
Requirement already satisfied: funcsigs; python_version == "2.7" in /Users/jenkins/workspace/gplibrary_PR_Models/mosek/venv2_gpkit/lib/python2.7/site-packages (from pint>=0.8.1->gpkit->gpfit==0.1) (1.0.2)
Building wheels for collected packages: gpfit
  Building wheel for gpfit (setup.py): started
  Building wheel for gpfit (setup.py): finished with status 'done'
  Created wheel for gpfit: filename=gpfit-0.1-cp27-none-any.whl size=25151 sha256=4bc2c27c0cdd2eeb60d9db8482eba601bdc1983dd70ff619bc273313a97e044e
  Stored in directory: /private/var/folders/42/s1whb7rd4mddfcnzk96g_d9h0000gp/T/pip-ephem-wheel-cache-aNypIv/wheels/4d/4b/2e/9480645acbe8d32004b09b3732f616bbb2a9ee75e4526f058f
Successfully built gpfit
Installing collected packages: gpfit
Successfully installed gpfit-0.1
DEPRECATION: Python 2.7 will reach the end of its life on January 1st, 2020. Please upgrade your Python as Python 2.7 won't be maintained after that date. A future version of pip will drop support for Python 2.7. More details about Python 2 support in pip, can be found at https://pip.pypa.io/en/latest/development/release-process/#python-2-support
Processing /Users/jenkins/workspace/gplibrary_PR_Models/mosek/gassolar
Requirement already satisfied: numpy in /Users/jenkins/workspace/gplibrary_PR_Models/mosek/venv2_gpkit/lib/python2.7/site-packages (from gassolar==0.0.0.0) (1.16.5)
Requirement already satisfied: scipy in /Users/jenkins/workspace/gplibrary_PR_Models/mosek/venv2_gpkit/lib/python2.7/site-packages (from gassolar==0.0.0.0) (1.2.2)
Requirement already satisfied: gpkit in /Users/jenkins/workspace/gplibrary_PR_Models/mosek/gpkit (from gassolar==0.0.0.0) (0.9.1.0)
Requirement already satisfied: pandas in /Users/jenkins/workspace/gplibrary_PR_Models/mosek/venv2_gpkit/lib/python2.7/site-packages (from gassolar==0.0.0.0) (0.24.2)
Requirement already satisfied: gpfit in /Users/jenkins/workspace/gplibrary_PR_Models/mosek/venv2_gpkit/lib/python2.7/site-packages (from gassolar==0.0.0.0) (0.1)
Requirement already satisfied: pint>=0.8.1 in /Users/jenkins/workspace/gplibrary_PR_Models/mosek/venv2_gpkit/lib/python2.7/site-packages (from gpkit->gassolar==0.0.0.0) (0.9)
Requirement already satisfied: ad in /Users/jenkins/workspace/gplibrary_PR_Models/mosek/venv2_gpkit/lib/python2.7/site-packages (from gpkit->gassolar==0.0.0.0) (1.3.2)
Requirement already satisfied: cvxopt>=1.1.8 in /Users/jenkins/workspace/gplibrary_PR_Models/mosek/venv2_gpkit/lib/python2.7/site-packages (from gpkit->gassolar==0.0.0.0) (1.2.3)
Requirement already satisfied: six in /Users/jenkins/workspace/gplibrary_PR_Models/mosek/venv2_gpkit/lib/python2.7/site-packages (from gpkit->gassolar==0.0.0.0) (1.12.0)
Requirement already satisfied: pytz>=2011k in /Users/jenkins/workspace/gplibrary_PR_Models/mosek/venv2_gpkit/lib/python2.7/site-packages (from pandas->gassolar==0.0.0.0) (2019.2)
Requirement already satisfied: python-dateutil>=2.5.0 in /Users/jenkins/workspace/gplibrary_PR_Models/mosek/venv2_gpkit/lib/python2.7/site-packages (from pandas->gassolar==0.0.0.0) (2.8.0)
Requirement already satisfied: funcsigs; python_version == "2.7" in /Users/jenkins/workspace/gplibrary_PR_Models/mosek/venv2_gpkit/lib/python2.7/site-packages (from pint>=0.8.1->gpkit->gassolar==0.0.0.0) (1.0.2)
Building wheels for collected packages: gassolar
  Building wheel for gassolar (setup.py): started
  Building wheel for gassolar (setup.py): finished with status 'done'
  Created wheel for gassolar: filename=gassolar-0.0.0.0-cp27-none-any.whl size=4876517 sha256=bc4d7f431451516f7b05863ac2e3f35f065a03b21f82cea37da4089c2546918f
  Stored in directory: /private/var/folders/42/s1whb7rd4mddfcnzk96g_d9h0000gp/T/pip-ephem-wheel-cache-WX03BA/wheels/62/18/d3/616f96cc7315a5d96e00418a41713828819a211a1260f4c2f6
Successfully built gassolar
Installing collected packages: gassolar
Successfully installed gassolar-0.0.0.0

Running tests...
----------------------------------------------------------------------
/Users/jenkins/workspace/gplibrary_PR_Models/mosek/venv2_gpkit/lib/python2.7/site-packages/pint/quantity.py:1377: UnitStrippedWarning: The unit of the quantity is stripped.
  warnings.warn("The unit of the quantity is stripped.", UnitStrippedWarning)
../Users/jenkins/workspace/gplibrary_PR_Models/mosek/venv2_gpkit/lib/python2.7/site-packages/gassolar/environment/solar_irradiance.py:40: RuntimeWarning: overflow encountered in exp
  tau = np.exp(-0.175/costhsun)
..
----------------------------------------------------------------------
Ran 4 tests in 34.857s

OK

Generating XML reports...
adding test for 'gassolar/gas/gas.py'
adding test for 'gassolar/solar/solar.py'
Using solver 'mosek'
Solving for 592 variables.
Solving took 1.67 seconds.
Warning: Variable Mission.Climb.FlightSegment.AircraftPerf.EnginePerf.P_{total}[:]/Mission.Climb.FlightSegment.Aircraf could cause inaccurate result because it is above upper bound. Solution is 1.0000 but bound is 0.9685
Beginning signomial solve.
Solving took 4 GP solves and 2.32 seconds.
Warning: Variable Mission1.Climb.FlightSegment.AircraftPerf.EnginePerf.P_{total}[:]/Mission1.Climb.FlightSegment.Aircr could cause inaccurate result because it is above upper bound. Solution is 1.0000 but bound is 0.9685
Using solver 'mosek'
Solving for 592 variables.
Solving took 1.78 seconds.
Warning: Variable Mission.Climb.FlightSegment.AircraftPerf.EnginePerf.P_{total}[:]/Mission.Climb.FlightSegment.Aircraf could cause inaccurate result because it is above upper bound. Solution is 1.0000 but bound is 0.9685
Beginning signomial solve.
Solving took 4 GP solves and 2.66 seconds.
Warning: Variable Mission1.Climb.FlightSegment.AircraftPerf.EnginePerf.P_{total}[:]/Mission1.Climb.FlightSegment.Aircr could cause inaccurate result because it is above upper bound. Solution is 1.0000 but bound is 0.9685
Using solver 'mosek'
Solving for 1250 variables.
Solving took 0.456 seconds.
Warning: Variable Mission.FlightSegment.AircraftPerf.WingAero.Re could cause inaccurate result because it is below lower bound. Solution is 102558.3537 but bound is 150000.0000
Warning: Variable Mission.FlightSegment10.AircraftPerf.WingAero.Re could cause inaccurate result because it is below lower bound. Solution is 102558.3827 but bound is 150000.0000
Beginning signomial solve.
Solving took 4 GP solves and 2.93 seconds.
Warning: Variable Mission1.FlightSegment10.AircraftPerf.WingAero.Re could cause inaccurate result because it is below lower bound. Solution is 103406.0510 but bound is 150000.0000
Using solver 'mosek_cli'
Solving for 1250 variables.
Solving took 0.532 seconds.
Warning: Variable Mission.FlightSegment.AircraftPerf.WingAero.Re could cause inaccurate result because it is below lower bound. Solution is 102558.6388 but bound is 150000.0000
Warning: Variable Mission.FlightSegment10.AircraftPerf.WingAero.Re could cause inaccurate result because it is below lower bound. Solution is 102558.6388 but bound is 150000.0000
Beginning signomial solve.
Solving took 4 GP solves and 2.92 seconds.
Warning: Variable Mission1.FlightSegment10.AircraftPerf.WingAero.Re could cause inaccurate result because it is below lower bound. Solution is 103406.1793 but bound is 150000.0000
Cloning into 'jho'...
DEPRECATION: Python 2.7 will reach the end of its life on January 1st, 2020. Please upgrade your Python as Python 2.7 won't be maintained after that date. A future version of pip will drop support for Python 2.7. More details about Python 2 support in pip, can be found at https://pip.pypa.io/en/latest/development/release-process/#python-2-support
Requirement already satisfied: pandas in /Users/jenkins/workspace/gplibrary_PR_Models/mosek/venv2_gpkit/lib/python2.7/site-packages (0.24.2)
Requirement already satisfied: pytz>=2011k in /Users/jenkins/workspace/gplibrary_PR_Models/mosek/venv2_gpkit/lib/python2.7/site-packages (from pandas) (2019.2)
Requirement already satisfied: numpy>=1.12.0 in /Users/jenkins/workspace/gplibrary_PR_Models/mosek/venv2_gpkit/lib/python2.7/site-packages (from pandas) (1.16.5)
Requirement already satisfied: python-dateutil>=2.5.0 in /Users/jenkins/workspace/gplibrary_PR_Models/mosek/venv2_gpkit/lib/python2.7/site-packages (from pandas) (2.8.0)
Requirement already satisfied: six>=1.5 in /Users/jenkins/workspace/gplibrary_PR_Models/mosek/venv2_gpkit/lib/python2.7/site-packages (from python-dateutil>=2.5.0->pandas) (1.12.0)
DEPRECATION: Python 2.7 will reach the end of its life on January 1st, 2020. Please upgrade your Python as Python 2.7 won't be maintained after that date. A future version of pip will drop support for Python 2.7. More details about Python 2 support in pip, can be found at https://pip.pypa.io/en/latest/development/release-process/#python-2-support
Collecting git+https://github.com/hoburg/gpfit.git
  Cloning https://github.com/hoburg/gpfit.git to /private/var/folders/42/s1whb7rd4mddfcnzk96g_d9h0000gp/T/pip-req-build-lo385l
  Running command git clone -q https://github.com/hoburg/gpfit.git /private/var/folders/42/s1whb7rd4mddfcnzk96g_d9h0000gp/T/pip-req-build-lo385l
Requirement already satisfied (use --upgrade to upgrade): gpfit==0.1 from git+https://github.com/hoburg/gpfit.git in /Users/jenkins/workspace/gplibrary_PR_Models/mosek/venv2_gpkit/lib/python2.7/site-packages
Requirement already satisfied: numpy in /Users/jenkins/workspace/gplibrary_PR_Models/mosek/venv2_gpkit/lib/python2.7/site-packages (from gpfit==0.1) (1.16.5)
Requirement already satisfied: scipy in /Users/jenkins/workspace/gplibrary_PR_Models/mosek/venv2_gpkit/lib/python2.7/site-packages (from gpfit==0.1) (1.2.2)
Requirement already satisfied: gpkit in /Users/jenkins/workspace/gplibrary_PR_Models/mosek/gpkit (from gpfit==0.1) (0.9.1.0)
Requirement already satisfied: pint>=0.8.1 in /Users/jenkins/workspace/gplibrary_PR_Models/mosek/venv2_gpkit/lib/python2.7/site-packages (from gpkit->gpfit==0.1) (0.9)
Requirement already satisfied: ad in /Users/jenkins/workspace/gplibrary_PR_Models/mosek/venv2_gpkit/lib/python2.7/site-packages (from gpkit->gpfit==0.1) (1.3.2)
Requirement already satisfied: cvxopt>=1.1.8 in /Users/jenkins/workspace/gplibrary_PR_Models/mosek/venv2_gpkit/lib/python2.7/site-packages (from gpkit->gpfit==0.1) (1.2.3)
Requirement already satisfied: six in /Users/jenkins/workspace/gplibrary_PR_Models/mosek/venv2_gpkit/lib/python2.7/site-packages (from gpkit->gpfit==0.1) (1.12.0)
Requirement already satisfied: funcsigs; python_version == "2.7" in /Users/jenkins/workspace/gplibrary_PR_Models/mosek/venv2_gpkit/lib/python2.7/site-packages (from pint>=0.8.1->gpkit->gpfit==0.1) (1.0.2)
Building wheels for collected packages: gpfit
  Building wheel for gpfit (setup.py): started
  Building wheel for gpfit (setup.py): finished with status 'done'
  Created wheel for gpfit: filename=gpfit-0.1-cp27-none-any.whl size=25151 sha256=295f02b283f6b52fdae28936d368aa6f9962bc22b25838b2d4e9e0fad61f82b0
  Stored in directory: /private/var/folders/42/s1whb7rd4mddfcnzk96g_d9h0000gp/T/pip-ephem-wheel-cache-wknneV/wheels/4d/4b/2e/9480645acbe8d32004b09b3732f616bbb2a9ee75e4526f058f
Successfully built gpfit

Running tests...
----------------------------------------------------------------------
EEEE
======================================================================
ERROR [0.073s]: test_model_jho_py_mosek (gpkit.tests.from_paths.TestFiles)
----------------------------------------------------------------------
Traceback (most recent call last):
  File "/Users/jenkins/workspace/gplibrary_PR_Models/mosek/gpkit/gpkit/tests/helpers.py", line 64, in test
    testfn(name, import_dict, path)(self)
  File "/Users/jenkins/workspace/gplibrary_PR_Models/mosek/gpkit/gpkit/tests/from_paths.py", line 51, in <lambda>
    lambda self: getattr(self, name)()))  # pylint:disable=undefined-variable
  File "/Users/jenkins/workspace/gplibrary_PR_Models/mosek/gpkit/gpkit/tests/from_paths.py", line 37, in test_fn
    mod = __import__(os.path.basename(path)[:-3])
  File "jho.py", line 7, in <module>
  File "/Users/jenkins/workspace/gplibrary_PR_Models/mosek/gpkitmodels/GP/aircraft/fuselage/cylindrical_fuselage.py", line 5, in <module>
    from fuel_tank import FuelTank
ImportError: No module named fuel_tank

======================================================================
ERROR [0.002s]: test_model_jho_py_mosek_cli (gpkit.tests.from_paths.TestFiles)
----------------------------------------------------------------------
Traceback (most recent call last):
  File "/Users/jenkins/workspace/gplibrary_PR_Models/mosek/gpkit/gpkit/tests/helpers.py", line 64, in test
    testfn(name, import_dict, path)(self)
  File "/Users/jenkins/workspace/gplibrary_PR_Models/mosek/gpkit/gpkit/tests/from_paths.py", line 51, in <lambda>
    lambda self: getattr(self, name)()))  # pylint:disable=undefined-variable
  File "/Users/jenkins/workspace/gplibrary_PR_Models/mosek/gpkit/gpkit/tests/from_paths.py", line 37, in test_fn
    mod = __import__(os.path.basename(path)[:-3])
  File "jho.py", line 7, in <module>
  File "/Users/jenkins/workspace/gplibrary_PR_Models/mosek/gpkitmodels/GP/aircraft/fuselage/cylindrical_fuselage.py", line 5, in <module>
    from fuel_tank import FuelTank
ImportError: No module named fuel_tank

======================================================================
ERROR [0.161s]: test_model_print_perf_py_mosek (gpkit.tests.from_paths.TestFiles)
----------------------------------------------------------------------
Traceback (most recent call last):
  File "/Users/jenkins/workspace/gplibrary_PR_Models/mosek/gpkit/gpkit/tests/helpers.py", line 64, in test
    testfn(name, import_dict, path)(self)
  File "/Users/jenkins/workspace/gplibrary_PR_Models/mosek/gpkit/gpkit/tests/from_paths.py", line 51, in <lambda>
    lambda self: getattr(self, name)()))  # pylint:disable=undefined-variable
  File "/Users/jenkins/workspace/gplibrary_PR_Models/mosek/gpkit/gpkit/tests/from_paths.py", line 37, in test_fn
    mod = __import__(os.path.basename(path)[:-3])
  File "print_perf.py", line 4, in <module>
  File "jho.py", line 7, in <module>
  File "/Users/jenkins/workspace/gplibrary_PR_Models/mosek/gpkitmodels/GP/aircraft/fuselage/cylindrical_fuselage.py", line 5, in <module>
    from fuel_tank import FuelTank
ImportError: No module named fuel_tank

======================================================================
ERROR [0.003s]: test_model_print_perf_py_mosek_cli (gpkit.tests.from_paths.TestFiles)
----------------------------------------------------------------------
Traceback (most recent call last):
  File "/Users/jenkins/workspace/gplibrary_PR_Models/mosek/gpkit/gpkit/tests/helpers.py", line 64, in test
    testfn(name, import_dict, path)(self)
  File "/Users/jenkins/workspace/gplibrary_PR_Models/mosek/gpkit/gpkit/tests/from_paths.py", line 51, in <lambda>
    lambda self: getattr(self, name)()))  # pylint:disable=undefined-variable
  File "/Users/jenkins/workspace/gplibrary_PR_Models/mosek/gpkit/gpkit/tests/from_paths.py", line 37, in test_fn
    mod = __import__(os.path.basename(path)[:-3])
  File "print_perf.py", line 4, in <module>
  File "jho.py", line 7, in <module>
  File "/Users/jenkins/workspace/gplibrary_PR_Models/mosek/gpkitmodels/GP/aircraft/fuselage/cylindrical_fuselage.py", line 5, in <module>
    from fuel_tank import FuelTank
ImportError: No module named fuel_tank

----------------------------------------------------------------------
Ran 4 tests in 0.238s

FAILED (errors=4)

Generating XML reports...
adding test for 'model/jho.py'
adding test for 'model/print_perf.py'
Cloning into 'turbofan'...
DEPRECATION: Python 2.7 will reach the end of its life on January 1st, 2020. Please upgrade your Python as Python 2.7 won't be maintained after that date. A future version of pip will drop support for Python 2.7. More details about Python 2 support in pip, can be found at https://pip.pypa.io/en/latest/development/release-process/#python-2-support
Processing /Users/jenkins/workspace/gplibrary_PR_Models/mosek/turbofan
Requirement already satisfied: numpy in /Users/jenkins/workspace/gplibrary_PR_Models/mosek/venv2_gpkit/lib/python2.7/site-packages (from turbofan==0.0.0.0) (1.16.5)
Requirement already satisfied: scipy in /Users/jenkins/workspace/gplibrary_PR_Models/mosek/venv2_gpkit/lib/python2.7/site-packages (from turbofan==0.0.0.0) (1.2.2)
Requirement already satisfied: pint in /Users/jenkins/workspace/gplibrary_PR_Models/mosek/venv2_gpkit/lib/python2.7/site-packages (from turbofan==0.0.0.0) (0.9)
Requirement already satisfied: future in /Users/jenkins/workspace/gplibrary_PR_Models/mosek/venv2_gpkit/lib/python2.7/site-packages (from turbofan==0.0.0.0) (0.17.1)
Requirement already satisfied: funcsigs; python_version == "2.7" in /Users/jenkins/workspace/gplibrary_PR_Models/mosek/venv2_gpkit/lib/python2.7/site-packages (from pint->turbofan==0.0.0.0) (1.0.2)
Building wheels for collected packages: turbofan
  Building wheel for turbofan (setup.py): started
  Building wheel for turbofan (setup.py): finished with status 'done'
  Created wheel for turbofan: filename=turbofan-0.0.0.0-cp27-none-any.whl size=43867 sha256=d4900913c0a950cc912bf5535f51ca80d622cf75d9fdbe664d6d307f13283c87
  Stored in directory: /private/var/folders/42/s1whb7rd4mddfcnzk96g_d9h0000gp/T/pip-ephem-wheel-cache-tEOvWw/wheels/5a/d9/61/61e35684062bfcf52c1d9781b80aeffbe3c3604f4de326b4d2
Successfully built turbofan
Installing collected packages: turbofan
Successfully installed turbofan-0.0.0.0

Running tests...
----------------------------------------------------------------------
.
----------------------------------------------------------------------
Ran 1 test in 13.389s

OK

Generating XML reports...
adding test for 'turbofan/engine_test.py'
Beginning signomial solve.
Using solver 'mosek'
Solving for 243 variables.
Solving took 0.163 seconds.
Using solver 'mosek'
Solving for 244 variables.
Solving took 2.69 seconds.
Using solver 'mosek'
Solving for 243 variables.
Solving took 0.746 seconds.
Using solver 'mosek'
Solving for 243 variables.
Solving took 1.14 seconds.
Using solver 'mosek'
Solving for 243 variables.
Solving took 0.927 seconds.
Using solver 'mosek'
Solving for 243 variables.
Solving took 1.48 seconds.
Using solver 'mosek'
Solving for 243 variables.
Solving took 1.04 seconds.
Using solver 'mosek'
Solving for 243 variables.
Solving took 0.634 seconds.
Using solver 'mosek'
Solving for 243 variables.
Solving took 1.08 seconds.
Using solver 'mosek'
Solving for 243 variables.
Solving took 1.19 seconds.
Using solver 'mosek'
Solving for 243 variables.
Solving took 1.28 seconds.
Solving took 11 GP solves and 12.9 seconds.
Cloning into 'solar'...
DEPRECATION: Python 2.7 will reach the end of its life on January 1st, 2020. Please upgrade your Python as Python 2.7 won't be maintained after that date. A future version of pip will drop support for Python 2.7. More details about Python 2 support in pip, can be found at https://pip.pypa.io/en/latest/development/release-process/#python-2-support
Requirement already satisfied: pandas in /Users/jenkins/workspace/gplibrary_PR_Models/mosek/venv2_gpkit/lib/python2.7/site-packages (0.24.2)
Requirement already satisfied: pytz>=2011k in /Users/jenkins/workspace/gplibrary_PR_Models/mosek/venv2_gpkit/lib/python2.7/site-packages (from pandas) (2019.2)
Requirement already satisfied: numpy>=1.12.0 in /Users/jenkins/workspace/gplibrary_PR_Models/mosek/venv2_gpkit/lib/python2.7/site-packages (from pandas) (1.16.5)
Requirement already satisfied: python-dateutil>=2.5.0 in /Users/jenkins/workspace/gplibrary_PR_Models/mosek/venv2_gpkit/lib/python2.7/site-packages (from pandas) (2.8.0)
Requirement already satisfied: six>=1.5 in /Users/jenkins/workspace/gplibrary_PR_Models/mosek/venv2_gpkit/lib/python2.7/site-packages (from python-dateutil>=2.5.0->pandas) (1.12.0)
DEPRECATION: Python 2.7 will reach the end of its life on January 1st, 2020. Please upgrade your Python as Python 2.7 won't be maintained after that date. A future version of pip will drop support for Python 2.7. More details about Python 2 support in pip, can be found at https://pip.pypa.io/en/latest/development/release-process/#python-2-support
Collecting git+https://github.com/convexengineering/gpfit.git
  Cloning https://github.com/convexengineering/gpfit.git to /private/var/folders/42/s1whb7rd4mddfcnzk96g_d9h0000gp/T/pip-req-build-uvDuNB
  Running command git clone -q https://github.com/convexengineering/gpfit.git /private/var/folders/42/s1whb7rd4mddfcnzk96g_d9h0000gp/T/pip-req-build-uvDuNB
Requirement already satisfied (use --upgrade to upgrade): gpfit==0.1 from git+https://github.com/convexengineering/gpfit.git in /Users/jenkins/workspace/gplibrary_PR_Models/mosek/venv2_gpkit/lib/python2.7/site-packages
Requirement already satisfied: numpy in /Users/jenkins/workspace/gplibrary_PR_Models/mosek/venv2_gpkit/lib/python2.7/site-packages (from gpfit==0.1) (1.16.5)
Requirement already satisfied: scipy in /Users/jenkins/workspace/gplibrary_PR_Models/mosek/venv2_gpkit/lib/python2.7/site-packages (from gpfit==0.1) (1.2.2)
Requirement already satisfied: gpkit in /Users/jenkins/workspace/gplibrary_PR_Models/mosek/gpkit (from gpfit==0.1) (0.9.1.0)
Requirement already satisfied: pint>=0.8.1 in /Users/jenkins/workspace/gplibrary_PR_Models/mosek/venv2_gpkit/lib/python2.7/site-packages (from gpkit->gpfit==0.1) (0.9)
Requirement already satisfied: ad in /Users/jenkins/workspace/gplibrary_PR_Models/mosek/venv2_gpkit/lib/python2.7/site-packages (from gpkit->gpfit==0.1) (1.3.2)
Requirement already satisfied: cvxopt>=1.1.8 in /Users/jenkins/workspace/gplibrary_PR_Models/mosek/venv2_gpkit/lib/python2.7/site-packages (from gpkit->gpfit==0.1) (1.2.3)
Requirement already satisfied: six in /Users/jenkins/workspace/gplibrary_PR_Models/mosek/venv2_gpkit/lib/python2.7/site-packages (from gpkit->gpfit==0.1) (1.12.0)
Requirement already satisfied: funcsigs; python_version == "2.7" in /Users/jenkins/workspace/gplibrary_PR_Models/mosek/venv2_gpkit/lib/python2.7/site-packages (from pint>=0.8.1->gpkit->gpfit==0.1) (1.0.2)
Building wheels for collected packages: gpfit
  Building wheel for gpfit (setup.py): started
  Building wheel for gpfit (setup.py): finished with status 'done'
  Created wheel for gpfit: filename=gpfit-0.1-cp27-none-any.whl size=25151 sha256=9681c7e68cd807788e62c9beb32991ddadd10ef31094c69f231edf8e68dc3d4a
  Stored in directory: /private/var/folders/42/s1whb7rd4mddfcnzk96g_d9h0000gp/T/pip-ephem-wheel-cache-wpnaLv/wheels/d5/94/ac/b1f68b07599181f26f4b9149a1a6d49dfc5cdbc65de1a14d12
Successfully built gpfit
DEPRECATION: Python 2.7 will reach the end of its life on January 1st, 2020. Please upgrade your Python as Python 2.7 won't be maintained after that date. A future version of pip will drop support for Python 2.7. More details about Python 2 support in pip, can be found at https://pip.pypa.io/en/latest/development/release-process/#python-2-support
Collecting git+https://github.com/convexengineering/gassolar.git
  Cloning https://github.com/convexengineering/gassolar.git to /private/var/folders/42/s1whb7rd4mddfcnzk96g_d9h0000gp/T/pip-req-build-N0kR3u
  Running command git clone -q https://github.com/convexengineering/gassolar.git /private/var/folders/42/s1whb7rd4mddfcnzk96g_d9h0000gp/T/pip-req-build-N0kR3u
Requirement already satisfied (use --upgrade to upgrade): gassolar==0.0.0.0 from git+https://github.com/convexengineering/gassolar.git in /Users/jenkins/workspace/gplibrary_PR_Models/mosek/venv2_gpkit/lib/python2.7/site-packages
Requirement already satisfied: numpy in /Users/jenkins/workspace/gplibrary_PR_Models/mosek/venv2_gpkit/lib/python2.7/site-packages (from gassolar==0.0.0.0) (1.16.5)
Requirement already satisfied: scipy in /Users/jenkins/workspace/gplibrary_PR_Models/mosek/venv2_gpkit/lib/python2.7/site-packages (from gassolar==0.0.0.0) (1.2.2)
Requirement already satisfied: gpkit in /Users/jenkins/workspace/gplibrary_PR_Models/mosek/gpkit (from gassolar==0.0.0.0) (0.9.1.0)
Requirement already satisfied: pandas in /Users/jenkins/workspace/gplibrary_PR_Models/mosek/venv2_gpkit/lib/python2.7/site-packages (from gassolar==0.0.0.0) (0.24.2)
Requirement already satisfied: gpfit in /Users/jenkins/workspace/gplibrary_PR_Models/mosek/venv2_gpkit/lib/python2.7/site-packages (from gassolar==0.0.0.0) (0.1)
Requirement already satisfied: pint>=0.8.1 in /Users/jenkins/workspace/gplibrary_PR_Models/mosek/venv2_gpkit/lib/python2.7/site-packages (from gpkit->gassolar==0.0.0.0) (0.9)
Requirement already satisfied: ad in /Users/jenkins/workspace/gplibrary_PR_Models/mosek/venv2_gpkit/lib/python2.7/site-packages (from gpkit->gassolar==0.0.0.0) (1.3.2)
Requirement already satisfied: cvxopt>=1.1.8 in /Users/jenkins/workspace/gplibrary_PR_Models/mosek/venv2_gpkit/lib/python2.7/site-packages (from gpkit->gassolar==0.0.0.0) (1.2.3)
Requirement already satisfied: six in /Users/jenkins/workspace/gplibrary_PR_Models/mosek/venv2_gpkit/lib/python2.7/site-packages (from gpkit->gassolar==0.0.0.0) (1.12.0)
Requirement already satisfied: pytz>=2011k in /Users/jenkins/workspace/gplibrary_PR_Models/mosek/venv2_gpkit/lib/python2.7/site-packages (from pandas->gassolar==0.0.0.0) (2019.2)
Requirement already satisfied: python-dateutil>=2.5.0 in /Users/jenkins/workspace/gplibrary_PR_Models/mosek/venv2_gpkit/lib/python2.7/site-packages (from pandas->gassolar==0.0.0.0) (2.8.0)
Requirement already satisfied: funcsigs; python_version == "2.7" in /Users/jenkins/workspace/gplibrary_PR_Models/mosek/venv2_gpkit/lib/python2.7/site-packages (from pint>=0.8.1->gpkit->gassolar==0.0.0.0) (1.0.2)
Building wheels for collected packages: gassolar
  Building wheel for gassolar (setup.py): started
  Building wheel for gassolar (setup.py): finished with status 'done'
  Created wheel for gassolar: filename=gassolar-0.0.0.0-cp27-none-any.whl size=4876517 sha256=94e77232e916ca0b7bdd9f29d1e3bca63f978e545efcd4ef072b28ceaa1ac9aa
  Stored in directory: /private/var/folders/42/s1whb7rd4mddfcnzk96g_d9h0000gp/T/pip-ephem-wheel-cache-CgH5Ln/wheels/fe/11/0a/2dde16df75c51194d20248ec9e30e88fc7200e9fc4664b032e
Successfully built gassolar
DEPRECATION: Python 2.7 will reach the end of its life on January 1st, 2020. Please upgrade your Python as Python 2.7 won't be maintained after that date. A future version of pip will drop support for Python 2.7. More details about Python 2 support in pip, can be found at https://pip.pypa.io/en/latest/development/release-process/#python-2-support
Processing /Users/jenkins/workspace/gplibrary_PR_Models/mosek/solar
Requirement already satisfied: numpy in /Users/jenkins/workspace/gplibrary_PR_Models/mosek/venv2_gpkit/lib/python2.7/site-packages (from solar==0.0.0.0) (1.16.5)
Requirement already satisfied: scipy in /Users/jenkins/workspace/gplibrary_PR_Models/mosek/venv2_gpkit/lib/python2.7/site-packages (from solar==0.0.0.0) (1.2.2)
Requirement already satisfied: gpkit in /Users/jenkins/workspace/gplibrary_PR_Models/mosek/gpkit (from solar==0.0.0.0) (0.9.1.0)
Requirement already satisfied: pandas in /Users/jenkins/workspace/gplibrary_PR_Models/mosek/venv2_gpkit/lib/python2.7/site-packages (from solar==0.0.0.0) (0.24.2)
Requirement already satisfied: gpfit in /Users/jenkins/workspace/gplibrary_PR_Models/mosek/venv2_gpkit/lib/python2.7/site-packages (from solar==0.0.0.0) (0.1)
Requirement already satisfied: gpkitmodels in /Users/jenkins/workspace/gplibrary_PR_Models/mosek (from solar==0.0.0.0) (0.0.0.0)
Requirement already satisfied: pint>=0.8.1 in /Users/jenkins/workspace/gplibrary_PR_Models/mosek/venv2_gpkit/lib/python2.7/site-packages (from gpkit->solar==0.0.0.0) (0.9)
Requirement already satisfied: ad in /Users/jenkins/workspace/gplibrary_PR_Models/mosek/venv2_gpkit/lib/python2.7/site-packages (from gpkit->solar==0.0.0.0) (1.3.2)
Requirement already satisfied: cvxopt>=1.1.8 in /Users/jenkins/workspace/gplibrary_PR_Models/mosek/venv2_gpkit/lib/python2.7/site-packages (from gpkit->solar==0.0.0.0) (1.2.3)
Requirement already satisfied: six in /Users/jenkins/workspace/gplibrary_PR_Models/mosek/venv2_gpkit/lib/python2.7/site-packages (from gpkit->solar==0.0.0.0) (1.12.0)
Requirement already satisfied: pytz>=2011k in /Users/jenkins/workspace/gplibrary_PR_Models/mosek/venv2_gpkit/lib/python2.7/site-packages (from pandas->solar==0.0.0.0) (2019.2)
Requirement already satisfied: python-dateutil>=2.5.0 in /Users/jenkins/workspace/gplibrary_PR_Models/mosek/venv2_gpkit/lib/python2.7/site-packages (from pandas->solar==0.0.0.0) (2.8.0)
Requirement already satisfied: future in /Users/jenkins/workspace/gplibrary_PR_Models/mosek/venv2_gpkit/lib/python2.7/site-packages (from gpkitmodels->solar==0.0.0.0) (0.17.1)
Requirement already satisfied: funcsigs; python_version == "2.7" in /Users/jenkins/workspace/gplibrary_PR_Models/mosek/venv2_gpkit/lib/python2.7/site-packages (from pint>=0.8.1->gpkit->solar==0.0.0.0) (1.0.2)
Building wheels for collected packages: solar
  Building wheel for solar (setup.py): started
  Building wheel for solar (setup.py): finished with status 'done'
  Created wheel for solar: filename=solar-0.0.0.0-cp27-none-any.whl size=14811 sha256=263eaf00ddb330d2b66abc6b1359dd73e3860e2f5538f8eb5c144bfbb605c58d
  Stored in directory: /private/var/folders/42/s1whb7rd4mddfcnzk96g_d9h0000gp/T/pip-ephem-wheel-cache-d5Iwmy/wheels/1f/1c/61/aec93436439dcd4a965e159a026d3a7ed265e591b64e6d6bfc
Successfully built solar
Installing collected packages: solar
Successfully installed solar-0.0.0.0

Running tests...
----------------------------------------------------------------------
/Users/jenkins/workspace/gplibrary_PR_Models/mosek/venv2_gpkit/lib/python2.7/site-packages/pint/quantity.py:1377: UnitStrippedWarning: The unit of the quantity is stripped.
  warnings.warn("The unit of the quantity is stripped.", UnitStrippedWarning)
../Users/jenkins/workspace/gplibrary_PR_Models/mosek/venv2_gpkit/lib/python2.7/site-packages/gassolar/environment/solar_irradiance.py:40: RuntimeWarning: overflow encountered in exp
  tau = np.exp(-0.175/costhsun)
/Users/jenkins/workspace/gplibrary_PR_Models/mosek/venv2_gpkit/lib/python2.7/site-packages/gassolar/environment/solar_irradiance.py:40: RuntimeWarning: divide by zero encountered in divide
  tau = np.exp(-0.175/costhsun)
....
----------------------------------------------------------------------
Ran 6 tests in 526.979s

OK

Generating XML reports...
adding test for 'solar/sens_chart.py'
adding test for 'solar/season.py'
adding test for 'solar/npod_trade.py'

N=1
Beginning signomial solve.
Solving took 5 GP solves and 9.38 seconds.
Warning: Variable Mission.Climb.AircraftDrag.WingAero.CL[:] could cause inaccurate result because it is below lower bound. Solution is 0.8904 but bound is 0.9465
Warning: Variable Mission.Climb.AircraftDrag.WingAero.Re[:] could cause inaccurate result because it is above upper bound. Solution is 1632916.9411 but bound is 600000.0000
Warning: Variable Mission.Climb.AircraftDrag.TailAero1.Re[:] could cause inaccurate result because it is above upper bound. Solution is 1259333.2947 but bound is 1000000.0000

N=3
Beginning signomial solve.
rw: problem unsolved after 51 iterations.

    The last result is available in Model.program.gps[-1].result. If the gps
    appear to be converging, you may wish to increase the iteration limit by
    calling .localsolve(..., iteration_limit=NEWLIMIT).
e: The constraint CFRPFabric.Relax.tmin >= 1 is infeasible by 228.083990%

N=5
Beginning signomial solve.
Solving took 5 GP solves and 7.55 seconds.
Warning: Variable Mission3.Climb.AircraftDrag.WingAero.CL[:] could cause inaccurate result because it is below lower bound. Solution is 1.1487 but bound is 0.9465
Warning: Variable Mission3.Climb.AircraftDrag.WingAero.Re[:] could cause inaccurate result because it is above upper bound. Solution is 989673.4660 but bound is 600000.0000
Warning: Variable Mission3.Climb.AircraftDrag.TailAero1.Re[:] could cause inaccurate result because it is above upper bound. Solution is 1019678.5406 but bound is 1000000.0000

N=7
Beginning signomial solve.
Solving took 5 GP solves and 7.29 seconds.
Warning: Variable Mission4.Climb.AircraftDrag.WingAero.CL[:] could cause inaccurate result because it is below lower bound. Solution is 1.1643 but bound is 0.9465
Warning: Variable Mission4.Climb.AircraftDrag.WingAero.Re[:] could cause inaccurate result because it is above upper bound. Solution is 976142.1466 but bound is 600000.0000
Warning: Variable Mission4.Climb.AircraftDrag.TailAero1.Re[:] could cause inaccurate result because it is above upper bound. Solution is 1042059.4120 but bound is 1000000.0000

N=9
Beginning signomial solve.
Solving took 5 GP solves and 9.31 seconds.
Warning: Variable Mission5.Climb.AircraftDrag.WingAero.CL[:] could cause inaccurate result because it is below lower bound. Solution is 1.1567 but bound is 0.9465
Warning: Variable Mission5.Climb.AircraftDrag.WingAero.Re[:] could cause inaccurate result because it is above upper bound. Solution is 1007400.4744 but bound is 600000.0000
Warning: Variable Mission5.Climb.AircraftDrag.TailAero1.Re[:] could cause inaccurate result because it is above upper bound. Solution is 1092545.5116 but bound is 1000000.0000

N=0
Beginning signomial solve.
Solving took 4 GP solves and 5.38 seconds.
Warning: Variable Mission6.Climb.AircraftDrag.WingAero.CL[:] could cause inaccurate result because it is below lower bound. Solution is 1.0536 but bound is 0.9465
Warning: Variable Mission6.Climb.AircraftDrag.WingAero.Re[:] could cause inaccurate result because it is above upper bound. Solution is 1119121.2012 but bound is 600000.0000

N=1
Beginning signomial solve.
Solving took 5 GP solves and 3.66 seconds.
Warning: Variable Mission.Climb.AircraftDrag.WingAero.CL[:] could cause inaccurate result because it is below lower bound. Solution is 0.8904 but bound is 0.9465
Warning: Variable Mission.Climb.AircraftDrag.WingAero.Re[:] could cause inaccurate result because it is above upper bound. Solution is 1632919.3776 but bound is 600000.0000
Warning: Variable Mission.Climb.AircraftDrag.TailAero1.Re[:] could cause inaccurate result because it is above upper bound. Solution is 1259329.5070 but bound is 1000000.0000

N=3
Beginning signomial solve.
rw: problem unsolved after 51 iterations.

    The last result is available in Model.program.gps[-1].result. If the gps
    appear to be converging, you may wish to increase the iteration limit by
    calling .localsolve(..., iteration_limit=NEWLIMIT).
e: The constraint CFRPFabric.Relax.tmin >= 1 is infeasible by 228.083990%

N=5
Beginning signomial solve.
Solving took 5 GP solves and 7.72 seconds.
Warning: Variable Mission3.Climb.AircraftDrag.WingAero.CL[:] could cause inaccurate result because it is below lower bound. Solution is 1.1487 but bound is 0.9465
Warning: Variable Mission3.Climb.AircraftDrag.WingAero.Re[:] could cause inaccurate result because it is above upper bound. Solution is 989673.1341 but bound is 600000.0000
Warning: Variable Mission3.Climb.AircraftDrag.TailAero1.Re[:] could cause inaccurate result because it is above upper bound. Solution is 1019680.6011 but bound is 1000000.0000

N=7
Beginning signomial solve.
Solving took 5 GP solves and 8.63 seconds.
Warning: Variable Mission4.Climb.AircraftDrag.WingAero.CL[:] could cause inaccurate result because it is below lower bound. Solution is 1.1643 but bound is 0.9465
Warning: Variable Mission4.Climb.AircraftDrag.WingAero.Re[:] could cause inaccurate result because it is above upper bound. Solution is 976138.7332 but bound is 600000.0000
Warning: Variable Mission4.Climb.AircraftDrag.TailAero1.Re[:] could cause inaccurate result because it is above upper bound. Solution is 1042059.9154 but bound is 1000000.0000

N=9
Beginning signomial solve.
Solving took 5 GP solves and 4.22 seconds.
Warning: Variable Mission5.Climb.AircraftDrag.WingAero.CL[:] could cause inaccurate result because it is below lower bound. Solution is 1.1567 but bound is 0.9465
Warning: Variable Mission5.Climb.AircraftDrag.WingAero.Re[:] could cause inaccurate result because it is above upper bound. Solution is 1007396.6632 but bound is 600000.0000
Warning: Variable Mission5.Climb.AircraftDrag.TailAero1.Re[:] could cause inaccurate result because it is above upper bound. Solution is 1092544.5684 but bound is 1000000.0000

N=0
Beginning signomial solve.
Solving took 4 GP solves and 5.56 seconds.
Warning: Variable Mission6.Climb.AircraftDrag.WingAero.CL[:] could cause inaccurate result because it is below lower bound. Solution is 1.0536 but bound is 0.9465
Warning: Variable Mission6.Climb.AircraftDrag.WingAero.Re[:] could cause inaccurate result because it is above upper bound. Solution is 1119116.3963 but bound is 600000.0000
Using solver 'mosek'
Solving for 14852 variables.
Solving took 12.9 seconds.
Allowing negative dual variable(s) as small as -2.5709161362297284e-12.
Warning: Variable Mission.Climb.AircraftDrag.WingAero.CL[:] could cause inaccurate result because it is below lower bound. Solution is 1.3227 but bound is 0.9465
Warning: Variable Mission.Climb.AircraftDrag.WingAero.Re[:] could cause inaccurate result because it is above upper bound. Solution is 671709.7358 but bound is 600000.0000
Using solver 'mosek'
Solving for 14852 variables.
Solving took 11.9 seconds.
Warning: Variable Mission1.Climb.AircraftDrag.WingAero.CL[:] could cause inaccurate result because it is below lower bound. Solution is 1.2812 but bound is 0.9465
Warning: Variable Mission1.Climb.AircraftDrag.WingAero.Re[:] could cause inaccurate result because it is above upper bound. Solution is 729183.6153 but bound is 600000.0000
Using solver 'mosek'
Solving for 14852 variables.
Solving took 12.5 seconds.
Warning: Variable Mission2.Climb.AircraftDrag.WingAero.CL[:] could cause inaccurate result because it is below lower bound. Solution is 1.2258 but bound is 0.9465
Warning: Variable Mission2.Climb.AircraftDrag.WingAero.Re[:] could cause inaccurate result because it is above upper bound. Solution is 802959.5989 but bound is 600000.0000
Using solver 'mosek'
Solving for 7672 variables.
Solving took 8.74 seconds.
Warning: Variable Mission3.Climb.AircraftDrag.WingAero.CL[:] could cause inaccurate result because it is below lower bound. Solution is 1.2008 but bound is 0.9465
Warning: Variable Mission3.Climb.AircraftDrag.WingAero.Re[:] could cause inaccurate result because it is above upper bound. Solution is 839122.5076 but bound is 600000.0000
Using solver 'mosek'
Solving for 14852 variables.
Solving took 14 seconds.
Warning: Variable Mission.Climb.AircraftDrag.WingAero.CL[:] could cause inaccurate result because it is below lower bound. Solution is 1.3227 but bound is 0.9465
Warning: Variable Mission.Climb.AircraftDrag.WingAero.Re[:] could cause inaccurate result because it is above upper bound. Solution is 671709.7359 but bound is 600000.0000
Using solver 'mosek'
Solving for 14852 variables.
Solving took 12.2 seconds.
Warning: Variable Mission1.Climb.AircraftDrag.WingAero.CL[:] could cause inaccurate result because it is below lower bound. Solution is 1.2812 but bound is 0.9465
Warning: Variable Mission1.Climb.AircraftDrag.WingAero.Re[:] could cause inaccurate result because it is above upper bound. Solution is 729183.6155 but bound is 600000.0000
Using solver 'mosek'
Solving for 14852 variables.
Solving took 11.7 seconds.
Warning: Variable Mission2.Climb.AircraftDrag.WingAero.CL[:] could cause inaccurate result because it is below lower bound. Solution is 1.2258 but bound is 0.9465
Warning: Variable Mission2.Climb.AircraftDrag.WingAero.Re[:] could cause inaccurate result because it is above upper bound. Solution is 802959.5991 but bound is 600000.0000
Using solver 'mosek'
Solving for 7672 variables.
Solving took 8.91 seconds.
Warning: Variable Mission3.Climb.AircraftDrag.WingAero.CL[:] could cause inaccurate result because it is below lower bound. Solution is 1.2008 but bound is 0.9465
Warning: Variable Mission3.Climb.AircraftDrag.WingAero.Re[:] could cause inaccurate result because it is above upper bound. Solution is 839122.5075 but bound is 600000.0000
Beginning signomial solve.
Solving took 4 GP solves and 7.73 seconds.
Warning: Variable Mission.Climb.AircraftDrag.WingAero.CL[:] could cause inaccurate result because it is below lower bound. Solution is 1.0536 but bound is 0.9465
Warning: Variable Mission.Climb.AircraftDrag.WingAero.Re[:] could cause inaccurate result because it is above upper bound. Solution is 1119121.2013 but bound is 600000.0000
Beginning signomial solve.
Solving took 4 GP solves and 7.51 seconds.
Warning: Variable Mission.Climb.AircraftDrag.WingAero.CL[:] could cause inaccurate result because it is below lower bound. Solution is 1.0536 but bound is 0.9465
Warning: Variable Mission.Climb.AircraftDrag.WingAero.Re[:] could cause inaccurate result because it is above upper bound. Solution is 1119121.2012 but bound is 600000.0000
Cloning into 'gplibrary'...
DEPRECATION: Python 2.7 will reach the end of its life on January 1st, 2020. Please upgrade your Python as Python 2.7 won't be maintained after that date. A future version of pip will drop support for Python 2.7. More details about Python 2 support in pip, can be found at https://pip.pypa.io/en/latest/development/release-process/#python-2-support
Requirement already satisfied: pandas in /Users/jenkins/workspace/gplibrary_PR_Models/mosek/venv2_gpkit/lib/python2.7/site-packages (0.24.2)
Requirement already satisfied: pytz>=2011k in /Users/jenkins/workspace/gplibrary_PR_Models/mosek/venv2_gpkit/lib/python2.7/site-packages (from pandas) (2019.2)
Requirement already satisfied: numpy>=1.12.0 in /Users/jenkins/workspace/gplibrary_PR_Models/mosek/venv2_gpkit/lib/python2.7/site-packages (from pandas) (1.16.5)
Requirement already satisfied: python-dateutil>=2.5.0 in /Users/jenkins/workspace/gplibrary_PR_Models/mosek/venv2_gpkit/lib/python2.7/site-packages (from pandas) (2.8.0)
Requirement already satisfied: six>=1.5 in /Users/jenkins/workspace/gplibrary_PR_Models/mosek/venv2_gpkit/lib/python2.7/site-packages (from python-dateutil>=2.5.0->pandas) (1.12.0)
DEPRECATION: Python 2.7 will reach the end of its life on January 1st, 2020. Please upgrade your Python as Python 2.7 won't be maintained after that date. A future version of pip will drop support for Python 2.7. More details about Python 2 support in pip, can be found at https://pip.pypa.io/en/latest/development/release-process/#python-2-support
Collecting git+https://github.com/hoburg/gpfit.git
  Cloning https://github.com/hoburg/gpfit.git to /private/var/folders/42/s1whb7rd4mddfcnzk96g_d9h0000gp/T/pip-req-build-Mshov7
  Running command git clone -q https://github.com/hoburg/gpfit.git /private/var/folders/42/s1whb7rd4mddfcnzk96g_d9h0000gp/T/pip-req-build-Mshov7
Requirement already satisfied (use --upgrade to upgrade): gpfit==0.1 from git+https://github.com/hoburg/gpfit.git in /Users/jenkins/workspace/gplibrary_PR_Models/mosek/venv2_gpkit/lib/python2.7/site-packages
Requirement already satisfied: numpy in /Users/jenkins/workspace/gplibrary_PR_Models/mosek/venv2_gpkit/lib/python2.7/site-packages (from gpfit==0.1) (1.16.5)
Requirement already satisfied: scipy in /Users/jenkins/workspace/gplibrary_PR_Models/mosek/venv2_gpkit/lib/python2.7/site-packages (from gpfit==0.1) (1.2.2)
Requirement already satisfied: gpkit in /Users/jenkins/workspace/gplibrary_PR_Models/mosek/gpkit (from gpfit==0.1) (0.9.1.0)
Requirement already satisfied: pint>=0.8.1 in /Users/jenkins/workspace/gplibrary_PR_Models/mosek/venv2_gpkit/lib/python2.7/site-packages (from gpkit->gpfit==0.1) (0.9)
Requirement already satisfied: ad in /Users/jenkins/workspace/gplibrary_PR_Models/mosek/venv2_gpkit/lib/python2.7/site-packages (from gpkit->gpfit==0.1) (1.3.2)
Requirement already satisfied: cvxopt>=1.1.8 in /Users/jenkins/workspace/gplibrary_PR_Models/mosek/venv2_gpkit/lib/python2.7/site-packages (from gpkit->gpfit==0.1) (1.2.3)
Requirement already satisfied: six in /Users/jenkins/workspace/gplibrary_PR_Models/mosek/venv2_gpkit/lib/python2.7/site-packages (from gpkit->gpfit==0.1) (1.12.0)
Requirement already satisfied: funcsigs; python_version == "2.7" in /Users/jenkins/workspace/gplibrary_PR_Models/mosek/venv2_gpkit/lib/python2.7/site-packages (from pint>=0.8.1->gpkit->gpfit==0.1) (1.0.2)
Building wheels for collected packages: gpfit
  Building wheel for gpfit (setup.py): started
  Building wheel for gpfit (setup.py): finished with status 'done'
  Created wheel for gpfit: filename=gpfit-0.1-cp27-none-any.whl size=25151 sha256=0c2a1174c6b6528ba6ea38d430d710fa90a23f6f0aeb27c514737088f3753216
  Stored in directory: /private/var/folders/42/s1whb7rd4mddfcnzk96g_d9h0000gp/T/pip-ephem-wheel-cache-JWfCGp/wheels/4d/4b/2e/9480645acbe8d32004b09b3732f616bbb2a9ee75e4526f058f
Successfully built gpfit
DEPRECATION: Python 2.7 will reach the end of its life on January 1st, 2020. Please upgrade your Python as Python 2.7 won't be maintained after that date. A future version of pip will drop support for Python 2.7. More details about Python 2 support in pip, can be found at https://pip.pypa.io/en/latest/development/release-process/#python-2-support
Processing /Users/jenkins/workspace/gplibrary_PR_Models/mosek/gplibrary
Requirement already satisfied: numpy>=1.12 in /Users/jenkins/workspace/gplibrary_PR_Models/mosek/venv2_gpkit/lib/python2.7/site-packages (from gpkitmodels==0.0.0.0) (1.16.5)
Requirement already satisfied: scipy in /Users/jenkins/workspace/gplibrary_PR_Models/mosek/venv2_gpkit/lib/python2.7/site-packages (from gpkitmodels==0.0.0.0) (1.2.2)
Requirement already satisfied: pint in /Users/jenkins/workspace/gplibrary_PR_Models/mosek/venv2_gpkit/lib/python2.7/site-packages (from gpkitmodels==0.0.0.0) (0.9)
Requirement already satisfied: funcsigs; python_version == "2.7" in /Users/jenkins/workspace/gplibrary_PR_Models/mosek/venv2_gpkit/lib/python2.7/site-packages (from pint->gpkitmodels==0.0.0.0) (1.0.2)
Building wheels for collected packages: gpkitmodels
  Building wheel for gpkitmodels (setup.py): started
  Building wheel for gpkitmodels (setup.py): finished with status 'done'
  Created wheel for gpkitmodels: filename=gpkitmodels-0.0.0.0-cp27-none-any.whl size=65697 sha256=94c51ef5c7b65fc03791697f4bbd1fc98309a7d07bd748fe9cfd7537307fd505
  Stored in directory: /private/var/folders/42/s1whb7rd4mddfcnzk96g_d9h0000gp/T/pip-ephem-wheel-cache-e0seYX/wheels/89/83/63/5c5e519ca7ad1fa93cf087f53642d88b5b0eb066ca83d4bb19
Successfully built gpkitmodels
Installing collected packages: gpkitmodels
  Found existing installation: gpkitmodels 0.0.0.0
    Uninstalling gpkitmodels-0.0.0.0:
      Successfully uninstalled gpkitmodels-0.0.0.0
Successfully installed gpkitmodels-0.0.0.0

Running tests...
----------------------------------------------------------------------
../Users/jenkins/workspace/gplibrary_PR_Models/mosek/venv2_gpkit/lib/python2.7/site-packages/pint/quantity.py:1377: UnitStrippedWarning: The unit of the quantity is stripped.
  warnings.warn("The unit of the quantity is stripped.", UnitStrippedWarning)
..............
----------------------------------------------------------------------
Ran 16 tests in 58.784s

OK

Generating XML reports...
adding test for 'gpkitmodels/GP/aircraft/wing/wing_test.py'
adding test for 'gpkitmodels/GP/aircraft/tail/tail_tests.py'
adding test for 'gpkitmodels/GP/aircraft/fuselage/test_fuselage.py'
adding test for 'gpkitmodels/GP/aircraft/prop/prop_test.py'
adding test for 'gpkitmodels/GP/aircraft/motor/motor_test.py'
adding test for 'gpkitmodels/SP/SimPleAC/SimPleAC.py'
adding test for 'gpkitmodels/SP/SimPleAC/SimPleAC_mission.py'
adding test for 'gpkitmodels/SP/SimPleAC/SimPleAC_multimission.py'
Using solver 'mosek'
Solving for 11 variables.
Solving took 0.0856 seconds.
Using solver 'mosek_cli'
Solving for 11 variables.
Solving took 0.243 seconds.
Using solver 'mosek'
Solving for 9 variables.
Solving took 0.0142 seconds.
Using solver 'mosek'
Solving for 25 variables.
Solving took 0.173 seconds.
Using solver 'mosek'
Solving for 25 variables.
Solving took 0.0188 seconds.
Beginning signomial solve.
Solving took 16 GP solves and 17.4 seconds.
Using solver 'mosek_cli'
Solving for 9 variables.
Solving took 0.233 seconds.
Using solver 'mosek_cli'
Solving for 25 variables.
Solving took 0.238 seconds.
Using solver 'mosek_cli'
Solving for 25 variables.
Solving took 0.238 seconds.
Beginning signomial solve.
Solving took 16 GP solves and 5.57 seconds.
Using solver 'mosek'
Solving for 13 variables.
Solving took 0.195 seconds.
Beginning signomial solve.
Solving took 11 GP solves and 13.1 seconds.
Warning: Variable BladeElementProp.BladeElementPerf.cl[:] could cause inaccurate result because it is below lower bound. Solution is 0.6000 but bound is 0.4742
Warning: Variable BladeElementProp.BladeElementPerf.Re[:] could cause inaccurate result because it is above upper bound. Solution is 1619897.4188 but bound is 700000.0000
Using solver 'mosek_cli'
Solving for 13 variables.
Solving took 0.235 seconds.
Beginning signomial solve.
Solving took 11 GP solves and 4.13 seconds.
Warning: Variable BladeElementProp.BladeElementPerf.cl[:] could cause inaccurate result because it is below lower bound. Solution is 0.6000 but bound is 0.4742
Warning: Variable BladeElementProp.BladeElementPerf.Re[:] could cause inaccurate result because it is above upper bound. Solution is 1619891.9379 but bound is 700000.0000
Warning: Variable TailAero.Re could cause inaccurate result because it is above upper bound. Solution is 2220953.3481 but bound is 1000000.0000
Warning: Variable TailAero1.Re could cause inaccurate result because it is above upper bound. Solution is 2499787.9721 but bound is 1000000.0000
Warning: Variable TailAero2.Re could cause inaccurate result because it is above upper bound. Solution is 2223878.3883 but bound is 1000000.0000
Warning: Variable TailAero3.Re could cause inaccurate result because it is above upper bound. Solution is 2223877.9562 but bound is 1000000.0000
Warning: Variable TailAero4.Re could cause inaccurate result because it is above upper bound. Solution is 1853897.1004 but bound is 1000000.0000
Warning: Variable TailAero5.Re could cause inaccurate result because it is above upper bound. Solution is 1853897.1004 but bound is 1000000.0000
Warning: Variable TailAero.Re could cause inaccurate result because it is above upper bound. Solution is 2220959.7939 but bound is 1000000.0000
Warning: Variable TailAero1.Re could cause inaccurate result because it is above upper bound. Solution is 2499796.7837 but bound is 1000000.0000
Warning: Variable TailAero2.Re could cause inaccurate result because it is above upper bound. Solution is 1860712.4314 but bound is 1000000.0000
Warning: Variable TailAero3.Re could cause inaccurate result because it is above upper bound. Solution is 1860712.4314 but bound is 1000000.0000
Warning: Variable TailAero4.Re could cause inaccurate result because it is above upper bound. Solution is 1853896.1324 but bound is 1000000.0000
Warning: Variable TailAero5.Re could cause inaccurate result because it is above upper bound. Solution is 1853896.1324 but bound is 1000000.0000
Warning: Variable WingAero.Re could cause inaccurate result because it is above upper bound. Solution is 1884891.2729 but bound is 700000.0000
Warning: Variable WingAero1.Re could cause inaccurate result because it is above upper bound. Solution is 1910419.4978 but bound is 700000.0000
Warning: Variable WingAero.Re could cause inaccurate result because it is above upper bound. Solution is 1910412.9866 but bound is 700000.0000
Warning: Variable WingAero1.Re could cause inaccurate result because it is above upper bound. Solution is 1910412.9866 but bound is 700000.0000
SP is not converging! Last GP iteration had a higher cost (3e+03) than the previous one (2.7e+03). Results for each iteration are in (Model).program.results. If your model contains SignomialEqualities, note that convergence is not guaranteed: try replacing any SigEqs you can and solving again.
SP is not converging! Last GP iteration had a higher cost (3e+03) than the previous one (2.7e+03). Results for each iteration are in (Model).program.results. If your model contains SignomialEqualities, note that convergence is not guaranteed: try replacing any SigEqs you can and solving again.
SP is not converging! Last GP iteration had a higher cost (4.3e+03) than the previous one (3.4e+03). Results for each iteration are in (Model).program.results. If your model contains SignomialEqualities, note that convergence is not guaranteed: try replacing any SigEqs you can and solving again.
SP is not converging! Last GP iteration had a higher cost (4.3e+03) than the previous one (4.3e+03). Results for each iteration are in (Model).program.results. If your model contains SignomialEqualities, note that convergence is not guaranteed: try replacing any SigEqs you can and solving again.
SP is not converging! Last GP iteration had a higher cost (4.3e+03) than the previous one (4.3e+03). Results for each iteration are in (Model).program.results. If your model contains SignomialEqualities, note that convergence is not guaranteed: try replacing any SigEqs you can and solving again.
SP is not converging! Last GP iteration had a higher cost (4.3e+03) than the previous one (3.4e+03). Results for each iteration are in (Model).program.results. If your model contains SignomialEqualities, note that convergence is not guaranteed: try replacing any SigEqs you can and solving again.
SP is not converging! Last GP iteration had a higher cost (4.3e+03) than the previous one (4.3e+03). Results for each iteration are in (Model).program.results. If your model contains SignomialEqualities, note that convergence is not guaranteed: try replacing any SigEqs you can and solving again.
SP is not converging! Last GP iteration had a higher cost (4.3e+03) than the previous one (4.3e+03). Results for each iteration are in (Model).program.results. If your model contains SignomialEqualities, note that convergence is not guaranteed: try replacing any SigEqs you can and solving again.
Beginning signomial solve.
Using solver 'mosek'
Solving for 20 variables.
Solving took 0.0172 seconds.
Using solver 'mosek'
Solving for 20 variables.
Solving took 0.0162 seconds.
Using solver 'mosek'
Solving for 20 variables.
Solving took 0.0115 seconds.
Using solver 'mosek'
Solving for 20 variables.
Solving took 0.0119 seconds.
Solving took 4 GP solves and 0.0634 seconds.
Beginning signomial solve.
Using solver 'mosek_cli'
Solving for 20 variables.
Solving took 0.231 seconds.
Using solver 'mosek_cli'
Solving for 20 variables.
Solving took 0.236 seconds.
Using solver 'mosek_cli'
Solving for 20 variables.
Solving took 0.282 seconds.
Using solver 'mosek_cli'
Solving for 20 variables.
Solving took 0.66 seconds.
Solving took 4 GP solves and 1.43 seconds.
Cloning into 'eVTOL'...

Running tests...
----------------------------------------------------------------------
..
----------------------------------------------------------------------
Ran 2 tests in 7.480s

OK

Generating XML reports...
adding test for 'models/model_tests.py'
Found no installed solvers, beginning a build.
# Moving to the directory from which GPkit was imported.
Started building gpkit...

Attempting to find and build solvers:

# Looking for mosek
#     Found /Users/jenkins/mosek/7/tools/platform/osx64x86/h/mosek.h
#     Found /Users/jenkins/mosek/7/tools/platform/osx64x86/bin/libmosek64.7.1.dylib
#     Found /Users/jenkins/mosek/7/tools/examples/c/scopt-ext.c
#     Found /Users/jenkins/mosek/7/tools/examples/c/expopt.c
#     Found /Users/jenkins/mosek/7/tools/examples/c/dgopt.c
#     Found /Users/jenkins/mosek/7/tools/examples/c/scopt-ext.h
#     Found /Users/jenkins/mosek/7/tools/examples/c/expopt.h
#     Found /Users/jenkins/mosek/7/tools/examples/c/dgopt.h
#     Found /Users/jenkins/mosek/7/tools/platform/osx64x86/h/mosek.h
# Found mosek version 7, installed to /Users/jenkins/mosek
#
# Building mosek...
#     Replacing directory _mosek/build
#     Replacing directory /Users/jenkins/workspace/gplibrary_PR_Models/mosek/build_gpkit
#
#   Copying expopt library files to _mosek/build
#     Copying /Users/jenkins/mosek/7/tools/examples/c/scopt-ext.c
#     Copying /Users/jenkins/mosek/7/tools/examples/c/expopt.c
#     Copying /Users/jenkins/mosek/7/tools/examples/c/dgopt.c
#     Copying /Users/jenkins/mosek/7/tools/examples/c/scopt-ext.h
#     Copying /Users/jenkins/mosek/7/tools/examples/c/expopt.h
#     Copying /Users/jenkins/mosek/7/tools/examples/c/dgopt.h
#     Copying /Users/jenkins/mosek/7/tools/platform/osx64x86/h/mosek.h
#
#   Applying expopt patches...
#
#     Change in _mosek/build/dgopt.con line 683
#     --           printf("Number of Hessian non-zeros: %d\n",nlh[0]->numhesnz)
#     ++ MSK_echotask(task,MSK_STREAM_MSG,"Number of Hessian non-zeros: %d\n",n
#
#     Change in _mosek/build/expopt.con line 569
#     --       printf("Warning: The variable with index '%d' has only positive 
#     ++ MSK_echotask(expopttask,MSK_STREAM_MSG, "Warning: The variable with in
#
#     Change in _mosek/build/expopt.con line 582
#     --       printf("Warning: The variable with index '%d' has only negative 
#     ++ MSK_echotask(expopttask,MSK_STREAM_MSG, "Warning: The variable with in
#
#     Change in _mosek/build/expopt.con line 1115
#     --     printf ("solsta = %d, prosta = %d\n", (int)*solsta,(int)*prosta);
#     ++ MSK_echotask(expopttask,MSK_STREAM_MSG, "solsta = %d, prosta = %d\n", 
#
#   Building expopt library...
#     Calling 'gcc -fpic -shared -Wl,-rpath "/Users/jenkins/mosek/7/tools/platform/osx64x86/bin"    _mosek/build/scopt-ext.c _mosek/build/expopt.c _mosek/build/dgopt.c   "/Users/jenkins/mosek/7/tools/platform/osx64x86/bin/libmosek64.7.1.dylib" -o /Users/jenkins/workspace/gplibrary_PR_Models/mosek/build_gpkit/expopt.so'
##
### CALL BEGINS
### CALL ENDS
##
#     Calling 'install_name_tool -change @loader_path/libmosek64.7.1.dylib /Users/jenkins/mosek/7/tools/platform/osx64x86/bin/libmosek64.7.1.dylib /Users/jenkins/workspace/gplibrary_PR_Models/mosek/build_gpkit/expopt.so'
##
### CALL BEGINS
### CALL ENDS
##
# Done building mosek
# Looking for mosek_cli
#   Trying to run mskexpopt...
#     Calling 'mskexpopt'
##
### CALL BEGINS
### CALL ENDS
##
# Found mosek_cli in system path
# Looking for cvxopt
#   Trying to import cvxopt...
# Found cvxopt in Python path
...finished building gpkit.
Replaced found solvers ([u'mosek', u'mosek_cli', u'cvxopt']) with environment var GPKITSOLVERS (mosek, mosek_cli)

Found the following solvers: mosek, mosek_cli
#     Replacing directory env
x[:] <= w

GPkit is now installed with solver(s) [u'mosek', u'mosek_cli']
To incorporate new solvers at a later date, run `gpkit.build()`.

If any tests didn't pass, please post the output above
(starting from "Found no installed solvers, beginning a build.")
to gpkit@mit.edu or https://github.com/convexengineering/gpkit/issues/new
so we can prevent others from having these errors.

The same goes for any other bugs you encounter with GPkit:
send 'em our way, along with any interesting models, speculative features,
comments, discussions, or clarifications you feel like sharing.

Finally, we hope you find our documentation (https://gpkit.readthedocs.io/)
and engineering-design models (https://github.com/convexengineering/gplibrary/)
to be useful resources for your own applications.

Enjoy!

USING LOCAL DIRECTORY AS GPKITMODELS DIRECTORY
calling ['python', '/Users/jenkins/workspace/gplibrary_PR_Models/mosek/venv2_gpkit/bin/pip', 'install', '--no-cache-dir', '--no-deps', '-e', '.']
  attempt 1
calling ['git', 'clone', '--depth', '1', '-b', 'master', 'https://github.com/convexengineering/robust.git']
  attempt 1

SETTINGS
defaultdict(<type 'str'>, {})

calling ['python', '/Users/jenkins/workspace/gplibrary_PR_Models/mosek/venv2_gpkit/bin/pip', 'install', '.']
  attempt 1
calling ['git', 'clone', '--depth', '1', '-b', 'master', 'https://github.com/convexengineering/shopping.git']
  attempt 1

SETTINGS
defaultdict(<type 'str'>, {})

calling ['git', 'clone', '--depth', '1', '-b', 'master', 'https://github.com/convexengineering/gassolar.git']
  attempt 1

SETTINGS
defaultdict(<type 'str'>, {'skipsolvers': 'cvxopt', 'pip install': 'pandas, git+https://github.com/hoburg/gpfit.git', 'gpkit-models branch': 'master'})

calling ['python', '/Users/jenkins/workspace/gplibrary_PR_Models/mosek/venv2_gpkit/bin/pip', 'install', 'pandas']
  attempt 1
calling ['python', '/Users/jenkins/workspace/gplibrary_PR_Models/mosek/venv2_gpkit/bin/pip', 'install', 'git+https://github.com/hoburg/gpfit.git']
  attempt 1
calling ['python', '/Users/jenkins/workspace/gplibrary_PR_Models/mosek/venv2_gpkit/bin/pip', 'install', '.']
  attempt 1
calling ['git', 'clone', '--depth', '1', '-b', 'master', 'https://github.com/convexengineering/jho.git']
  attempt 1

SETTINGS
defaultdict(<type 'str'>, {'skipsolvers': 'cvxopt', 'pip install': 'pandas, git+https://github.com/hoburg/gpfit.git', 'gpkit-models branch': 'master'})

calling ['python', '/Users/jenkins/workspace/gplibrary_PR_Models/mosek/venv2_gpkit/bin/pip', 'install', 'pandas']
  attempt 1
calling ['python', '/Users/jenkins/workspace/gplibrary_PR_Models/mosek/venv2_gpkit/bin/pip', 'install', 'git+https://github.com/hoburg/gpfit.git']
  attempt 1
calling ['git', 'clone', '--depth', '1', '-b', 'master', 'https://github.com/convexengineering/turbofan.git']
  attempt 1

SETTINGS
defaultdict(<type 'str'>, {'skipsolvers': 'cvxopt, mosek_cli', 'gpkit-models branch': 'master'})

calling ['python', '/Users/jenkins/workspace/gplibrary_PR_Models/mosek/venv2_gpkit/bin/pip', 'install', '.']
  attempt 1
calling ['git', 'clone', '--depth', '1', '-b', 'master', 'https://github.com/convexengineering/solar.git']
  attempt 1

SETTINGS
defaultdict(<type 'str'>, {'skipsolvers': 'cvxopt', 'pip install': 'pandas, git+https://github.com/convexengineering/gpfit.git, git+https://github.com/convexengineering/gassolar.git', 'gpkit-models branch': 'master'})

calling ['python', '/Users/jenkins/workspace/gplibrary_PR_Models/mosek/venv2_gpkit/bin/pip', 'install', 'pandas']
  attempt 1
calling ['python', '/Users/jenkins/workspace/gplibrary_PR_Models/mosek/venv2_gpkit/bin/pip', 'install', 'git+https://github.com/convexengineering/gpfit.git']
  attempt 1
calling ['python', '/Users/jenkins/workspace/gplibrary_PR_Models/mosek/venv2_gpkit/bin/pip', 'install', 'git+https://github.com/convexengineering/gassolar.git']
  attempt 1
calling ['python', '/Users/jenkins/workspace/gplibrary_PR_Models/mosek/venv2_gpkit/bin/pip', 'install', '.']
  attempt 1
calling ['git', 'clone', '--depth', '1', '-b', 'master', 'https://github.com/convexengineering/gplibrary.git']
  attempt 1

SETTINGS
defaultdict(<type 'str'>, {'pip install': 'pandas, git+https://github.com/hoburg/gpfit.git'})

calling ['python', '/Users/jenkins/workspace/gplibrary_PR_Models/mosek/venv2_gpkit/bin/pip', 'install', 'pandas']
  attempt 1
calling ['python', '/Users/jenkins/workspace/gplibrary_PR_Models/mosek/venv2_gpkit/bin/pip', 'install', 'git+https://github.com/hoburg/gpfit.git']
  attempt 1
calling ['python', '/Users/jenkins/workspace/gplibrary_PR_Models/mosek/venv2_gpkit/bin/pip', 'install', '.']
  attempt 1
calling ['git', 'clone', '--depth', '1', '-b', 'master', 'https://github.com/convexengineering/eVTOL.git']
  attempt 1

SETTINGS
defaultdict(<type 'str'>, {})

[Execution node] check if [macys_VM] is in [[windows10x64, windows7x64]]
Run condition [Execution node ] preventing perform for step [Execute Windows batch command]
Build step 'Console output (build log) parsing' changed build result to FAILURE
INFO: Starting to record.
INFO: Processing JUnit
INFO: [JUnit] - 8 test report file(s) were found with the pattern '**/test_reports/*.xml, **/test_reports_nounits/*.xml' relative to '/Users/jenkins/workspace/gplibrary_PR_Models/mosek' for the testing framework 'JUnit'.
INFO: Check 'Failed Tests' threshold.
INFO: Check 'Skipped Tests' threshold.
INFO: Setting the build status to FAILURE
INFO: Stopping recording.
[WS-CLEANUP] Deleting project workspace...
[WS-CLEANUP] Deferred wipeout is used...
[WS-CLEANUP] done
Finished: FAILURE