Skip to content
Failed

Console Output

Skipping 502 KB.. Full Log
make -C ugridWriter 
make[3]: Entering directory '/jenkins/workspace/ESP_MemcheckCaps/7.8/CAPS/unit/LINUX64/CAPS/aim/meshWriter/ugridWriter'
gcc-11 -g -fsanitize=address -fno-omit-frame-pointer -fuse-ld=gold -c -O -fno-unit-at-a-time -fPIC -Wall -Wno-dangling-else -Wno-parentheses -Wno-unused-result -Wno-format-truncation -DREVISION=7.8 -I../include -I/jenkins/workspace/ESP_MemcheckCaps/7.8/CAPS/unit/LINUX64/ESP/LINUX64/include ugridWriter.c \
	-o /jenkins/workspace/ESP_MemcheckCaps/7.8/CAPS/unit/LINUX64/ESP/LINUX64/obj/ugridWriter.o
gcc-11 -g -fsanitize=address -fno-omit-frame-pointer -fuse-ld=gold -shared -Wl,-no-undefined  -o /jenkins/workspace/ESP_MemcheckCaps/7.8/CAPS/unit/LINUX64/ESP/LINUX64/lib/ugridWriter.so /jenkins/workspace/ESP_MemcheckCaps/7.8/CAPS/unit/LINUX64/ESP/LINUX64/obj/ugridWriter.o \
	-L/jenkins/workspace/ESP_MemcheckCaps/7.8/CAPS/unit/LINUX64/ESP/LINUX64/lib -laimUtil -legads -locsm -ludunits2 -ldl -lrt -lm
make[3]: Leaving directory '/jenkins/workspace/ESP_MemcheckCaps/7.8/CAPS/unit/LINUX64/CAPS/aim/meshWriter/ugridWriter'
make -C vtkWriter 
make[3]: Entering directory '/jenkins/workspace/ESP_MemcheckCaps/7.8/CAPS/unit/LINUX64/CAPS/aim/meshWriter/vtkWriter'
gcc-11 -g -fsanitize=address -fno-omit-frame-pointer -fuse-ld=gold -c -O -fno-unit-at-a-time -fPIC -Wall -Wno-dangling-else -Wno-parentheses -Wno-unused-result -Wno-format-truncation -DREVISION=7.8 -I../include -I/jenkins/workspace/ESP_MemcheckCaps/7.8/CAPS/unit/LINUX64/ESP/LINUX64/include vtkWriter.c \
	-o /jenkins/workspace/ESP_MemcheckCaps/7.8/CAPS/unit/LINUX64/ESP/LINUX64/obj/vtkWriter.o
gcc-11 -g -fsanitize=address -fno-omit-frame-pointer -fuse-ld=gold -shared -Wl,-no-undefined  -o /jenkins/workspace/ESP_MemcheckCaps/7.8/CAPS/unit/LINUX64/ESP/LINUX64/lib/vtkWriter.so /jenkins/workspace/ESP_MemcheckCaps/7.8/CAPS/unit/LINUX64/ESP/LINUX64/obj/vtkWriter.o \
	-L/jenkins/workspace/ESP_MemcheckCaps/7.8/CAPS/unit/LINUX64/ESP/LINUX64/lib -laimUtil -legads -locsm -ludunits2 -ldl -lrt -lm
make[3]: Leaving directory '/jenkins/workspace/ESP_MemcheckCaps/7.8/CAPS/unit/LINUX64/CAPS/aim/meshWriter/vtkWriter'
make[2]: Leaving directory '/jenkins/workspace/ESP_MemcheckCaps/7.8/CAPS/unit/LINUX64/CAPS/aim/meshWriter'
make -C mses 
make[2]: Entering directory '/jenkins/workspace/ESP_MemcheckCaps/7.8/CAPS/unit/LINUX64/CAPS/aim/mses'
gcc-11 -g -fsanitize=address -fno-omit-frame-pointer -fuse-ld=gold -c -O -fno-unit-at-a-time -fPIC -Wall -Wno-dangling-else -Wno-parentheses -Wno-unused-result -Wno-format-truncation -DREVISION=7.8 -I/jenkins/workspace/ESP_MemcheckCaps/7.8/CAPS/unit/LINUX64/ESP/LINUX64/include -I../utils msesAIM.c -o /jenkins/workspace/ESP_MemcheckCaps/7.8/CAPS/unit/LINUX64/ESP/LINUX64/obj/msesAIM.o
gcc-11 -g -fsanitize=address -fno-omit-frame-pointer -fuse-ld=gold -c -O -fno-unit-at-a-time -fPIC -Wall -Wno-dangling-else -Wno-parentheses -Wno-unused-result -Wno-format-truncation -DREVISION=7.8 -I/jenkins/workspace/ESP_MemcheckCaps/7.8/CAPS/unit/LINUX64/ESP/LINUX64/include -I../utils msesUtils.c -o /jenkins/workspace/ESP_MemcheckCaps/7.8/CAPS/unit/LINUX64/ESP/LINUX64/obj/msesUtils.o
gcc-11 -g -fsanitize=address -fno-omit-frame-pointer -fuse-ld=gold -shared -Wl,-no-undefined  -o /jenkins/workspace/ESP_MemcheckCaps/7.8/CAPS/unit/LINUX64/ESP/LINUX64/lib/msesAIM.so /jenkins/workspace/ESP_MemcheckCaps/7.8/CAPS/unit/LINUX64/ESP/LINUX64/obj/msesAIM.o /jenkins/workspace/ESP_MemcheckCaps/7.8/CAPS/unit/LINUX64/ESP/LINUX64/obj/msesUtils.o \
	-L/jenkins/workspace/ESP_MemcheckCaps/7.8/CAPS/unit/LINUX64/ESP/LINUX64/lib -lutils -laimUtil -locsm -legads -ludunits2 -ldl -lm
make[2]: Leaving directory '/jenkins/workspace/ESP_MemcheckCaps/7.8/CAPS/unit/LINUX64/CAPS/aim/mses'
make -C mystran 
make[2]: Entering directory '/jenkins/workspace/ESP_MemcheckCaps/7.8/CAPS/unit/LINUX64/CAPS/aim/mystran'
gcc-11 -g -fsanitize=address -fno-omit-frame-pointer -fuse-ld=gold -c -O -fno-unit-at-a-time -fPIC -Wall -Wno-dangling-else -Wno-parentheses -Wno-unused-result -Wno-format-truncation -DREVISION=7.8 -I/jenkins/workspace/ESP_MemcheckCaps/7.8/CAPS/unit/LINUX64/ESP/LINUX64/include -I../utils mystranAIM.c \
	-o /jenkins/workspace/ESP_MemcheckCaps/7.8/CAPS/unit/LINUX64/ESP/LINUX64/obj/mystranAIM.o
gcc-11 -g -fsanitize=address -fno-omit-frame-pointer -fuse-ld=gold -c -O -fno-unit-at-a-time -fPIC -Wall -Wno-dangling-else -Wno-parentheses -Wno-unused-result -Wno-format-truncation -DREVISION=7.8 -I/jenkins/workspace/ESP_MemcheckCaps/7.8/CAPS/unit/LINUX64/ESP/LINUX64/include -I../utils mystranUtils.c \
	-o /jenkins/workspace/ESP_MemcheckCaps/7.8/CAPS/unit/LINUX64/ESP/LINUX64/obj/mystranUtils.o
gcc-11 -g -fsanitize=address -fno-omit-frame-pointer -fuse-ld=gold -shared -Wl,-no-undefined  -o /jenkins/workspace/ESP_MemcheckCaps/7.8/CAPS/unit/LINUX64/ESP/LINUX64/lib/mystranAIM.so /jenkins/workspace/ESP_MemcheckCaps/7.8/CAPS/unit/LINUX64/ESP/LINUX64/obj/mystranAIM.o /jenkins/workspace/ESP_MemcheckCaps/7.8/CAPS/unit/LINUX64/ESP/LINUX64/obj/mystranUtils.o \
	-L/jenkins/workspace/ESP_MemcheckCaps/7.8/CAPS/unit/LINUX64/ESP/LINUX64/lib -lutils -laimUtil -locsm -legads -ludunits2 -ldl -lm  -L/home/jenkins/util/python/Python-3.11.9_address/install/lib -lpython3.11d -ldl  -lm 
make[2]: Leaving directory '/jenkins/workspace/ESP_MemcheckCaps/7.8/CAPS/unit/LINUX64/CAPS/aim/mystran'
make -C nastran 
make[2]: Entering directory '/jenkins/workspace/ESP_MemcheckCaps/7.8/CAPS/unit/LINUX64/CAPS/aim/nastran'
gcc-11 -g -fsanitize=address -fno-omit-frame-pointer -fuse-ld=gold -c -O -fno-unit-at-a-time -fPIC -Wall -Wno-dangling-else -Wno-parentheses -Wno-unused-result -Wno-format-truncation -DREVISION=7.8 -I/jenkins/workspace/ESP_MemcheckCaps/7.8/CAPS/unit/LINUX64/ESP/LINUX64/include -I../utils nastranAIM.c \
	-o /jenkins/workspace/ESP_MemcheckCaps/7.8/CAPS/unit/LINUX64/ESP/LINUX64/obj/nastranAIM.o
gcc-11 -g -fsanitize=address -fno-omit-frame-pointer -fuse-ld=gold -shared -Wl,-no-undefined  -o /jenkins/workspace/ESP_MemcheckCaps/7.8/CAPS/unit/LINUX64/ESP/LINUX64/lib/nastranAIM.so /jenkins/workspace/ESP_MemcheckCaps/7.8/CAPS/unit/LINUX64/ESP/LINUX64/obj/nastranAIM.o \
	-L/jenkins/workspace/ESP_MemcheckCaps/7.8/CAPS/unit/LINUX64/ESP/LINUX64/lib -lutils -laimUtil -locsm -legads -ludunits2 -ldl -lm  -L/home/jenkins/util/python/Python-3.11.9_address/install/lib -lpython3.11d -ldl  -lm 
make[2]: Leaving directory '/jenkins/workspace/ESP_MemcheckCaps/7.8/CAPS/unit/LINUX64/CAPS/aim/nastran'
make -C plato 
make[2]: Entering directory '/jenkins/workspace/ESP_MemcheckCaps/7.8/CAPS/unit/LINUX64/CAPS/aim/plato'
gcc-11 -g -fsanitize=address -fno-omit-frame-pointer -fuse-ld=gold -c -O -fno-unit-at-a-time -fPIC -Wall -Wno-dangling-else -Wno-parentheses -Wno-unused-result -Wno-format-truncation -DREVISION=7.8 -I/jenkins/workspace/ESP_MemcheckCaps/7.8/CAPS/unit/LINUX64/ESP/LINUX64/include -I../meshWriter/exodusWriter -I../utils  -I/home/jenkins/util/sandialabs/seacas/include -I. platoAIM.c \
	-o /jenkins/workspace/ESP_MemcheckCaps/7.8/CAPS/unit/LINUX64/ESP/LINUX64/obj/platoAIM.o
gcc-11 -g -fsanitize=address -fno-omit-frame-pointer -fuse-ld=gold -shared -Wl,-no-undefined  -o /jenkins/workspace/ESP_MemcheckCaps/7.8/CAPS/unit/LINUX64/ESP/LINUX64/lib/platoAIM.so /jenkins/workspace/ESP_MemcheckCaps/7.8/CAPS/unit/LINUX64/ESP/LINUX64/obj/platoAIM.o -L/jenkins/workspace/ESP_MemcheckCaps/7.8/CAPS/unit/LINUX64/ESP/LINUX64/lib \
	-L/home/jenkins/util/sandialabs/seacas/lib -lexodus -Wl,-rpath /home/jenkins/util/sandialabs/seacas/lib  \
	-laimUtil -locsm -legads -ludunits2 -ldl -lm
make[2]: Leaving directory '/jenkins/workspace/ESP_MemcheckCaps/7.8/CAPS/unit/LINUX64/CAPS/aim/plato'
make -C pointwise 
make[2]: Entering directory '/jenkins/workspace/ESP_MemcheckCaps/7.8/CAPS/unit/LINUX64/CAPS/aim/pointwise'
gcc-11 -g -fsanitize=address -fno-omit-frame-pointer -fuse-ld=gold -c -O -fno-unit-at-a-time -fPIC -Wall -Wno-dangling-else -Wno-parentheses -Wno-unused-result -Wno-format-truncation -DREVISION=7.8 -I/jenkins/workspace/ESP_MemcheckCaps/7.8/CAPS/unit/LINUX64/ESP/LINUX64/include -I../utils pointwiseAIM.c \
	-o /jenkins/workspace/ESP_MemcheckCaps/7.8/CAPS/unit/LINUX64/ESP/LINUX64/obj/pointwiseAIM.o
gcc-11 -g -fsanitize=address -fno-omit-frame-pointer -fuse-ld=gold -c -O -fno-unit-at-a-time -fPIC -Wall -Wno-dangling-else -Wno-parentheses -Wno-unused-result -Wno-format-truncation -DREVISION=7.8 -I/jenkins/workspace/ESP_MemcheckCaps/7.8/CAPS/unit/LINUX64/ESP/LINUX64/include -I../utils hashElement.c \
	-o /jenkins/workspace/ESP_MemcheckCaps/7.8/CAPS/unit/LINUX64/ESP/LINUX64/obj/hashElement.o
touch /jenkins/workspace/ESP_MemcheckCaps/7.8/CAPS/unit/LINUX64/ESP/LINUX64/lib/pointwiseAIM.so
rm /jenkins/workspace/ESP_MemcheckCaps/7.8/CAPS/unit/LINUX64/ESP/LINUX64/lib/pointwiseAIM.so
gcc-11 -g -fsanitize=address -fno-omit-frame-pointer -fuse-ld=gold -shared -Wl,-no-undefined  -o /jenkins/workspace/ESP_MemcheckCaps/7.8/CAPS/unit/LINUX64/ESP/LINUX64/lib/pointwiseAIM.so /jenkins/workspace/ESP_MemcheckCaps/7.8/CAPS/unit/LINUX64/ESP/LINUX64/obj/pointwiseAIM.o /jenkins/workspace/ESP_MemcheckCaps/7.8/CAPS/unit/LINUX64/ESP/LINUX64/obj/hashElement.o \
	-L/jenkins/workspace/ESP_MemcheckCaps/7.8/CAPS/unit/LINUX64/ESP/LINUX64/lib -lutils -laimUtil -locsm -legads -ludunits2 -ldl \
	-lrt -lm -lpthread
make[2]: Leaving directory '/jenkins/workspace/ESP_MemcheckCaps/7.8/CAPS/unit/LINUX64/CAPS/aim/pointwise'
make -C refine 
make[2]: Entering directory '/jenkins/workspace/ESP_MemcheckCaps/7.8/CAPS/unit/LINUX64/CAPS/aim/refine'
gcc-11 -g -fsanitize=address -fno-omit-frame-pointer -fuse-ld=gold -c -O -fno-unit-at-a-time -fPIC -Wall -Wno-dangling-else -Wno-parentheses -Wno-unused-result -Wno-format-truncation -DREVISION=7.8 -I/jenkins/workspace/ESP_MemcheckCaps/7.8/CAPS/unit/LINUX64/ESP/LINUX64/include -I../utils -I../meshWriter/libmeshbWriter refineAIM.c \
	-o /jenkins/workspace/ESP_MemcheckCaps/7.8/CAPS/unit/LINUX64/ESP/LINUX64/obj/refineAIM.o
touch /jenkins/workspace/ESP_MemcheckCaps/7.8/CAPS/unit/LINUX64/ESP/LINUX64/lib/refineAIM.so
rm /jenkins/workspace/ESP_MemcheckCaps/7.8/CAPS/unit/LINUX64/ESP/LINUX64/lib/refineAIM.so
gcc-11 -g -fsanitize=address -fno-omit-frame-pointer -fuse-ld=gold -shared -Wl,-no-undefined  -o /jenkins/workspace/ESP_MemcheckCaps/7.8/CAPS/unit/LINUX64/ESP/LINUX64/lib/refineAIM.so /jenkins/workspace/ESP_MemcheckCaps/7.8/CAPS/unit/LINUX64/ESP/LINUX64/obj/refineAIM.o /jenkins/workspace/ESP_MemcheckCaps/7.8/CAPS/unit/LINUX64/ESP/LINUX64/obj/libmeshb7.o \
	-L/jenkins/workspace/ESP_MemcheckCaps/7.8/CAPS/unit/LINUX64/ESP/LINUX64/lib -lutils -laimUtil -locsm -legads -ludunits2 -ldl \
	-lrt -lm
make[2]: Leaving directory '/jenkins/workspace/ESP_MemcheckCaps/7.8/CAPS/unit/LINUX64/CAPS/aim/refine'
make -C sierraSD 
make[2]: Entering directory '/jenkins/workspace/ESP_MemcheckCaps/7.8/CAPS/unit/LINUX64/CAPS/aim/sierraSD'
gcc-11 -g -fsanitize=address -fno-omit-frame-pointer -fuse-ld=gold -c -O -fno-unit-at-a-time -fPIC -Wall -Wno-dangling-else -Wno-parentheses -Wno-unused-result -Wno-format-truncation -DREVISION=7.8 -I/jenkins/workspace/ESP_MemcheckCaps/7.8/CAPS/unit/LINUX64/ESP/LINUX64/include -I../meshWriter/exodusWriter -I../utils  -I/home/jenkins/util/sandialabs/seacas/include -I. sierraSDAIM.c \
	-o /jenkins/workspace/ESP_MemcheckCaps/7.8/CAPS/unit/LINUX64/ESP/LINUX64/obj/sierraSDAIM.o
gcc-11 -g -fsanitize=address -fno-omit-frame-pointer -fuse-ld=gold -shared -Wl,-no-undefined  -o /jenkins/workspace/ESP_MemcheckCaps/7.8/CAPS/unit/LINUX64/ESP/LINUX64/lib/sierraSDAIM.so /jenkins/workspace/ESP_MemcheckCaps/7.8/CAPS/unit/LINUX64/ESP/LINUX64/obj/sierraSDAIM.o -L/jenkins/workspace/ESP_MemcheckCaps/7.8/CAPS/unit/LINUX64/ESP/LINUX64/lib \
	-L/home/jenkins/util/sandialabs/seacas/lib -lexodus -Wl,-rpath /home/jenkins/util/sandialabs/seacas/lib  \
	-lutils -laimUtil -locsm -legads -ludunits2 -ldl -lm
make[2]: Leaving directory '/jenkins/workspace/ESP_MemcheckCaps/7.8/CAPS/unit/LINUX64/CAPS/aim/sierraSD'
make -C sierraSM 
make[2]: Entering directory '/jenkins/workspace/ESP_MemcheckCaps/7.8/CAPS/unit/LINUX64/CAPS/aim/sierraSM'
gcc-11 -g -fsanitize=address -fno-omit-frame-pointer -fuse-ld=gold -c -O -fno-unit-at-a-time -fPIC -Wall -Wno-dangling-else -Wno-parentheses -Wno-unused-result -Wno-format-truncation -DREVISION=7.8 -I/jenkins/workspace/ESP_MemcheckCaps/7.8/CAPS/unit/LINUX64/ESP/LINUX64/include -I../meshWriter/exodusWriter -I../utils  -I/home/jenkins/util/sandialabs/seacas/include -I. sierraSMAIM.c \
	-o /jenkins/workspace/ESP_MemcheckCaps/7.8/CAPS/unit/LINUX64/ESP/LINUX64/obj/sierraSMAIM.o
gcc-11 -g -fsanitize=address -fno-omit-frame-pointer -fuse-ld=gold -shared -Wl,-no-undefined  -o /jenkins/workspace/ESP_MemcheckCaps/7.8/CAPS/unit/LINUX64/ESP/LINUX64/lib/sierraSMAIM.so /jenkins/workspace/ESP_MemcheckCaps/7.8/CAPS/unit/LINUX64/ESP/LINUX64/obj/sierraSMAIM.o -L/jenkins/workspace/ESP_MemcheckCaps/7.8/CAPS/unit/LINUX64/ESP/LINUX64/lib \
	-L/home/jenkins/util/sandialabs/seacas/lib -lexodus -Wl,-rpath /home/jenkins/util/sandialabs/seacas/lib  \
	-lutils -laimUtil -locsm -legads -ludunits2 -ldl -lm
make[2]: Leaving directory '/jenkins/workspace/ESP_MemcheckCaps/7.8/CAPS/unit/LINUX64/CAPS/aim/sierraSM'
make -C skeleton 
make[2]: Entering directory '/jenkins/workspace/ESP_MemcheckCaps/7.8/CAPS/unit/LINUX64/CAPS/aim/skeleton'
gcc-11 -g -fsanitize=address -fno-omit-frame-pointer -fuse-ld=gold -c -O -fno-unit-at-a-time -fPIC -Wall -Wno-dangling-else -Wno-parentheses -Wno-unused-result -Wno-format-truncation -DREVISION=7.8 -I/jenkins/workspace/ESP_MemcheckCaps/7.8/CAPS/unit/LINUX64/ESP/LINUX64/include -I../utils skeletonAIM.c \
	-o /jenkins/workspace/ESP_MemcheckCaps/7.8/CAPS/unit/LINUX64/ESP/LINUX64/obj/skeletonAIM.o
gcc-11 -g -fsanitize=address -fno-omit-frame-pointer -fuse-ld=gold -shared -Wl,-no-undefined  -o /jenkins/workspace/ESP_MemcheckCaps/7.8/CAPS/unit/LINUX64/ESP/LINUX64/lib/skeletonAIM.so /jenkins/workspace/ESP_MemcheckCaps/7.8/CAPS/unit/LINUX64/ESP/LINUX64/obj/skeletonAIM.o \
	-L/jenkins/workspace/ESP_MemcheckCaps/7.8/CAPS/unit/LINUX64/ESP/LINUX64/lib -lutils -laimUtil -locsm -legads -ludunits2 -ldl -lm
make[2]: Leaving directory '/jenkins/workspace/ESP_MemcheckCaps/7.8/CAPS/unit/LINUX64/CAPS/aim/skeleton'
make -C spinnaker 
make[2]: Entering directory '/jenkins/workspace/ESP_MemcheckCaps/7.8/CAPS/unit/LINUX64/CAPS/aim/spinnaker'
gcc-11 -g -fsanitize=address -fno-omit-frame-pointer -fuse-ld=gold -c -O -fno-unit-at-a-time -fPIC -Wall -Wno-dangling-else -Wno-parentheses -Wno-unused-result -Wno-format-truncation -DREVISION=7.8 -I/jenkins/workspace/ESP_MemcheckCaps/7.8/CAPS/unit/LINUX64/ESP/LINUX64/include \
	-I../meshWriter/exodusWriter \
	-I../meshWriter/libmeshbWriter \
	-I../utils -I/home/jenkins/util/sandialabs/seacas/include \
	-I. \
	spinnakerAIM.c \
	-o /jenkins/workspace/ESP_MemcheckCaps/7.8/CAPS/unit/LINUX64/ESP/LINUX64/obj/spinnakerAIM.o
gcc-11 -g -fsanitize=address -fno-omit-frame-pointer -fuse-ld=gold -shared -Wl,-no-undefined  -o /jenkins/workspace/ESP_MemcheckCaps/7.8/CAPS/unit/LINUX64/ESP/LINUX64/lib/spinnakerAIM.so /jenkins/workspace/ESP_MemcheckCaps/7.8/CAPS/unit/LINUX64/ESP/LINUX64/obj/spinnakerAIM.o /jenkins/workspace/ESP_MemcheckCaps/7.8/CAPS/unit/LINUX64/ESP/LINUX64/obj/libmeshb7.o -L/jenkins/workspace/ESP_MemcheckCaps/7.8/CAPS/unit/LINUX64/ESP/LINUX64/lib \
	-L/home/jenkins/util/sandialabs/seacas/lib -lexodus -Wl,-rpath /home/jenkins/util/sandialabs/seacas/lib  \
	-laimUtil -locsm -legads -ludunits2 -ldl -lm
make[2]: Leaving directory '/jenkins/workspace/ESP_MemcheckCaps/7.8/CAPS/unit/LINUX64/CAPS/aim/spinnaker'
make -C su2 
make[2]: Entering directory '/jenkins/workspace/ESP_MemcheckCaps/7.8/CAPS/unit/LINUX64/CAPS/aim/su2'
gcc-11 -g -fsanitize=address -fno-omit-frame-pointer -fuse-ld=gold -c -O -fno-unit-at-a-time -fPIC -Wall -Wno-dangling-else -Wno-parentheses -Wno-unused-result -Wno-format-truncation -DREVISION=7.8 -I/jenkins/workspace/ESP_MemcheckCaps/7.8/CAPS/unit/LINUX64/ESP/LINUX64/include -I../meshWriter/su2Writer -I../utils su2AIM.c \
	-o /jenkins/workspace/ESP_MemcheckCaps/7.8/CAPS/unit/LINUX64/ESP/LINUX64/obj/su2AIM.o
gcc-11 -g -fsanitize=address -fno-omit-frame-pointer -fuse-ld=gold -c -O -fno-unit-at-a-time -fPIC -Wall -Wno-dangling-else -Wno-parentheses -Wno-unused-result -Wno-format-truncation -DREVISION=7.8 -I/jenkins/workspace/ESP_MemcheckCaps/7.8/CAPS/unit/LINUX64/ESP/LINUX64/include -I../utils su2Utils.c \
	-o /jenkins/workspace/ESP_MemcheckCaps/7.8/CAPS/unit/LINUX64/ESP/LINUX64/obj/su2Utils.o
gcc-11 -g -fsanitize=address -fno-omit-frame-pointer -fuse-ld=gold -c -O -fno-unit-at-a-time -fPIC -Wall -Wno-dangling-else -Wno-parentheses -Wno-unused-result -Wno-format-truncation -DREVISION=7.8 -I/jenkins/workspace/ESP_MemcheckCaps/7.8/CAPS/unit/LINUX64/ESP/LINUX64/include -I../utils su2_4_Cardinal.c \
	-o /jenkins/workspace/ESP_MemcheckCaps/7.8/CAPS/unit/LINUX64/ESP/LINUX64/obj/su2_4_Cardinal.o
gcc-11 -g -fsanitize=address -fno-omit-frame-pointer -fuse-ld=gold -c -O -fno-unit-at-a-time -fPIC -Wall -Wno-dangling-else -Wno-parentheses -Wno-unused-result -Wno-format-truncation -DREVISION=7.8 -I/jenkins/workspace/ESP_MemcheckCaps/7.8/CAPS/unit/LINUX64/ESP/LINUX64/include -I../utils su2_5_Raven.c \
	-o /jenkins/workspace/ESP_MemcheckCaps/7.8/CAPS/unit/LINUX64/ESP/LINUX64/obj/su2_5_Raven.o
gcc-11 -g -fsanitize=address -fno-omit-frame-pointer -fuse-ld=gold -c -O -fno-unit-at-a-time -fPIC -Wall -Wno-dangling-else -Wno-parentheses -Wno-unused-result -Wno-format-truncation -DREVISION=7.8 -I/jenkins/workspace/ESP_MemcheckCaps/7.8/CAPS/unit/LINUX64/ESP/LINUX64/include -I../utils su2_6_Falcon.c \
	-o /jenkins/workspace/ESP_MemcheckCaps/7.8/CAPS/unit/LINUX64/ESP/LINUX64/obj/su2_6_Falcon.o
gcc-11 -g -fsanitize=address -fno-omit-frame-pointer -fuse-ld=gold -c -O -fno-unit-at-a-time -fPIC -Wall -Wno-dangling-else -Wno-parentheses -Wno-unused-result -Wno-format-truncation -DREVISION=7.8 -I/jenkins/workspace/ESP_MemcheckCaps/7.8/CAPS/unit/LINUX64/ESP/LINUX64/include -I../utils su2_7_Blackbird.c \
	-o /jenkins/workspace/ESP_MemcheckCaps/7.8/CAPS/unit/LINUX64/ESP/LINUX64/obj/su2_7_Blackbird.o
gcc-11 -g -fsanitize=address -fno-omit-frame-pointer -fuse-ld=gold -c -O -fno-unit-at-a-time -fPIC -Wall -Wno-dangling-else -Wno-parentheses -Wno-unused-result -Wno-format-truncation -DREVISION=7.8 -I/jenkins/workspace/ESP_MemcheckCaps/7.8/CAPS/unit/LINUX64/ESP/LINUX64/include -I../utils su2_801_Harrier.c \
	-o /jenkins/workspace/ESP_MemcheckCaps/7.8/CAPS/unit/LINUX64/ESP/LINUX64/obj/su2_801_Harrier.o
gcc-11 -g -fsanitize=address -fno-omit-frame-pointer -fuse-ld=gold -shared -Wl,-no-undefined  -o /jenkins/workspace/ESP_MemcheckCaps/7.8/CAPS/unit/LINUX64/ESP/LINUX64/lib/su2AIM.so /jenkins/workspace/ESP_MemcheckCaps/7.8/CAPS/unit/LINUX64/ESP/LINUX64/obj/su2AIM.o /jenkins/workspace/ESP_MemcheckCaps/7.8/CAPS/unit/LINUX64/ESP/LINUX64/obj/su2Utils.o /jenkins/workspace/ESP_MemcheckCaps/7.8/CAPS/unit/LINUX64/ESP/LINUX64/obj/su2_4_Cardinal.o /jenkins/workspace/ESP_MemcheckCaps/7.8/CAPS/unit/LINUX64/ESP/LINUX64/obj/su2_5_Raven.o /jenkins/workspace/ESP_MemcheckCaps/7.8/CAPS/unit/LINUX64/ESP/LINUX64/obj/su2_6_Falcon.o /jenkins/workspace/ESP_MemcheckCaps/7.8/CAPS/unit/LINUX64/ESP/LINUX64/obj/su2_7_Blackbird.o /jenkins/workspace/ESP_MemcheckCaps/7.8/CAPS/unit/LINUX64/ESP/LINUX64/obj/su2_801_Harrier.o \
	-L/jenkins/workspace/ESP_MemcheckCaps/7.8/CAPS/unit/LINUX64/ESP/LINUX64/lib -lutils -laimUtil -locsm -legads -ludunits2 -ldl -lm
make[2]: Leaving directory '/jenkins/workspace/ESP_MemcheckCaps/7.8/CAPS/unit/LINUX64/CAPS/aim/su2'
make -C tacs 
make[2]: Entering directory '/jenkins/workspace/ESP_MemcheckCaps/7.8/CAPS/unit/LINUX64/CAPS/aim/tacs'
gcc-11 -g -fsanitize=address -fno-omit-frame-pointer -fuse-ld=gold -c -O -fno-unit-at-a-time -fPIC -Wall -Wno-dangling-else -Wno-parentheses -Wno-unused-result -Wno-format-truncation -DREVISION=7.8 -I/jenkins/workspace/ESP_MemcheckCaps/7.8/CAPS/unit/LINUX64/ESP/LINUX64/include -I../utils tacsAIM.c \
	-o /jenkins/workspace/ESP_MemcheckCaps/7.8/CAPS/unit/LINUX64/ESP/LINUX64/obj/tacsAIM.o
gcc-11 -g -fsanitize=address -fno-omit-frame-pointer -fuse-ld=gold -shared -Wl,-no-undefined  -o /jenkins/workspace/ESP_MemcheckCaps/7.8/CAPS/unit/LINUX64/ESP/LINUX64/lib/tacsAIM.so /jenkins/workspace/ESP_MemcheckCaps/7.8/CAPS/unit/LINUX64/ESP/LINUX64/obj/tacsAIM.o \
	-L/jenkins/workspace/ESP_MemcheckCaps/7.8/CAPS/unit/LINUX64/ESP/LINUX64/lib -lutils -laimUtil -locsm -legads -ludunits2 -ldl -lm  -L/home/jenkins/util/python/Python-3.11.9_address/install/lib -lpython3.11d -ldl  -lm 
make[2]: Leaving directory '/jenkins/workspace/ESP_MemcheckCaps/7.8/CAPS/unit/LINUX64/CAPS/aim/tacs'
make -C tetgen 
make[2]: Entering directory '/jenkins/workspace/ESP_MemcheckCaps/7.8/CAPS/unit/LINUX64/CAPS/aim/tetgen'
g++-11 -g -fsanitize=address -fno-omit-frame-pointer -fuse-ld=gold -c -O -fno-unit-at-a-time -fPIC -Wall -Wno-dangling-else -Wno-parentheses -Wno-unused-result -Wno-format-truncation -DREVISION=7.8 -I/jenkins/workspace/ESP_MemcheckCaps/7.8/CAPS/unit/LINUX64/ESP/LINUX64/include -I../utils tetgenAIM.cpp \
	-o /jenkins/workspace/ESP_MemcheckCaps/7.8/CAPS/unit/LINUX64/ESP/LINUX64/obj/tetgenAIM.o
g++-11 -g -fsanitize=address -fno-omit-frame-pointer -fuse-ld=gold -c -O -fno-unit-at-a-time -fPIC -Wall -Wno-dangling-else -Wno-parentheses -Wno-unused-result -Wno-format-truncation -DREVISION=7.8 -I/jenkins/workspace/ESP_MemcheckCaps/7.8/CAPS/unit/LINUX64/ESP/LINUX64/include -I/home/jenkins/util/tetgen/tetgen1.6.0 -I../utils \
	-DTETLIBRARY tetgen_Interface.cpp -o /jenkins/workspace/ESP_MemcheckCaps/7.8/CAPS/unit/LINUX64/ESP/LINUX64/obj/tetgen_Interface.o
g++-11 -g -fsanitize=address -fno-omit-frame-pointer -fuse-ld=gold -c -O -fno-unit-at-a-time -fPIC -Wall -Wno-dangling-else -Wno-parentheses -Wno-unused-result -Wno-format-truncation -DTETLIBRARY -w /home/jenkins/util/tetgen/tetgen1.6.0/tetgen.cxx -o /jenkins/workspace/ESP_MemcheckCaps/7.8/CAPS/unit/LINUX64/ESP/LINUX64/obj/tetgen.o
g++-11 -g -fsanitize=address -fno-omit-frame-pointer -fuse-ld=gold -c -O -fno-unit-at-a-time -fPIC -Wall -Wno-dangling-else -Wno-parentheses -Wno-unused-result -Wno-format-truncation -O0 -w /home/jenkins/util/tetgen/tetgen1.6.0/predicates.cxx -o /jenkins/workspace/ESP_MemcheckCaps/7.8/CAPS/unit/LINUX64/ESP/LINUX64/obj/predicates.o
g++-11 -g -fsanitize=address -fno-omit-frame-pointer -fuse-ld=gold -shared -Wl,-no-undefined  -o /jenkins/workspace/ESP_MemcheckCaps/7.8/CAPS/unit/LINUX64/ESP/LINUX64/lib/tetgenAIM.so /jenkins/workspace/ESP_MemcheckCaps/7.8/CAPS/unit/LINUX64/ESP/LINUX64/obj/tetgenAIM.o \
	/jenkins/workspace/ESP_MemcheckCaps/7.8/CAPS/unit/LINUX64/ESP/LINUX64/obj/tetgen_Interface.o /jenkins/workspace/ESP_MemcheckCaps/7.8/CAPS/unit/LINUX64/ESP/LINUX64/obj/tetgen.o \
	/jenkins/workspace/ESP_MemcheckCaps/7.8/CAPS/unit/LINUX64/ESP/LINUX64/obj/predicates.o -L/jenkins/workspace/ESP_MemcheckCaps/7.8/CAPS/unit/LINUX64/ESP/LINUX64/lib -lutils -laimUtil -locsm \
	-legads -ludunits2 -ldl -lrt -lm
make[2]: Leaving directory '/jenkins/workspace/ESP_MemcheckCaps/7.8/CAPS/unit/LINUX64/CAPS/aim/tetgen'
make -C tsfoil 
make[2]: Entering directory '/jenkins/workspace/ESP_MemcheckCaps/7.8/CAPS/unit/LINUX64/CAPS/aim/tsfoil'
gcc-11 -g -fsanitize=address -fno-omit-frame-pointer -fuse-ld=gold -c -O -fno-unit-at-a-time -fPIC -Wall -Wno-dangling-else -Wno-parentheses -Wno-unused-result -Wno-format-truncation -DREVISION=7.8 -I/jenkins/workspace/ESP_MemcheckCaps/7.8/CAPS/unit/LINUX64/ESP/LINUX64/include -I../utils \
	tsfoilAIM.c -o /jenkins/workspace/ESP_MemcheckCaps/7.8/CAPS/unit/LINUX64/ESP/LINUX64/obj/tsfoilAIM.o
gcc-11 -g -fsanitize=address -fno-omit-frame-pointer -fuse-ld=gold -shared -Wl,-no-undefined  -o /jenkins/workspace/ESP_MemcheckCaps/7.8/CAPS/unit/LINUX64/ESP/LINUX64/lib/tsfoilAIM.so /jenkins/workspace/ESP_MemcheckCaps/7.8/CAPS/unit/LINUX64/ESP/LINUX64/obj/tsfoilAIM.o \
	-L/jenkins/workspace/ESP_MemcheckCaps/7.8/CAPS/unit/LINUX64/ESP/LINUX64/lib -lutils -laimUtil -locsm -legads -ludunits2 -ldl -lm
make[2]: Leaving directory '/jenkins/workspace/ESP_MemcheckCaps/7.8/CAPS/unit/LINUX64/CAPS/aim/tsfoil'
make -C unitTest 
make[2]: Entering directory '/jenkins/workspace/ESP_MemcheckCaps/7.8/CAPS/unit/LINUX64/CAPS/aim/unitTest'
mkdir -p /jenkins/workspace/ESP_MemcheckCaps/7.8/CAPS/unit/LINUX64/ESP/LINUX64/aimUnitTest
mkdir -p /jenkins/workspace/ESP_MemcheckCaps/7.8/CAPS/unit/LINUX64/ESP/LINUX64/aimUnitTest/pyCAPS
cp -p -f pyCAPS/Mesh_Formats.py /jenkins/workspace/ESP_MemcheckCaps/7.8/CAPS/unit/LINUX64/ESP/LINUX64/aimUnitTest/pyCAPS/Mesh_Formats.py
cp -p -f pyCAPS/test_aflr2.py /jenkins/workspace/ESP_MemcheckCaps/7.8/CAPS/unit/LINUX64/ESP/LINUX64/aimUnitTest/pyCAPS/test_aflr2.py
cp -p -f pyCAPS/test_aflr3.py /jenkins/workspace/ESP_MemcheckCaps/7.8/CAPS/unit/LINUX64/ESP/LINUX64/aimUnitTest/pyCAPS/test_aflr3.py
cp -p -f pyCAPS/test_aflr4.py /jenkins/workspace/ESP_MemcheckCaps/7.8/CAPS/unit/LINUX64/ESP/LINUX64/aimUnitTest/pyCAPS/test_aflr4.py
cp -p -f pyCAPS/test_astros.py /jenkins/workspace/ESP_MemcheckCaps/7.8/CAPS/unit/LINUX64/ESP/LINUX64/aimUnitTest/pyCAPS/test_astros.py
cp -p -f pyCAPS/test_avl.py /jenkins/workspace/ESP_MemcheckCaps/7.8/CAPS/unit/LINUX64/ESP/LINUX64/aimUnitTest/pyCAPS/test_avl.py
cp -p -f pyCAPS/test_cart3d.py /jenkins/workspace/ESP_MemcheckCaps/7.8/CAPS/unit/LINUX64/ESP/LINUX64/aimUnitTest/pyCAPS/test_cart3d.py
cp -p -f pyCAPS/test_cbaero.py /jenkins/workspace/ESP_MemcheckCaps/7.8/CAPS/unit/LINUX64/ESP/LINUX64/aimUnitTest/pyCAPS/test_cbaero.py
cp -p -f pyCAPS/test_egadsTess.py /jenkins/workspace/ESP_MemcheckCaps/7.8/CAPS/unit/LINUX64/ESP/LINUX64/aimUnitTest/pyCAPS/test_egadsTess.py
cp -p -f pyCAPS/test_fun3d.py /jenkins/workspace/ESP_MemcheckCaps/7.8/CAPS/unit/LINUX64/ESP/LINUX64/aimUnitTest/pyCAPS/test_fun3d.py
cp -p -f pyCAPS/test_masstran.py /jenkins/workspace/ESP_MemcheckCaps/7.8/CAPS/unit/LINUX64/ESP/LINUX64/aimUnitTest/pyCAPS/test_masstran.py
cp -p -f pyCAPS/test_mses.py /jenkins/workspace/ESP_MemcheckCaps/7.8/CAPS/unit/LINUX64/ESP/LINUX64/aimUnitTest/pyCAPS/test_mses.py
cp -p -f pyCAPS/test_pointwise.py /jenkins/workspace/ESP_MemcheckCaps/7.8/CAPS/unit/LINUX64/ESP/LINUX64/aimUnitTest/pyCAPS/test_pointwise.py
cp -p -f pyCAPS/test_refine.py /jenkins/workspace/ESP_MemcheckCaps/7.8/CAPS/unit/LINUX64/ESP/LINUX64/aimUnitTest/pyCAPS/test_refine.py
cp -p -f pyCAPS/test_su2.py /jenkins/workspace/ESP_MemcheckCaps/7.8/CAPS/unit/LINUX64/ESP/LINUX64/aimUnitTest/pyCAPS/test_su2.py
cp -p -f pyCAPS/test_tacs.py /jenkins/workspace/ESP_MemcheckCaps/7.8/CAPS/unit/LINUX64/ESP/LINUX64/aimUnitTest/pyCAPS/test_tacs.py
cp -p -f pyCAPS/test_tetgen.py /jenkins/workspace/ESP_MemcheckCaps/7.8/CAPS/unit/LINUX64/ESP/LINUX64/aimUnitTest/pyCAPS/test_tetgen.py
cp -p -f pyCAPS/test_xfoil.py /jenkins/workspace/ESP_MemcheckCaps/7.8/CAPS/unit/LINUX64/ESP/LINUX64/aimUnitTest/pyCAPS/test_xfoil.py
cp -p -f pyCAPS/test_zaero.py /jenkins/workspace/ESP_MemcheckCaps/7.8/CAPS/unit/LINUX64/ESP/LINUX64/aimUnitTest/pyCAPS/test_zaero.py
cp -p -f pyCAPS/Makefile /jenkins/workspace/ESP_MemcheckCaps/7.8/CAPS/unit/LINUX64/ESP/LINUX64/aimUnitTest/pyCAPS/Makefile
mkdir -p /jenkins/workspace/ESP_MemcheckCaps/7.8/CAPS/unit/LINUX64/ESP/LINUX64/aimUnitTest/csmData
cp -p -f csmData/airfoilSection.csm /jenkins/workspace/ESP_MemcheckCaps/7.8/CAPS/unit/LINUX64/ESP/LINUX64/aimUnitTest/csmData/airfoilSection.csm
cp -p -f csmData/avlSections.csm /jenkins/workspace/ESP_MemcheckCaps/7.8/CAPS/unit/LINUX64/ESP/LINUX64/aimUnitTest/csmData/avlSections.csm
cp -p -f csmData/cfd2D.csm /jenkins/workspace/ESP_MemcheckCaps/7.8/CAPS/unit/LINUX64/ESP/LINUX64/aimUnitTest/csmData/cfd2D.csm
cp -p -f csmData/cfdMultiBody.csm /jenkins/workspace/ESP_MemcheckCaps/7.8/CAPS/unit/LINUX64/ESP/LINUX64/aimUnitTest/csmData/cfdMultiBody.csm
cp -p -f csmData/cfdSingleBody.csm /jenkins/workspace/ESP_MemcheckCaps/7.8/CAPS/unit/LINUX64/ESP/LINUX64/aimUnitTest/csmData/cfdSingleBody.csm
cp -p -f csmData/cornerGeom.csm /jenkins/workspace/ESP_MemcheckCaps/7.8/CAPS/unit/LINUX64/ESP/LINUX64/aimUnitTest/csmData/cornerGeom.csm
cp -p -f csmData/feaSimplePlate.csm /jenkins/workspace/ESP_MemcheckCaps/7.8/CAPS/unit/LINUX64/ESP/LINUX64/aimUnitTest/csmData/feaSimplePlate.csm
cp -p -f csmData/feaWingBEMAero.csm /jenkins/workspace/ESP_MemcheckCaps/7.8/CAPS/unit/LINUX64/ESP/LINUX64/aimUnitTest/csmData/feaWingBEMAero.csm
cp -p -f csmData/feaWingOMLAero.csm /jenkins/workspace/ESP_MemcheckCaps/7.8/CAPS/unit/LINUX64/ESP/LINUX64/aimUnitTest/csmData/feaWingOMLAero.csm
cp -p -f csmData/kulfanSection.csm /jenkins/workspace/ESP_MemcheckCaps/7.8/CAPS/unit/LINUX64/ESP/LINUX64/aimUnitTest/csmData/kulfanSection.csm
cp -p -f csmData/kulfanSymmetricSection.csm /jenkins/workspace/ESP_MemcheckCaps/7.8/CAPS/unit/LINUX64/ESP/LINUX64/aimUnitTest/csmData/kulfanSymmetricSection.csm
cp -p -f csmData/masstran.csm /jenkins/workspace/ESP_MemcheckCaps/7.8/CAPS/unit/LINUX64/ESP/LINUX64/aimUnitTest/csmData/masstran.csm
cp -p -f csmData/multiRegions.csm /jenkins/workspace/ESP_MemcheckCaps/7.8/CAPS/unit/LINUX64/ESP/LINUX64/aimUnitTest/csmData/multiRegions.csm
cp -p -f csmData/regions.csm /jenkins/workspace/ESP_MemcheckCaps/7.8/CAPS/unit/LINUX64/ESP/LINUX64/aimUnitTest/csmData/regions.csm
mkdir -p /jenkins/workspace/ESP_MemcheckCaps/7.8/CAPS/unit/LINUX64/ESP/LINUX64/aimUnitTest/cCAPS
make[2]: Leaving directory '/jenkins/workspace/ESP_MemcheckCaps/7.8/CAPS/unit/LINUX64/CAPS/aim/unitTest'
make -C xfoil 
make[2]: Entering directory '/jenkins/workspace/ESP_MemcheckCaps/7.8/CAPS/unit/LINUX64/CAPS/aim/xfoil'
gcc-11 -g -fsanitize=address -fno-omit-frame-pointer -fuse-ld=gold -c -O -fno-unit-at-a-time -fPIC -Wall -Wno-dangling-else -Wno-parentheses -Wno-unused-result -Wno-format-truncation -DREVISION=7.8 -I/jenkins/workspace/ESP_MemcheckCaps/7.8/CAPS/unit/LINUX64/ESP/LINUX64/include -I../utils \
	xfoilAIM.c -o /jenkins/workspace/ESP_MemcheckCaps/7.8/CAPS/unit/LINUX64/ESP/LINUX64/obj/xfoilAIM.o
gcc-11 -g -fsanitize=address -fno-omit-frame-pointer -fuse-ld=gold -shared -Wl,-no-undefined  -o /jenkins/workspace/ESP_MemcheckCaps/7.8/CAPS/unit/LINUX64/ESP/LINUX64/lib/xfoilAIM.so /jenkins/workspace/ESP_MemcheckCaps/7.8/CAPS/unit/LINUX64/ESP/LINUX64/obj/xfoilAIM.o \
	-L/jenkins/workspace/ESP_MemcheckCaps/7.8/CAPS/unit/LINUX64/ESP/LINUX64/lib -lutils -laimUtil -locsm -legads -ludunits2 -ldl -lm
make[2]: Leaving directory '/jenkins/workspace/ESP_MemcheckCaps/7.8/CAPS/unit/LINUX64/CAPS/aim/xfoil'
make -C zaero 
make[2]: Entering directory '/jenkins/workspace/ESP_MemcheckCaps/7.8/CAPS/unit/LINUX64/CAPS/aim/zaero'
gcc-11 -g -fsanitize=address -fno-omit-frame-pointer -fuse-ld=gold -c -O -fno-unit-at-a-time -fPIC -Wall -Wno-dangling-else -Wno-parentheses -Wno-unused-result -Wno-format-truncation -DREVISION=7.8 -I/jenkins/workspace/ESP_MemcheckCaps/7.8/CAPS/unit/LINUX64/ESP/LINUX64/include -I../utils zaeroAIM.c -o /jenkins/workspace/ESP_MemcheckCaps/7.8/CAPS/unit/LINUX64/ESP/LINUX64/obj/zaeroAIM.o
gcc-11 -g -fsanitize=address -fno-omit-frame-pointer -fuse-ld=gold -c -O -fno-unit-at-a-time -fPIC -Wall -Wno-dangling-else -Wno-parentheses -Wno-unused-result -Wno-format-truncation -DREVISION=7.8 -I/jenkins/workspace/ESP_MemcheckCaps/7.8/CAPS/unit/LINUX64/ESP/LINUX64/include -I../utils zaeroUtils.c -o /jenkins/workspace/ESP_MemcheckCaps/7.8/CAPS/unit/LINUX64/ESP/LINUX64/obj/zaeroUtils.o
gcc-11 -g -fsanitize=address -fno-omit-frame-pointer -fuse-ld=gold -c -O -fno-unit-at-a-time -fPIC -Wall -Wno-dangling-else -Wno-parentheses -Wno-unused-result -Wno-format-truncation -DREVISION=7.8 -I/jenkins/workspace/ESP_MemcheckCaps/7.8/CAPS/unit/LINUX64/ESP/LINUX64/include -I../utils zaeroLinearFlutter.c -o /jenkins/workspace/ESP_MemcheckCaps/7.8/CAPS/unit/LINUX64/ESP/LINUX64/obj/zaeroLinearFlutter.o
gcc-11 -g -fsanitize=address -fno-omit-frame-pointer -fuse-ld=gold -c -O -fno-unit-at-a-time -fPIC -Wall -Wno-dangling-else -Wno-parentheses -Wno-unused-result -Wno-format-truncation -DREVISION=7.8 -I/jenkins/workspace/ESP_MemcheckCaps/7.8/CAPS/unit/LINUX64/ESP/LINUX64/include -I../utils zaeroTrim.c -o /jenkins/workspace/ESP_MemcheckCaps/7.8/CAPS/unit/LINUX64/ESP/LINUX64/obj/zaeroTrim.o
gcc-11 -g -fsanitize=address -fno-omit-frame-pointer -fuse-ld=gold -c -O -fno-unit-at-a-time -fPIC -Wall -Wno-dangling-else -Wno-parentheses -Wno-unused-result -Wno-format-truncation -DREVISION=7.8 -I/jenkins/workspace/ESP_MemcheckCaps/7.8/CAPS/unit/LINUX64/ESP/LINUX64/include -I../utils zaeroTypes.c -o /jenkins/workspace/ESP_MemcheckCaps/7.8/CAPS/unit/LINUX64/ESP/LINUX64/obj/zaeroTypes.o
gcc-11 -g -fsanitize=address -fno-omit-frame-pointer -fuse-ld=gold -c -O -fno-unit-at-a-time -fPIC -Wall -Wno-dangling-else -Wno-parentheses -Wno-unused-result -Wno-format-truncation -DREVISION=7.8 -I/jenkins/workspace/ESP_MemcheckCaps/7.8/CAPS/unit/LINUX64/ESP/LINUX64/include -I../utils zaeroCards.c -o /jenkins/workspace/ESP_MemcheckCaps/7.8/CAPS/unit/LINUX64/ESP/LINUX64/obj/zaeroCards.o
gcc-11 -g -fsanitize=address -fno-omit-frame-pointer -fuse-ld=gold -c -O -fno-unit-at-a-time -fPIC -Wall -Wno-dangling-else -Wno-parentheses -Wno-unused-result -Wno-format-truncation -DREVISION=7.8 -I/jenkins/workspace/ESP_MemcheckCaps/7.8/CAPS/unit/LINUX64/ESP/LINUX64/include -I../utils zaeroGeneral.c -o /jenkins/workspace/ESP_MemcheckCaps/7.8/CAPS/unit/LINUX64/ESP/LINUX64/obj/zaeroGeneral.o
gcc-11 -g -fsanitize=address -fno-omit-frame-pointer -fuse-ld=gold -c -O -fno-unit-at-a-time -fPIC -Wall -Wno-dangling-else -Wno-parentheses -Wno-unused-result -Wno-format-truncation -DREVISION=7.8 -I/jenkins/workspace/ESP_MemcheckCaps/7.8/CAPS/unit/LINUX64/ESP/LINUX64/include -I../utils zaeroGraphical.c -o /jenkins/workspace/ESP_MemcheckCaps/7.8/CAPS/unit/LINUX64/ESP/LINUX64/obj/zaeroGraphical.o
gcc-11 -g -fsanitize=address -fno-omit-frame-pointer -fuse-ld=gold -shared -Wl,-no-undefined   -o /jenkins/workspace/ESP_MemcheckCaps/7.8/CAPS/unit/LINUX64/ESP/LINUX64/lib/zaeroAIM.so /jenkins/workspace/ESP_MemcheckCaps/7.8/CAPS/unit/LINUX64/ESP/LINUX64/obj/zaeroAIM.o /jenkins/workspace/ESP_MemcheckCaps/7.8/CAPS/unit/LINUX64/ESP/LINUX64/obj/zaeroUtils.o /jenkins/workspace/ESP_MemcheckCaps/7.8/CAPS/unit/LINUX64/ESP/LINUX64/obj/zaeroLinearFlutter.o /jenkins/workspace/ESP_MemcheckCaps/7.8/CAPS/unit/LINUX64/ESP/LINUX64/obj/zaeroTrim.o /jenkins/workspace/ESP_MemcheckCaps/7.8/CAPS/unit/LINUX64/ESP/LINUX64/obj/zaeroTypes.o /jenkins/workspace/ESP_MemcheckCaps/7.8/CAPS/unit/LINUX64/ESP/LINUX64/obj/zaeroCards.o /jenkins/workspace/ESP_MemcheckCaps/7.8/CAPS/unit/LINUX64/ESP/LINUX64/obj/zaeroGeneral.o /jenkins/workspace/ESP_MemcheckCaps/7.8/CAPS/unit/LINUX64/ESP/LINUX64/obj/zaeroGraphical.o -L/jenkins/workspace/ESP_MemcheckCaps/7.8/CAPS/unit/LINUX64/ESP/LINUX64/lib -lutils -laimUtil -locsm -legads -ludunits2 -lm -ldl
make[2]: Leaving directory '/jenkins/workspace/ESP_MemcheckCaps/7.8/CAPS/unit/LINUX64/CAPS/aim/zaero'
make[1]: Leaving directory '/jenkins/workspace/ESP_MemcheckCaps/7.8/CAPS/unit/LINUX64/CAPS/aim'
(cd Slugs/src; make)
make[1]: Entering directory '/jenkins/workspace/ESP_MemcheckCaps/7.8/CAPS/unit/LINUX64/CAPS/Slugs/src'
gcc-11 -g -fsanitize=address -fno-omit-frame-pointer -fuse-ld=gold -c -O -fno-unit-at-a-time -fPIC -Wall -Wno-dangling-else -Wno-parentheses -Wno-unused-result -Wno-format-truncation -DREVISION=7.8 -I/jenkins/workspace/ESP_MemcheckCaps/7.8/CAPS/unit/LINUX64/ESP/LINUX64/include -I. Slugs.c -o /jenkins/workspace/ESP_MemcheckCaps/7.8/CAPS/unit/LINUX64/ESP/LINUX64/obj/Slugs.o
gcc-11 -g -fsanitize=address -fno-omit-frame-pointer -fuse-ld=gold -c -O -fno-unit-at-a-time -fPIC -Wall -Wno-dangling-else -Wno-parentheses -Wno-unused-result -Wno-format-truncation -DREVISION=7.8 -I/jenkins/workspace/ESP_MemcheckCaps/7.8/CAPS/unit/LINUX64/ESP/LINUX64/include -I. Fitter.c \
	-o /jenkins/workspace/ESP_MemcheckCaps/7.8/CAPS/unit/LINUX64/ESP/LINUX64/obj/Fitter.o
gcc-11 -g -fsanitize=address -fno-omit-frame-pointer -fuse-ld=gold -c -O -fno-unit-at-a-time -fPIC -Wall -Wno-dangling-else -Wno-parentheses -Wno-unused-result -Wno-format-truncation -DREVISION=7.8 -I/jenkins/workspace/ESP_MemcheckCaps/7.8/CAPS/unit/LINUX64/ESP/LINUX64/include -I. RedBlackTree.c \
	-o /jenkins/workspace/ESP_MemcheckCaps/7.8/CAPS/unit/LINUX64/ESP/LINUX64/obj/RedBlackTree.o
gcc-11 -g -fsanitize=address -fno-omit-frame-pointer -fuse-ld=gold -c -O -fno-unit-at-a-time -fPIC -Wall -Wno-dangling-else -Wno-parentheses -Wno-unused-result -Wno-format-truncation -DREVISION=7.8 -I/jenkins/workspace/ESP_MemcheckCaps/7.8/CAPS/unit/LINUX64/ESP/LINUX64/include -I. Tessellate.c \
	-o /jenkins/workspace/ESP_MemcheckCaps/7.8/CAPS/unit/LINUX64/ESP/LINUX64/obj/Tessellate.o
g++-11 -g -fsanitize=address -fno-omit-frame-pointer -fuse-ld=gold -o /jenkins/workspace/ESP_MemcheckCaps/7.8/CAPS/unit/LINUX64/ESP/LINUX64/bin/Slugs /jenkins/workspace/ESP_MemcheckCaps/7.8/CAPS/unit/LINUX64/ESP/LINUX64/obj/Slugs.o /jenkins/workspace/ESP_MemcheckCaps/7.8/CAPS/unit/LINUX64/ESP/LINUX64/obj/Fitter.o /jenkins/workspace/ESP_MemcheckCaps/7.8/CAPS/unit/LINUX64/ESP/LINUX64/obj/RedBlackTree.o \
	/jenkins/workspace/ESP_MemcheckCaps/7.8/CAPS/unit/LINUX64/ESP/LINUX64/obj/Tessellate.o -lrt -L/jenkins/workspace/ESP_MemcheckCaps/7.8/CAPS/unit/LINUX64/ESP/LINUX64/lib -lwsserver -legads \
	-lpthread -lz -lm
gcc-11 -g -fsanitize=address -fno-omit-frame-pointer -fuse-ld=gold -c -O -fno-unit-at-a-time -fPIC -Wall -Wno-dangling-else -Wno-parentheses -Wno-unused-result -Wno-format-truncation -DREVISION=7.8 -I/jenkins/workspace/ESP_MemcheckCaps/7.8/CAPS/unit/LINUX64/ESP/LINUX64/include -I. TestFit.c -o /jenkins/workspace/ESP_MemcheckCaps/7.8/CAPS/unit/LINUX64/ESP/LINUX64/obj/TestFit.o
g++-11 -g -fsanitize=address -fno-omit-frame-pointer -fuse-ld=gold -o /jenkins/workspace/ESP_MemcheckCaps/7.8/CAPS/unit/LINUX64/ESP/LINUX64/bin/TestFit /jenkins/workspace/ESP_MemcheckCaps/7.8/CAPS/unit/LINUX64/ESP/LINUX64/obj/TestFit.o /jenkins/workspace/ESP_MemcheckCaps/7.8/CAPS/unit/LINUX64/ESP/LINUX64/obj/Fitter.o -lrt -L/jenkins/workspace/ESP_MemcheckCaps/7.8/CAPS/unit/LINUX64/ESP/LINUX64/lib -legads \
	-lpthread -lz -lm
make[1]: Leaving directory '/jenkins/workspace/ESP_MemcheckCaps/7.8/CAPS/unit/LINUX64/CAPS/Slugs/src'
(cd test; make -f aim.make)
make[1]: Entering directory '/jenkins/workspace/ESP_MemcheckCaps/7.8/CAPS/unit/LINUX64/CAPS/test'
gcc-11 -g -fsanitize=address -fno-omit-frame-pointer -fuse-ld=gold -c -O -fno-unit-at-a-time -fPIC -Wall -Wno-dangling-else -Wno-parentheses -Wno-unused-result -Wno-format-truncation -DREVISION=7.8 -I/jenkins/workspace/ESP_MemcheckCaps/7.8/CAPS/unit/LINUX64/ESP/LINUX64/include aim.c -o /jenkins/workspace/ESP_MemcheckCaps/7.8/CAPS/unit/LINUX64/ESP/LINUX64/obj/aim.o
gcc-11 -g -fsanitize=address -fno-omit-frame-pointer -fuse-ld=gold -o /jenkins/workspace/ESP_MemcheckCaps/7.8/CAPS/unit/LINUX64/ESP/LINUX64/test/aim /jenkins/workspace/ESP_MemcheckCaps/7.8/CAPS/unit/LINUX64/ESP/LINUX64/obj/aim.o -L/jenkins/workspace/ESP_MemcheckCaps/7.8/CAPS/unit/LINUX64/ESP/LINUX64/lib -lcaps -locsm -legads \
	-lwsserver -lrt
cp -p -f testingAIM.csm /jenkins/workspace/ESP_MemcheckCaps/7.8/CAPS/unit/LINUX64/ESP/LINUX64/test/testingAIM.csm
make[1]: Leaving directory '/jenkins/workspace/ESP_MemcheckCaps/7.8/CAPS/unit/LINUX64/CAPS/test'
(cd test; make -f autoExec.make)
make[1]: Entering directory '/jenkins/workspace/ESP_MemcheckCaps/7.8/CAPS/unit/LINUX64/CAPS/test'
gcc-11 -g -fsanitize=address -fno-omit-frame-pointer -fuse-ld=gold -c -O -fno-unit-at-a-time -fPIC -Wall -Wno-dangling-else -Wno-parentheses -Wno-unused-result -Wno-format-truncation -DREVISION=7.8 -I/jenkins/workspace/ESP_MemcheckCaps/7.8/CAPS/unit/LINUX64/ESP/LINUX64/include autoExec.c -o /jenkins/workspace/ESP_MemcheckCaps/7.8/CAPS/unit/LINUX64/ESP/LINUX64/obj/autoExec.o
gcc-11 -g -fsanitize=address -fno-omit-frame-pointer -fuse-ld=gold -o /jenkins/workspace/ESP_MemcheckCaps/7.8/CAPS/unit/LINUX64/ESP/LINUX64/test/autoExec /jenkins/workspace/ESP_MemcheckCaps/7.8/CAPS/unit/LINUX64/ESP/LINUX64/obj/autoExec.o -L/jenkins/workspace/ESP_MemcheckCaps/7.8/CAPS/unit/LINUX64/ESP/LINUX64/lib -lcaps -locsm \
	-legads -lwsserver -lpthread -lrt -lz -lm -ldl
make[1]: Leaving directory '/jenkins/workspace/ESP_MemcheckCaps/7.8/CAPS/unit/LINUX64/CAPS/test'
(cd test; make -f newPhase.make)
make[1]: Entering directory '/jenkins/workspace/ESP_MemcheckCaps/7.8/CAPS/unit/LINUX64/CAPS/test'
gcc-11 -g -fsanitize=address -fno-omit-frame-pointer -fuse-ld=gold -c -O -fno-unit-at-a-time -fPIC -Wall -Wno-dangling-else -Wno-parentheses -Wno-unused-result -Wno-format-truncation -DREVISION=7.8 -I/jenkins/workspace/ESP_MemcheckCaps/7.8/CAPS/unit/LINUX64/ESP/LINUX64/include newPhase.c -o /jenkins/workspace/ESP_MemcheckCaps/7.8/CAPS/unit/LINUX64/ESP/LINUX64/obj/newPhase.o
gcc-11 -g -fsanitize=address -fno-omit-frame-pointer -fuse-ld=gold -o /jenkins/workspace/ESP_MemcheckCaps/7.8/CAPS/unit/LINUX64/ESP/LINUX64/test/newPhase /jenkins/workspace/ESP_MemcheckCaps/7.8/CAPS/unit/LINUX64/ESP/LINUX64/obj/newPhase.o -L/jenkins/workspace/ESP_MemcheckCaps/7.8/CAPS/unit/LINUX64/ESP/LINUX64/lib \
	-lcaps -locsm -legads -lrt -lm -ldl
make[1]: Leaving directory '/jenkins/workspace/ESP_MemcheckCaps/7.8/CAPS/unit/LINUX64/CAPS/test'
(cd test; make -f basic.make)
make[1]: Entering directory '/jenkins/workspace/ESP_MemcheckCaps/7.8/CAPS/unit/LINUX64/CAPS/test'
gcc-11 -g -fsanitize=address -fno-omit-frame-pointer -fuse-ld=gold -c -O -fno-unit-at-a-time -fPIC -Wall -Wno-dangling-else -Wno-parentheses -Wno-unused-result -Wno-format-truncation -DREVISION=7.8 -I/jenkins/workspace/ESP_MemcheckCaps/7.8/CAPS/unit/LINUX64/ESP/LINUX64/include basic.c -o /jenkins/workspace/ESP_MemcheckCaps/7.8/CAPS/unit/LINUX64/ESP/LINUX64/obj/basic.o
gcc-11 -g -fsanitize=address -fno-omit-frame-pointer -fuse-ld=gold -o /jenkins/workspace/ESP_MemcheckCaps/7.8/CAPS/unit/LINUX64/ESP/LINUX64/test/basic /jenkins/workspace/ESP_MemcheckCaps/7.8/CAPS/unit/LINUX64/ESP/LINUX64/obj/basic.o -L/jenkins/workspace/ESP_MemcheckCaps/7.8/CAPS/unit/LINUX64/ESP/LINUX64/lib -lcaps -locsm -legads\
	-lrt -lm -ldl
make[1]: Leaving directory '/jenkins/workspace/ESP_MemcheckCaps/7.8/CAPS/unit/LINUX64/CAPS/test'
(cd test; make -f geomIn.make)
make[1]: Entering directory '/jenkins/workspace/ESP_MemcheckCaps/7.8/CAPS/unit/LINUX64/CAPS/test'
gcc-11 -g -fsanitize=address -fno-omit-frame-pointer -fuse-ld=gold -c -O -fno-unit-at-a-time -fPIC -Wall -Wno-dangling-else -Wno-parentheses -Wno-unused-result -Wno-format-truncation -DREVISION=7.8 -I/jenkins/workspace/ESP_MemcheckCaps/7.8/CAPS/unit/LINUX64/ESP/LINUX64/include geomIn.c -o /jenkins/workspace/ESP_MemcheckCaps/7.8/CAPS/unit/LINUX64/ESP/LINUX64/obj/geomIn.o
gcc-11 -g -fsanitize=address -fno-omit-frame-pointer -fuse-ld=gold -o /jenkins/workspace/ESP_MemcheckCaps/7.8/CAPS/unit/LINUX64/ESP/LINUX64/test/geomIn /jenkins/workspace/ESP_MemcheckCaps/7.8/CAPS/unit/LINUX64/ESP/LINUX64/obj/geomIn.o -L/jenkins/workspace/ESP_MemcheckCaps/7.8/CAPS/unit/LINUX64/ESP/LINUX64/lib -lcaps -locsm -legads\
	-lrt -lm -ldl
make[1]: Leaving directory '/jenkins/workspace/ESP_MemcheckCaps/7.8/CAPS/unit/LINUX64/CAPS/test'
(cd test; make -f utilsTest.make)
make[1]: Entering directory '/jenkins/workspace/ESP_MemcheckCaps/7.8/CAPS/unit/LINUX64/CAPS/test'
gcc-11 -g -fsanitize=address -fno-omit-frame-pointer -fuse-ld=gold -c -O -fno-unit-at-a-time -fPIC -Wall -Wno-dangling-else -Wno-parentheses -Wno-unused-result -Wno-format-truncation -DREVISION=7.8 -I/jenkins/workspace/ESP_MemcheckCaps/7.8/CAPS/unit/LINUX64/ESP/LINUX64/include aimTransferUtilTest.c -o /jenkins/workspace/ESP_MemcheckCaps/7.8/CAPS/unit/LINUX64/ESP/LINUX64/obj/aimTransferUtilTest.o
gcc-11 -g -fsanitize=address -fno-omit-frame-pointer -fuse-ld=gold -o /jenkins/workspace/ESP_MemcheckCaps/7.8/CAPS/unit/LINUX64/ESP/LINUX64/test/aimTransferUtilTest /jenkins/workspace/ESP_MemcheckCaps/7.8/CAPS/unit/LINUX64/ESP/LINUX64/obj/aimTransferUtilTest.o -L/jenkins/workspace/ESP_MemcheckCaps/7.8/CAPS/unit/LINUX64/ESP/LINUX64/lib -lcaps -laimUtil -locsm -legads \
	-lpthread -lrt -ludunits2 -lm -ldl
gcc-11 -g -fsanitize=address -fno-omit-frame-pointer -fuse-ld=gold -c -O -fno-unit-at-a-time -fPIC -Wall -Wno-dangling-else -Wno-parentheses -Wno-unused-result -Wno-format-truncation -DREVISION=7.8 -I/jenkins/workspace/ESP_MemcheckCaps/7.8/CAPS/unit/LINUX64/ESP/LINUX64/include -I../aim/utils miscUtilsTest.c -o /jenkins/workspace/ESP_MemcheckCaps/7.8/CAPS/unit/LINUX64/ESP/LINUX64/obj/miscUtilsTest.o
gcc-11 -g -fsanitize=address -fno-omit-frame-pointer -fuse-ld=gold -o /jenkins/workspace/ESP_MemcheckCaps/7.8/CAPS/unit/LINUX64/ESP/LINUX64/test/miscUtilsTest /jenkins/workspace/ESP_MemcheckCaps/7.8/CAPS/unit/LINUX64/ESP/LINUX64/obj/miscUtilsTest.o -L/jenkins/workspace/ESP_MemcheckCaps/7.8/CAPS/unit/LINUX64/ESP/LINUX64/lib -laimUtil -locsm -legads \
	-lpthread -lrt -ludunits2 -lm -ldl
gcc-11 -g -fsanitize=address -fno-omit-frame-pointer -fuse-ld=gold -c -O -fno-unit-at-a-time -fPIC -Wall -Wno-dangling-else -Wno-parentheses -Wno-unused-result -Wno-format-truncation -DREVISION=7.8 -I/jenkins/workspace/ESP_MemcheckCaps/7.8/CAPS/unit/LINUX64/ESP/LINUX64/include -I../aim/utils vlmUtilsTest.c -o /jenkins/workspace/ESP_MemcheckCaps/7.8/CAPS/unit/LINUX64/ESP/LINUX64/obj/vlmUtilsTest.o
gcc-11 -g -fsanitize=address -fno-omit-frame-pointer -fuse-ld=gold -o /jenkins/workspace/ESP_MemcheckCaps/7.8/CAPS/unit/LINUX64/ESP/LINUX64/test/vlmUtilsTest /jenkins/workspace/ESP_MemcheckCaps/7.8/CAPS/unit/LINUX64/ESP/LINUX64/obj/vlmUtilsTest.o -L/jenkins/workspace/ESP_MemcheckCaps/7.8/CAPS/unit/LINUX64/ESP/LINUX64/lib -lutils -laimUtil -locsm -legads \
	-lpthread -lrt -ludunits2 -lm -ldl
make[1]: Leaving directory '/jenkins/workspace/ESP_MemcheckCaps/7.8/CAPS/unit/LINUX64/CAPS/test'
(cd test; make -f vVS.make)
make[1]: Entering directory '/jenkins/workspace/ESP_MemcheckCaps/7.8/CAPS/unit/LINUX64/CAPS/test'
gcc-11 -g -fsanitize=address -fno-omit-frame-pointer -fuse-ld=gold -c -O -fno-unit-at-a-time -fPIC -Wall -Wno-dangling-else -Wno-parentheses -Wno-unused-result -Wno-format-truncation -DREVISION=7.8 -I/jenkins/workspace/ESP_MemcheckCaps/7.8/CAPS/unit/LINUX64/ESP/LINUX64/include vVS.c -o /jenkins/workspace/ESP_MemcheckCaps/7.8/CAPS/unit/LINUX64/ESP/LINUX64/obj/vVS.o
g++-11 -g -fsanitize=address -fno-omit-frame-pointer -fuse-ld=gold -o /jenkins/workspace/ESP_MemcheckCaps/7.8/CAPS/unit/LINUX64/ESP/LINUX64/test/vVS /jenkins/workspace/ESP_MemcheckCaps/7.8/CAPS/unit/LINUX64/ESP/LINUX64/obj/vVS.o -L/jenkins/workspace/ESP_MemcheckCaps/7.8/CAPS/unit/LINUX64/ESP/LINUX64/lib -lwsserver -lrt
make[1]: Leaving directory '/jenkins/workspace/ESP_MemcheckCaps/7.8/CAPS/unit/LINUX64/CAPS/test'
(cd examples; make)
make[1]: Entering directory '/jenkins/workspace/ESP_MemcheckCaps/7.8/CAPS/unit/LINUX64/CAPS/examples'
mkdir -p /jenkins/workspace/ESP_MemcheckCaps/7.8/CAPS/unit/LINUX64/ESP/LINUX64/examples
mkdir -p /jenkins/workspace/ESP_MemcheckCaps/7.8/CAPS/unit/LINUX64/ESP/LINUX64/examples/analysisData
mkdir -p /jenkins/workspace/ESP_MemcheckCaps/7.8/CAPS/unit/LINUX64/ESP/LINUX64/examples/csmData
mkdir -p /jenkins/workspace/ESP_MemcheckCaps/7.8/CAPS/unit/LINUX64/ESP/LINUX64/examples/cCAPS
mkdir -p /jenkins/workspace/ESP_MemcheckCaps/7.8/CAPS/unit/LINUX64/ESP/LINUX64/examples/pyCAPS
mkdir -p /jenkins/workspace/ESP_MemcheckCaps/7.8/CAPS/unit/LINUX64/ESP/LINUX64/examples/regressionTest
mkdir -p /jenkins/workspace/ESP_MemcheckCaps/7.8/CAPS/unit/LINUX64/ESP/LINUX64/examples/corsairlite
cp -p -f pyCAPS/abaqus_AGARD445_PyTest.py /jenkins/workspace/ESP_MemcheckCaps/7.8/CAPS/unit/LINUX64/ESP/LINUX64/examples/pyCAPS/abaqus_AGARD445_PyTest.py
cp -p -f pyCAPS/abaqus_SingleLoadCase_PyTest.py /jenkins/workspace/ESP_MemcheckCaps/7.8/CAPS/unit/LINUX64/ESP/LINUX64/examples/pyCAPS/abaqus_SingleLoadCase_PyTest.py
cp -p -f pyCAPS/aeroelastic_Iterative_Fun3D_and_Mystran.py /jenkins/workspace/ESP_MemcheckCaps/7.8/CAPS/unit/LINUX64/ESP/LINUX64/examples/pyCAPS/aeroelastic_Iterative_Fun3D_and_Mystran.py
cp -p -f pyCAPS/aeroelastic_Iterative_SU2_and_Astros.py /jenkins/workspace/ESP_MemcheckCaps/7.8/CAPS/unit/LINUX64/ESP/LINUX64/examples/pyCAPS/aeroelastic_Iterative_SU2_and_Astros.py
cp -p -f pyCAPS/aeroelastic_Iterative_SU2_and_Mystran.py /jenkins/workspace/ESP_MemcheckCaps/7.8/CAPS/unit/LINUX64/ESP/LINUX64/examples/pyCAPS/aeroelastic_Iterative_SU2_and_Mystran.py
cp -p -f pyCAPS/aeroelasticModal_Fun3D_and_Astros.py /jenkins/workspace/ESP_MemcheckCaps/7.8/CAPS/unit/LINUX64/ESP/LINUX64/examples/pyCAPS/aeroelasticModal_Fun3D_and_Astros.py
cp -p -f pyCAPS/aeroelasticModal_Fun3D_and_Mystran.py /jenkins/workspace/ESP_MemcheckCaps/7.8/CAPS/unit/LINUX64/ESP/LINUX64/examples/pyCAPS/aeroelasticModal_Fun3D_and_Mystran.py
cp -p -f pyCAPS/aeroelasticModal_Fun3D_and_Nastran.py /jenkins/workspace/ESP_MemcheckCaps/7.8/CAPS/unit/LINUX64/ESP/LINUX64/examples/pyCAPS/aeroelasticModal_Fun3D_and_Nastran.py
cp -p -f pyCAPS/aeroelasticSimple_Displacement_Fun3D_and_Mystran.py /jenkins/workspace/ESP_MemcheckCaps/7.8/CAPS/unit/LINUX64/ESP/LINUX64/examples/pyCAPS/aeroelasticSimple_Displacement_Fun3D_and_Mystran.py
cp -p -f pyCAPS/aeroelasticSimple_Displacement_SU2_and_Astros.py /jenkins/workspace/ESP_MemcheckCaps/7.8/CAPS/unit/LINUX64/ESP/LINUX64/examples/pyCAPS/aeroelasticSimple_Displacement_SU2_and_Astros.py
cp -p -f pyCAPS/aeroelasticSimple_Displacement_SU2_and_Mystran.py /jenkins/workspace/ESP_MemcheckCaps/7.8/CAPS/unit/LINUX64/ESP/LINUX64/examples/pyCAPS/aeroelasticSimple_Displacement_SU2_and_Mystran.py
cp -p -f pyCAPS/aeroelasticSimple_Iterative_Cart3D_and_Mystran.py /jenkins/workspace/ESP_MemcheckCaps/7.8/CAPS/unit/LINUX64/ESP/LINUX64/examples/pyCAPS/aeroelasticSimple_Iterative_Cart3D_and_Mystran.py
cp -p -f pyCAPS/aeroelasticSimple_Iterative_Fun3D_and_Mystran.py /jenkins/workspace/ESP_MemcheckCaps/7.8/CAPS/unit/LINUX64/ESP/LINUX64/examples/pyCAPS/aeroelasticSimple_Iterative_Fun3D_and_Mystran.py
cp -p -f pyCAPS/aeroelasticSimple_Iterative_SU2_and_Astros.py /jenkins/workspace/ESP_MemcheckCaps/7.8/CAPS/unit/LINUX64/ESP/LINUX64/examples/pyCAPS/aeroelasticSimple_Iterative_SU2_and_Astros.py
cp -p -f pyCAPS/aeroelasticSimple_Iterative_SU2_and_Mystran.py /jenkins/workspace/ESP_MemcheckCaps/7.8/CAPS/unit/LINUX64/ESP/LINUX64/examples/pyCAPS/aeroelasticSimple_Iterative_SU2_and_Mystran.py
cp -p -f pyCAPS/aeroelasticSimple_Pressure_Fun3D_and_Mystran.py /jenkins/workspace/ESP_MemcheckCaps/7.8/CAPS/unit/LINUX64/ESP/LINUX64/examples/pyCAPS/aeroelasticSimple_Pressure_Fun3D_and_Mystran.py
cp -p -f pyCAPS/aeroelasticSimple_Pressure_SU2_and_Astros.py /jenkins/workspace/ESP_MemcheckCaps/7.8/CAPS/unit/LINUX64/ESP/LINUX64/examples/pyCAPS/aeroelasticSimple_Pressure_SU2_and_Astros.py
cp -p -f pyCAPS/aeroelasticSimple_Pressure_SU2_and_Mystran.py /jenkins/workspace/ESP_MemcheckCaps/7.8/CAPS/unit/LINUX64/ESP/LINUX64/examples/pyCAPS/aeroelasticSimple_Pressure_SU2_and_Mystran.py
cp -p -f pyCAPS/aeroelasticSimple_Temperature_SU2_and_TACS.py /jenkins/workspace/ESP_MemcheckCaps/7.8/CAPS/unit/LINUX64/ESP/LINUX64/examples/pyCAPS/aeroelasticSimple_Temperature_SU2_and_TACS.py
cp -p -f pyCAPS/aflr2_PyTest.py /jenkins/workspace/ESP_MemcheckCaps/7.8/CAPS/unit/LINUX64/ESP/LINUX64/examples/pyCAPS/aflr2_PyTest.py
cp -p -f pyCAPS/aflr4_and_aflr3_PyTest.py /jenkins/workspace/ESP_MemcheckCaps/7.8/CAPS/unit/LINUX64/ESP/LINUX64/examples/pyCAPS/aflr4_and_aflr3_PyTest.py
cp -p -f pyCAPS/aflr4_and_aflr3_Symmetry_PyTest.py /jenkins/workspace/ESP_MemcheckCaps/7.8/CAPS/unit/LINUX64/ESP/LINUX64/examples/pyCAPS/aflr4_and_aflr3_Symmetry_PyTest.py
cp -p -f pyCAPS/aflr4_and_Tetgen_PyTest.py /jenkins/workspace/ESP_MemcheckCaps/7.8/CAPS/unit/LINUX64/ESP/LINUX64/examples/pyCAPS/aflr4_and_Tetgen_PyTest.py
cp -p -f pyCAPS/aflr4_Generic_Missile.py /jenkins/workspace/ESP_MemcheckCaps/7.8/CAPS/unit/LINUX64/ESP/LINUX64/examples/pyCAPS/aflr4_Generic_Missile.py
cp -p -f pyCAPS/aflr4_PyTest.py /jenkins/workspace/ESP_MemcheckCaps/7.8/CAPS/unit/LINUX64/ESP/LINUX64/examples/pyCAPS/aflr4_PyTest.py
cp -p -f pyCAPS/aflr4_QuadMesh_PyTest.py /jenkins/workspace/ESP_MemcheckCaps/7.8/CAPS/unit/LINUX64/ESP/LINUX64/examples/pyCAPS/aflr4_QuadMesh_PyTest.py
cp -p -f pyCAPS/aflr4_Symmetry_PyTest.py /jenkins/workspace/ESP_MemcheckCaps/7.8/CAPS/unit/LINUX64/ESP/LINUX64/examples/pyCAPS/aflr4_Symmetry_PyTest.py
cp -p -f pyCAPS/aflr4_tetgen_Regions_PyTest.py /jenkins/workspace/ESP_MemcheckCaps/7.8/CAPS/unit/LINUX64/ESP/LINUX64/examples/pyCAPS/aflr4_tetgen_Regions_PyTest.py
cp -p -f pyCAPS/aflr4_TipTreat_PyTest.py /jenkins/workspace/ESP_MemcheckCaps/7.8/CAPS/unit/LINUX64/ESP/LINUX64/examples/pyCAPS/aflr4_TipTreat_PyTest.py
cp -p -f pyCAPS/astros_Aeroelastic_PyTest.py /jenkins/workspace/ESP_MemcheckCaps/7.8/CAPS/unit/LINUX64/ESP/LINUX64/examples/pyCAPS/astros_Aeroelastic_PyTest.py
cp -p -f pyCAPS/astros_AGARD445_PyTest.py /jenkins/workspace/ESP_MemcheckCaps/7.8/CAPS/unit/LINUX64/ESP/LINUX64/examples/pyCAPS/astros_AGARD445_PyTest.py
cp -p -f pyCAPS/astros_Composite_PyTest.py /jenkins/workspace/ESP_MemcheckCaps/7.8/CAPS/unit/LINUX64/ESP/LINUX64/examples/pyCAPS/astros_Composite_PyTest.py
cp -p -f pyCAPS/astros_CompositeWingFreq_PyTest.py /jenkins/workspace/ESP_MemcheckCaps/7.8/CAPS/unit/LINUX64/ESP/LINUX64/examples/pyCAPS/astros_CompositeWingFreq_PyTest.py
cp -p -f pyCAPS/astros_Flutter_15degree.py /jenkins/workspace/ESP_MemcheckCaps/7.8/CAPS/unit/LINUX64/ESP/LINUX64/examples/pyCAPS/astros_Flutter_15degree.py
cp -p -f pyCAPS/astros_MultipleLoadCase_PyTest.py /jenkins/workspace/ESP_MemcheckCaps/7.8/CAPS/unit/LINUX64/ESP/LINUX64/examples/pyCAPS/astros_MultipleLoadCase_PyTest.py
cp -p -f pyCAPS/astros_OptControl_PyTest.py /jenkins/workspace/ESP_MemcheckCaps/7.8/CAPS/unit/LINUX64/ESP/LINUX64/examples/pyCAPS/astros_OptControl_PyTest.py
cp -p -f pyCAPS/astros_PyTest.py /jenkins/workspace/ESP_MemcheckCaps/7.8/CAPS/unit/LINUX64/ESP/LINUX64/examples/pyCAPS/astros_PyTest.py
cp -p -f pyCAPS/astros_SingleLoadCase_PyTest.py /jenkins/workspace/ESP_MemcheckCaps/7.8/CAPS/unit/LINUX64/ESP/LINUX64/examples/pyCAPS/astros_SingleLoadCase_PyTest.py
cp -p -f pyCAPS/astros_ThreeBarFreq_PyTest.py /jenkins/workspace/ESP_MemcheckCaps/7.8/CAPS/unit/LINUX64/ESP/LINUX64/examples/pyCAPS/astros_ThreeBarFreq_PyTest.py
cp -p -f pyCAPS/astros_ThreeBarLinkDesign_PyTest.py /jenkins/workspace/ESP_MemcheckCaps/7.8/CAPS/unit/LINUX64/ESP/LINUX64/examples/pyCAPS/astros_ThreeBarLinkDesign_PyTest.py
cp -p -f pyCAPS/astros_ThreeBarMultiLoad_PyTest.py /jenkins/workspace/ESP_MemcheckCaps/7.8/CAPS/unit/LINUX64/ESP/LINUX64/examples/pyCAPS/astros_ThreeBarMultiLoad_PyTest.py
cp -p -f pyCAPS/astros_ThreeBar_PyTest.py /jenkins/workspace/ESP_MemcheckCaps/7.8/CAPS/unit/LINUX64/ESP/LINUX64/examples/pyCAPS/astros_ThreeBar_PyTest.py
cp -p -f pyCAPS/astros_Trim_15degree.py /jenkins/workspace/ESP_MemcheckCaps/7.8/CAPS/unit/LINUX64/ESP/LINUX64/examples/pyCAPS/astros_Trim_15degree.py
cp -p -f pyCAPS/autoLink_Pytest.py /jenkins/workspace/ESP_MemcheckCaps/7.8/CAPS/unit/LINUX64/ESP/LINUX64/examples/pyCAPS/autoLink_Pytest.py
cp -p -f pyCAPS/avl_AutoSpan_PyTest.py /jenkins/workspace/ESP_MemcheckCaps/7.8/CAPS/unit/LINUX64/ESP/LINUX64/examples/pyCAPS/avl_AutoSpan_PyTest.py
cp -p -f pyCAPS/avl_ControlSurf_PyTest.py /jenkins/workspace/ESP_MemcheckCaps/7.8/CAPS/unit/LINUX64/ESP/LINUX64/examples/pyCAPS/avl_ControlSurf_PyTest.py
cp -p -f pyCAPS/avl_DesignSweep_PyTest.py /jenkins/workspace/ESP_MemcheckCaps/7.8/CAPS/unit/LINUX64/ESP/LINUX64/examples/pyCAPS/avl_DesignSweep_PyTest.py
cp -p -f pyCAPS/avl_EigenValue_PyTest.py /jenkins/workspace/ESP_MemcheckCaps/7.8/CAPS/unit/LINUX64/ESP/LINUX64/examples/pyCAPS/avl_EigenValue_PyTest.py
cp -p -f pyCAPS/avl_OpenMDAO_3_PyTest.py /jenkins/workspace/ESP_MemcheckCaps/7.8/CAPS/unit/LINUX64/ESP/LINUX64/examples/pyCAPS/avl_OpenMDAO_3_PyTest.py
cp -p -f pyCAPS/avl_PyTest.py /jenkins/workspace/ESP_MemcheckCaps/7.8/CAPS/unit/LINUX64/ESP/LINUX64/examples/pyCAPS/avl_PyTest.py
cp -p -f pyCAPS/awave_PyTest.py /jenkins/workspace/ESP_MemcheckCaps/7.8/CAPS/unit/LINUX64/ESP/LINUX64/examples/pyCAPS/awave_PyTest.py
cp -p -f pyCAPS/cart3d_OpenMDAO_3_alpha_PyTest.py /jenkins/workspace/ESP_MemcheckCaps/7.8/CAPS/unit/LINUX64/ESP/LINUX64/examples/pyCAPS/cart3d_OpenMDAO_3_alpha_PyTest.py
cp -p -f pyCAPS/cart3d_OpenMDAO_3_twist_PyTest.py /jenkins/workspace/ESP_MemcheckCaps/7.8/CAPS/unit/LINUX64/ESP/LINUX64/examples/pyCAPS/cart3d_OpenMDAO_3_twist_PyTest.py
cp -p -f pyCAPS/cart3d_PyTest.py /jenkins/workspace/ESP_MemcheckCaps/7.8/CAPS/unit/LINUX64/ESP/LINUX64/examples/pyCAPS/cart3d_PyTest.py
cp -p -f pyCAPS/cbaero_PyTest.py /jenkins/workspace/ESP_MemcheckCaps/7.8/CAPS/unit/LINUX64/ESP/LINUX64/examples/pyCAPS/cbaero_PyTest.py
cp -p -f pyCAPS/delaundo_PyTest.py /jenkins/workspace/ESP_MemcheckCaps/7.8/CAPS/unit/LINUX64/ESP/LINUX64/examples/pyCAPS/delaundo_PyTest.py
cp -p -f pyCAPS/egadsTess_Box_Quad_Pytest.py /jenkins/workspace/ESP_MemcheckCaps/7.8/CAPS/unit/LINUX64/ESP/LINUX64/examples/pyCAPS/egadsTess_Box_Quad_Pytest.py
cp -p -f pyCAPS/egadsTess_Nose_Quad_PyTest.py /jenkins/workspace/ESP_MemcheckCaps/7.8/CAPS/unit/LINUX64/ESP/LINUX64/examples/pyCAPS/egadsTess_Nose_Quad_PyTest.py
cp -p -f pyCAPS/egadsTess_PyTest.py /jenkins/workspace/ESP_MemcheckCaps/7.8/CAPS/unit/LINUX64/ESP/LINUX64/examples/pyCAPS/egadsTess_PyTest.py
cp -p -f pyCAPS/egadsTess_Spheres_Quad_PyTest.py /jenkins/workspace/ESP_MemcheckCaps/7.8/CAPS/unit/LINUX64/ESP/LINUX64/examples/pyCAPS/egadsTess_Spheres_Quad_PyTest.py
cp -p -f pyCAPS/friction_PyTest.py /jenkins/workspace/ESP_MemcheckCaps/7.8/CAPS/unit/LINUX64/ESP/LINUX64/examples/pyCAPS/friction_PyTest.py
cp -p -f pyCAPS/fun3d_and_AFLR2_NodeDist_PyTest.py /jenkins/workspace/ESP_MemcheckCaps/7.8/CAPS/unit/LINUX64/ESP/LINUX64/examples/pyCAPS/fun3d_and_AFLR2_NodeDist_PyTest.py
cp -p -f pyCAPS/fun3d_and_AFLR2_PyTest.py /jenkins/workspace/ESP_MemcheckCaps/7.8/CAPS/unit/LINUX64/ESP/LINUX64/examples/pyCAPS/fun3d_and_AFLR2_PyTest.py
cp -p -f pyCAPS/fun3d_and_AFLR4_AFLR3_PyTest.py /jenkins/workspace/ESP_MemcheckCaps/7.8/CAPS/unit/LINUX64/ESP/LINUX64/examples/pyCAPS/fun3d_and_AFLR4_AFLR3_PyTest.py
cp -p -f pyCAPS/fun3d_and_Delaundo_PyTest.py /jenkins/workspace/ESP_MemcheckCaps/7.8/CAPS/unit/LINUX64/ESP/LINUX64/examples/pyCAPS/fun3d_and_Delaundo_PyTest.py
cp -p -f pyCAPS/fun3d_and_Tetgen_AlphaSweep_PyTest.py /jenkins/workspace/ESP_MemcheckCaps/7.8/CAPS/unit/LINUX64/ESP/LINUX64/examples/pyCAPS/fun3d_and_Tetgen_AlphaSweep_PyTest.py
cp -p -f pyCAPS/fun3d_and_Tetgen_PyTest.py /jenkins/workspace/ESP_MemcheckCaps/7.8/CAPS/unit/LINUX64/ESP/LINUX64/examples/pyCAPS/fun3d_and_Tetgen_PyTest.py
cp -p -f pyCAPS/fun3d_Morph_PyTest.py /jenkins/workspace/ESP_MemcheckCaps/7.8/CAPS/unit/LINUX64/ESP/LINUX64/examples/pyCAPS/fun3d_Morph_PyTest.py
cp -p -f pyCAPS/fun3d_OpenMDAO_3_PyTest.py /jenkins/workspace/ESP_MemcheckCaps/7.8/CAPS/unit/LINUX64/ESP/LINUX64/examples/pyCAPS/fun3d_OpenMDAO_3_PyTest.py
cp -p -f pyCAPS/fun3d_refine_PyTest.py /jenkins/workspace/ESP_MemcheckCaps/7.8/CAPS/unit/LINUX64/ESP/LINUX64/examples/pyCAPS/fun3d_refine_PyTest.py
cp -p -f pyCAPS/hsm_CantileverPlate_PyTest.py /jenkins/workspace/ESP_MemcheckCaps/7.8/CAPS/unit/LINUX64/ESP/LINUX64/examples/pyCAPS/hsm_CantileverPlate_PyTest.py
cp -p -f pyCAPS/hsm_SingleLoadCase_PyTest.py /jenkins/workspace/ESP_MemcheckCaps/7.8/CAPS/unit/LINUX64/ESP/LINUX64/examples/pyCAPS/hsm_SingleLoadCase_PyTest.py
cp -p -f pyCAPS/masstran_AGARD445_PyTest.py /jenkins/workspace/ESP_MemcheckCaps/7.8/CAPS/unit/LINUX64/ESP/LINUX64/examples/pyCAPS/masstran_AGARD445_PyTest.py
cp -p -f pyCAPS/masstran_PyTest.py /jenkins/workspace/ESP_MemcheckCaps/7.8/CAPS/unit/LINUX64/ESP/LINUX64/examples/pyCAPS/masstran_PyTest.py
cp -p -f pyCAPS/mses_OpenMDAO_3_PyTest.py /jenkins/workspace/ESP_MemcheckCaps/7.8/CAPS/unit/LINUX64/ESP/LINUX64/examples/pyCAPS/mses_OpenMDAO_3_PyTest.py
cp -p -f pyCAPS/mses_PyTest.py /jenkins/workspace/ESP_MemcheckCaps/7.8/CAPS/unit/LINUX64/ESP/LINUX64/examples/pyCAPS/mses_PyTest.py
cp -p -f pyCAPS/mystran_AGARD445_PyTest.py /jenkins/workspace/ESP_MemcheckCaps/7.8/CAPS/unit/LINUX64/ESP/LINUX64/examples/pyCAPS/mystran_AGARD445_PyTest.py
cp -p -f pyCAPS/mystran_MultiLoadCase_PyTest.py /jenkins/workspace/ESP_MemcheckCaps/7.8/CAPS/unit/LINUX64/ESP/LINUX64/examples/pyCAPS/mystran_MultiLoadCase_PyTest.py
cp -p -f pyCAPS/mystran_PyTest.py /jenkins/workspace/ESP_MemcheckCaps/7.8/CAPS/unit/LINUX64/ESP/LINUX64/examples/pyCAPS/mystran_PyTest.py
cp -p -f pyCAPS/mystran_SingleLoadCase_PyTest.py /jenkins/workspace/ESP_MemcheckCaps/7.8/CAPS/unit/LINUX64/ESP/LINUX64/examples/pyCAPS/mystran_SingleLoadCase_PyTest.py
cp -p -f pyCAPS/nastran_Aeroelastic_PyTest.py /jenkins/workspace/ESP_MemcheckCaps/7.8/CAPS/unit/LINUX64/ESP/LINUX64/examples/pyCAPS/nastran_Aeroelastic_PyTest.py
cp -p -f pyCAPS/nastran_AGARD445_PyTest.py /jenkins/workspace/ESP_MemcheckCaps/7.8/CAPS/unit/LINUX64/ESP/LINUX64/examples/pyCAPS/nastran_AGARD445_PyTest.py
cp -p -f pyCAPS/nastran_Composite_PyTest.py /jenkins/workspace/ESP_MemcheckCaps/7.8/CAPS/unit/LINUX64/ESP/LINUX64/examples/pyCAPS/nastran_Composite_PyTest.py
cp -p -f pyCAPS/nastran_CompositeWingDesign_PyTest.py /jenkins/workspace/ESP_MemcheckCaps/7.8/CAPS/unit/LINUX64/ESP/LINUX64/examples/pyCAPS/nastran_CompositeWingDesign_PyTest.py
cp -p -f pyCAPS/nastran_CompositeWingFreq_PyTest.py /jenkins/workspace/ESP_MemcheckCaps/7.8/CAPS/unit/LINUX64/ESP/LINUX64/examples/pyCAPS/nastran_CompositeWingFreq_PyTest.py
cp -p -f pyCAPS/nastran_Flutter_15degree.py /jenkins/workspace/ESP_MemcheckCaps/7.8/CAPS/unit/LINUX64/ESP/LINUX64/examples/pyCAPS/nastran_Flutter_15degree.py
cp -p -f pyCAPS/nastran_MultiLoadCase_PyTest.py /jenkins/workspace/ESP_MemcheckCaps/7.8/CAPS/unit/LINUX64/ESP/LINUX64/examples/pyCAPS/nastran_MultiLoadCase_PyTest.py
cp -p -f pyCAPS/nastran_OptimizationMultiLoad_PyTest.py /jenkins/workspace/ESP_MemcheckCaps/7.8/CAPS/unit/LINUX64/ESP/LINUX64/examples/pyCAPS/nastran_OptimizationMultiLoad_PyTest.py
cp -p -f pyCAPS/nastran_PlateMisc_PyTest.py /jenkins/workspace/ESP_MemcheckCaps/7.8/CAPS/unit/LINUX64/ESP/LINUX64/examples/pyCAPS/nastran_PlateMisc_PyTest.py
cp -p -f pyCAPS/nastran_PyTest.py /jenkins/workspace/ESP_MemcheckCaps/7.8/CAPS/unit/LINUX64/ESP/LINUX64/examples/pyCAPS/nastran_PyTest.py
cp -p -f pyCAPS/nastran_SingleLoadCase_PyTest.py /jenkins/workspace/ESP_MemcheckCaps/7.8/CAPS/unit/LINUX64/ESP/LINUX64/examples/pyCAPS/nastran_SingleLoadCase_PyTest.py
cp -p -f pyCAPS/nastran_ThreeBarDesign_PyTest.py /jenkins/workspace/ESP_MemcheckCaps/7.8/CAPS/unit/LINUX64/ESP/LINUX64/examples/pyCAPS/nastran_ThreeBarDesign_PyTest.py
cp -p -f pyCAPS/nastran_ThreeBarFreq_PyTest.py /jenkins/workspace/ESP_MemcheckCaps/7.8/CAPS/unit/LINUX64/ESP/LINUX64/examples/pyCAPS/nastran_ThreeBarFreq_PyTest.py
cp -p -f pyCAPS/nastran_ThreeBarLinkDesign_PyTest.py /jenkins/workspace/ESP_MemcheckCaps/7.8/CAPS/unit/LINUX64/ESP/LINUX64/examples/pyCAPS/nastran_ThreeBarLinkDesign_PyTest.py
cp -p -f pyCAPS/nastran_ThreeBarMultiLoad_PyTest.py /jenkins/workspace/ESP_MemcheckCaps/7.8/CAPS/unit/LINUX64/ESP/LINUX64/examples/pyCAPS/nastran_ThreeBarMultiLoad_PyTest.py
cp -p -f pyCAPS/nastran_ThreeBar_PyTest.py /jenkins/workspace/ESP_MemcheckCaps/7.8/CAPS/unit/LINUX64/ESP/LINUX64/examples/pyCAPS/nastran_ThreeBar_PyTest.py
cp -p -f pyCAPS/nastran_Trim_15degree.py /jenkins/workspace/ESP_MemcheckCaps/7.8/CAPS/unit/LINUX64/ESP/LINUX64/examples/pyCAPS/nastran_Trim_15degree.py
cp -p -f pyCAPS/plato_aflr_airfoil_morph_PyTest.py /jenkins/workspace/ESP_MemcheckCaps/7.8/CAPS/unit/LINUX64/ESP/LINUX64/examples/pyCAPS/plato_aflr_airfoil_morph_PyTest.py
cp -p -f pyCAPS/plato_aflr_airfoil_PyTest.py /jenkins/workspace/ESP_MemcheckCaps/7.8/CAPS/unit/LINUX64/ESP/LINUX64/examples/pyCAPS/plato_aflr_airfoil_PyTest.py
cp -p -f pyCAPS/plato_aflr_cyli_box_PyTest.py /jenkins/workspace/ESP_MemcheckCaps/7.8/CAPS/unit/LINUX64/ESP/LINUX64/examples/pyCAPS/plato_aflr_cyli_box_PyTest.py
cp -p -f pyCAPS/plato_aflr_table_morph_PyTest.py /jenkins/workspace/ESP_MemcheckCaps/7.8/CAPS/unit/LINUX64/ESP/LINUX64/examples/pyCAPS/plato_aflr_table_morph_PyTest.py
cp -p -f pyCAPS/plato_aflr_table_PyTest.py /jenkins/workspace/ESP_MemcheckCaps/7.8/CAPS/unit/LINUX64/ESP/LINUX64/examples/pyCAPS/plato_aflr_table_PyTest.py
cp -p -f pyCAPS/plato_aflr_tetgen_cyli_box_PyTest.py /jenkins/workspace/ESP_MemcheckCaps/7.8/CAPS/unit/LINUX64/ESP/LINUX64/examples/pyCAPS/plato_aflr_tetgen_cyli_box_PyTest.py
cp -p -f pyCAPS/plato_aflr_tetgen_table_PyTest.py /jenkins/workspace/ESP_MemcheckCaps/7.8/CAPS/unit/LINUX64/ESP/LINUX64/examples/pyCAPS/plato_aflr_tetgen_table_PyTest.py
cp -p -f pyCAPS/plato_tetgen_cyli_box_PyTest.py /jenkins/workspace/ESP_MemcheckCaps/7.8/CAPS/unit/LINUX64/ESP/LINUX64/examples/pyCAPS/plato_tetgen_cyli_box_PyTest.py
cp -p -f pyCAPS/plato_tetgen_table_PyTest.py /jenkins/workspace/ESP_MemcheckCaps/7.8/CAPS/unit/LINUX64/ESP/LINUX64/examples/pyCAPS/plato_tetgen_table_PyTest.py
cp -p -f pyCAPS/pointwise_PyTest.py /jenkins/workspace/ESP_MemcheckCaps/7.8/CAPS/unit/LINUX64/ESP/LINUX64/examples/pyCAPS/pointwise_PyTest.py
cp -p -f pyCAPS/pointwise_Symmetry_PyTest.py /jenkins/workspace/ESP_MemcheckCaps/7.8/CAPS/unit/LINUX64/ESP/LINUX64/examples/pyCAPS/pointwise_Symmetry_PyTest.py
cp -p -f pyCAPS/su2_and_AFLR2_NodeDist_PyTest.py /jenkins/workspace/ESP_MemcheckCaps/7.8/CAPS/unit/LINUX64/ESP/LINUX64/examples/pyCAPS/su2_and_AFLR2_NodeDist_PyTest.py
cp -p -f pyCAPS/su2_and_AFLR2_PyTest.py /jenkins/workspace/ESP_MemcheckCaps/7.8/CAPS/unit/LINUX64/ESP/LINUX64/examples/pyCAPS/su2_and_AFLR2_PyTest.py
cp -p -f pyCAPS/su2_and_AFLR4_AFLR3_PyTest.py /jenkins/workspace/ESP_MemcheckCaps/7.8/CAPS/unit/LINUX64/ESP/LINUX64/examples/pyCAPS/su2_and_AFLR4_AFLR3_PyTest.py
cp -p -f pyCAPS/su2_and_Delaundo_PyTest.py /jenkins/workspace/ESP_MemcheckCaps/7.8/CAPS/unit/LINUX64/ESP/LINUX64/examples/pyCAPS/su2_and_Delaundo_PyTest.py
cp -p -f pyCAPS/su2_and_pointwise_PyTest.py /jenkins/workspace/ESP_MemcheckCaps/7.8/CAPS/unit/LINUX64/ESP/LINUX64/examples/pyCAPS/su2_and_pointwise_PyTest.py
cp -p -f pyCAPS/su2_and_Tetgen_PyTest.py /jenkins/workspace/ESP_MemcheckCaps/7.8/CAPS/unit/LINUX64/ESP/LINUX64/examples/pyCAPS/su2_and_Tetgen_PyTest.py
cp -p -f pyCAPS/su2_Morph_PyTest.py /jenkins/workspace/ESP_MemcheckCaps/7.8/CAPS/unit/LINUX64/ESP/LINUX64/examples/pyCAPS/su2_Morph_PyTest.py
cp -p -f pyCAPS/su2_X43a_PyTest.py /jenkins/workspace/ESP_MemcheckCaps/7.8/CAPS/unit/LINUX64/ESP/LINUX64/examples/pyCAPS/su2_X43a_PyTest.py
cp -p -f pyCAPS/tetgen_Holes_PyTest.py /jenkins/workspace/ESP_MemcheckCaps/7.8/CAPS/unit/LINUX64/ESP/LINUX64/examples/pyCAPS/tetgen_Holes_PyTest.py
cp -p -f pyCAPS/tetgen_PyTest.py /jenkins/workspace/ESP_MemcheckCaps/7.8/CAPS/unit/LINUX64/ESP/LINUX64/examples/pyCAPS/tetgen_PyTest.py
cp -p -f pyCAPS/tetgen_Regions_PyTest.py /jenkins/workspace/ESP_MemcheckCaps/7.8/CAPS/unit/LINUX64/ESP/LINUX64/examples/pyCAPS/tetgen_Regions_PyTest.py
cp -p -f pyCAPS/tsfoil_PyTest.py /jenkins/workspace/ESP_MemcheckCaps/7.8/CAPS/unit/LINUX64/ESP/LINUX64/examples/pyCAPS/tsfoil_PyTest.py
cp -p -f pyCAPS/xfoil_PyTest.py /jenkins/workspace/ESP_MemcheckCaps/7.8/CAPS/unit/LINUX64/ESP/LINUX64/examples/pyCAPS/xfoil_PyTest.py
cp -p -f csmData/15degreeWing.csm /jenkins/workspace/ESP_MemcheckCaps/7.8/CAPS/unit/LINUX64/ESP/LINUX64/examples/csmData/15degreeWing.csm
cp -p -f csmData/aeroelasticDataTransfer.csm /jenkins/workspace/ESP_MemcheckCaps/7.8/CAPS/unit/LINUX64/ESP/LINUX64/examples/csmData/aeroelasticDataTransfer.csm
cp -p -f csmData/aeroelasticDataTransferSimple.csm /jenkins/workspace/ESP_MemcheckCaps/7.8/CAPS/unit/LINUX64/ESP/LINUX64/examples/csmData/aeroelasticDataTransferSimple.csm
cp -p -f csmData/airfoilSection.csm /jenkins/workspace/ESP_MemcheckCaps/7.8/CAPS/unit/LINUX64/ESP/LINUX64/examples/csmData/airfoilSection.csm
cp -p -f csmData/avlWing.csm /jenkins/workspace/ESP_MemcheckCaps/7.8/CAPS/unit/LINUX64/ESP/LINUX64/examples/csmData/avlWing.csm
cp -p -f csmData/avlWings.csm /jenkins/workspace/ESP_MemcheckCaps/7.8/CAPS/unit/LINUX64/ESP/LINUX64/examples/csmData/avlWings.csm
cp -p -f csmData/avlWingTail.csm /jenkins/workspace/ESP_MemcheckCaps/7.8/CAPS/unit/LINUX64/ESP/LINUX64/examples/csmData/avlWingTail.csm
cp -p -f csmData/awaveWingTailFuselage.csm /jenkins/workspace/ESP_MemcheckCaps/7.8/CAPS/unit/LINUX64/ESP/LINUX64/examples/csmData/awaveWingTailFuselage.csm
cp -p -f csmData/cfd2DArbShape.csm /jenkins/workspace/ESP_MemcheckCaps/7.8/CAPS/unit/LINUX64/ESP/LINUX64/examples/csmData/cfd2DArbShape.csm
cp -p -f csmData/cfd2D.csm /jenkins/workspace/ESP_MemcheckCaps/7.8/CAPS/unit/LINUX64/ESP/LINUX64/examples/csmData/cfd2D.csm
cp -p -f csmData/cfd_airfoilSection.csm /jenkins/workspace/ESP_MemcheckCaps/7.8/CAPS/unit/LINUX64/ESP/LINUX64/examples/csmData/cfd_airfoilSection.csm
cp -p -f csmData/cfdMultiBody.csm /jenkins/workspace/ESP_MemcheckCaps/7.8/CAPS/unit/LINUX64/ESP/LINUX64/examples/csmData/cfdMultiBody.csm
cp -p -f csmData/cfdSymmetry.csm /jenkins/workspace/ESP_MemcheckCaps/7.8/CAPS/unit/LINUX64/ESP/LINUX64/examples/csmData/cfdSymmetry.csm
cp -p -f csmData/cfdX43a.csm /jenkins/workspace/ESP_MemcheckCaps/7.8/CAPS/unit/LINUX64/ESP/LINUX64/examples/csmData/cfdX43a.csm
cp -p -f csmData/compositeWing.csm /jenkins/workspace/ESP_MemcheckCaps/7.8/CAPS/unit/LINUX64/ESP/LINUX64/examples/csmData/compositeWing.csm
cp -p -f csmData/cyli_box_shell.csm /jenkins/workspace/ESP_MemcheckCaps/7.8/CAPS/unit/LINUX64/ESP/LINUX64/examples/csmData/cyli_box_shell.csm
cp -p -f csmData/cyli_box_solid.csm /jenkins/workspace/ESP_MemcheckCaps/7.8/CAPS/unit/LINUX64/ESP/LINUX64/examples/csmData/cyli_box_solid.csm
cp -p -f csmData/feaAGARD445.csm /jenkins/workspace/ESP_MemcheckCaps/7.8/CAPS/unit/LINUX64/ESP/LINUX64/examples/csmData/feaAGARD445.csm
cp -p -f csmData/feaBoxes.csm /jenkins/workspace/ESP_MemcheckCaps/7.8/CAPS/unit/LINUX64/ESP/LINUX64/examples/csmData/feaBoxes.csm
cp -p -f csmData/feaCantileverPlate.csm /jenkins/workspace/ESP_MemcheckCaps/7.8/CAPS/unit/LINUX64/ESP/LINUX64/examples/csmData/feaCantileverPlate.csm
cp -p -f csmData/feaJoinedPlate.csm /jenkins/workspace/ESP_MemcheckCaps/7.8/CAPS/unit/LINUX64/ESP/LINUX64/examples/csmData/feaJoinedPlate.csm
cp -p -f csmData/feaSimplePlate.csm /jenkins/workspace/ESP_MemcheckCaps/7.8/CAPS/unit/LINUX64/ESP/LINUX64/examples/csmData/feaSimplePlate.csm
cp -p -f csmData/feaThreeBar.csm /jenkins/workspace/ESP_MemcheckCaps/7.8/CAPS/unit/LINUX64/ESP/LINUX64/examples/csmData/feaThreeBar.csm
cp -p -f csmData/feaWingBEMAero.csm /jenkins/workspace/ESP_MemcheckCaps/7.8/CAPS/unit/LINUX64/ESP/LINUX64/examples/csmData/feaWingBEMAero.csm
cp -p -f csmData/feaWingBEM.csm /jenkins/workspace/ESP_MemcheckCaps/7.8/CAPS/unit/LINUX64/ESP/LINUX64/examples/csmData/feaWingBEM.csm
cp -p -f csmData/frictionWingTailFuselage.csm /jenkins/workspace/ESP_MemcheckCaps/7.8/CAPS/unit/LINUX64/ESP/LINUX64/examples/csmData/frictionWingTailFuselage.csm
cp -p -f csmData/generic_missile.csm /jenkins/workspace/ESP_MemcheckCaps/7.8/CAPS/unit/LINUX64/ESP/LINUX64/examples/csmData/generic_missile.csm
cp -p -f csmData/interference.csm /jenkins/workspace/ESP_MemcheckCaps/7.8/CAPS/unit/LINUX64/ESP/LINUX64/examples/csmData/interference.csm
cp -p -f csmData/linearAero.csm /jenkins/workspace/ESP_MemcheckCaps/7.8/CAPS/unit/LINUX64/ESP/LINUX64/examples/csmData/linearAero.csm
cp -p -f csmData/nosecone1.csm /jenkins/workspace/ESP_MemcheckCaps/7.8/CAPS/unit/LINUX64/ESP/LINUX64/examples/csmData/nosecone1.csm
cp -p -f csmData/regions.csm /jenkins/workspace/ESP_MemcheckCaps/7.8/CAPS/unit/LINUX64/ESP/LINUX64/examples/csmData/regions.csm
cp -p -f csmData/simpleWingBox.csm /jenkins/workspace/ESP_MemcheckCaps/7.8/CAPS/unit/LINUX64/ESP/LINUX64/examples/csmData/simpleWingBox.csm
cp -p -f csmData/spheres.csm /jenkins/workspace/ESP_MemcheckCaps/7.8/CAPS/unit/LINUX64/ESP/LINUX64/examples/csmData/spheres.csm
cp -p -f csmData/table.csm /jenkins/workspace/ESP_MemcheckCaps/7.8/CAPS/unit/LINUX64/ESP/LINUX64/examples/csmData/table.csm
cp -p -f csmData/tiptreat.csm /jenkins/workspace/ESP_MemcheckCaps/7.8/CAPS/unit/LINUX64/ESP/LINUX64/examples/csmData/tiptreat.csm
cp -p -f csmData/avlWing.udc /jenkins/workspace/ESP_MemcheckCaps/7.8/CAPS/unit/LINUX64/ESP/LINUX64/examples/csmData/avlWing.udc
mkdir -p /jenkins/workspace/ESP_MemcheckCaps/7.8/CAPS/unit/LINUX64/ESP/LINUX64/examples/analysisData/nastran
cp -p -f analysisData/nastran/NastranAeroWingBEM.f06 /jenkins/workspace/ESP_MemcheckCaps/7.8/CAPS/unit/LINUX64/ESP/LINUX64/examples/analysisData/nastran/NastranAeroWingBEM.f06
cp -p -f analysisData/nastran/NastranCompositePlate.f06 /jenkins/workspace/ESP_MemcheckCaps/7.8/CAPS/unit/LINUX64/ESP/LINUX64/examples/analysisData/nastran/NastranCompositePlate.f06
cp -p -f analysisData/nastran/NastranCompositeWing_Design.f06 /jenkins/workspace/ESP_MemcheckCaps/7.8/CAPS/unit/LINUX64/ESP/LINUX64/examples/analysisData/nastran/NastranCompositeWing_Design.f06
cp -p -f analysisData/nastran/NastranCompositeWing_Freq.f06 /jenkins/workspace/ESP_MemcheckCaps/7.8/CAPS/unit/LINUX64/ESP/LINUX64/examples/analysisData/nastran/NastranCompositeWing_Freq.f06
cp -p -f analysisData/nastran/NastranFlutter15Deg.f06 /jenkins/workspace/ESP_MemcheckCaps/7.8/CAPS/unit/LINUX64/ESP/LINUX64/examples/analysisData/nastran/NastranFlutter15Deg.f06
cp -p -f analysisData/nastran/NastranMiscLoadPlate.f06 /jenkins/workspace/ESP_MemcheckCaps/7.8/CAPS/unit/LINUX64/ESP/LINUX64/examples/analysisData/nastran/NastranMiscLoadPlate.f06
cp -p -f analysisData/nastran/NastranModalAGARD445.f06 /jenkins/workspace/ESP_MemcheckCaps/7.8/CAPS/unit/LINUX64/ESP/LINUX64/examples/analysisData/nastran/NastranModalAGARD445.f06
cp -p -f analysisData/nastran/NastranMultiLoadPlate.f06 /jenkins/workspace/ESP_MemcheckCaps/7.8/CAPS/unit/LINUX64/ESP/LINUX64/examples/analysisData/nastran/NastranMultiLoadPlate.f06
cp -p -f analysisData/nastran/NastranOptMultiLoadPlate.f06 /jenkins/workspace/ESP_MemcheckCaps/7.8/CAPS/unit/LINUX64/ESP/LINUX64/examples/analysisData/nastran/NastranOptMultiLoadPlate.f06
cp -p -f analysisData/nastran/NastranSingleLoadPlate.f06 /jenkins/workspace/ESP_MemcheckCaps/7.8/CAPS/unit/LINUX64/ESP/LINUX64/examples/analysisData/nastran/NastranSingleLoadPlate.f06
cp -p -f analysisData/nastran/NastranThreeBarDesign.f06 /jenkins/workspace/ESP_MemcheckCaps/7.8/CAPS/unit/LINUX64/ESP/LINUX64/examples/analysisData/nastran/NastranThreeBarDesign.f06
cp -p -f analysisData/nastran/NastranThreeBar.f06 /jenkins/workspace/ESP_MemcheckCaps/7.8/CAPS/unit/LINUX64/ESP/LINUX64/examples/analysisData/nastran/NastranThreeBar.f06
cp -p -f analysisData/nastran/NastranThreeBarFreq.f06 /jenkins/workspace/ESP_MemcheckCaps/7.8/CAPS/unit/LINUX64/ESP/LINUX64/examples/analysisData/nastran/NastranThreeBarFreq.f06
cp -p -f analysisData/nastran/NastranThreeBarLinkDesign.f06 /jenkins/workspace/ESP_MemcheckCaps/7.8/CAPS/unit/LINUX64/ESP/LINUX64/examples/analysisData/nastran/NastranThreeBarLinkDesign.f06
cp -p -f analysisData/nastran/NastranThreeBarMultiLoad.f06 /jenkins/workspace/ESP_MemcheckCaps/7.8/CAPS/unit/LINUX64/ESP/LINUX64/examples/analysisData/nastran/NastranThreeBarMultiLoad.f06
cp -p -f analysisData/nastran/NastranTrim15Deg.f06 /jenkins/workspace/ESP_MemcheckCaps/7.8/CAPS/unit/LINUX64/ESP/LINUX64/examples/analysisData/nastran/NastranTrim15Deg.f06
cp -p -f analysisData/nastran/NastranWingBEM.f06 /jenkins/workspace/ESP_MemcheckCaps/7.8/CAPS/unit/LINUX64/ESP/LINUX64/examples/analysisData/nastran/NastranWingBEM.f06
mkdir -p /jenkins/workspace/ESP_MemcheckCaps/7.8/CAPS/unit/LINUX64/ESP/LINUX64/examples/corsairlite/capsPhase/csm
mkdir -p /jenkins/workspace/ESP_MemcheckCaps/7.8/CAPS/unit/LINUX64/ESP/LINUX64/examples/corsairlite/capsPhase/pyCAPS
mkdir -p /jenkins/workspace/ESP_MemcheckCaps/7.8/CAPS/unit/LINUX64/ESP/LINUX64/examples/corsairlite/multifidelity/csm
mkdir -p /jenkins/workspace/ESP_MemcheckCaps/7.8/CAPS/unit/LINUX64/ESP/LINUX64/examples/corsairlite/multifidelity/pyCAPS
cp -p -f corsairlite/boydBox.py /jenkins/workspace/ESP_MemcheckCaps/7.8/CAPS/unit/LINUX64/ESP/LINUX64/examples/corsairlite/boydBox.py
cp -p -f corsairlite/gp.py /jenkins/workspace/ESP_MemcheckCaps/7.8/CAPS/unit/LINUX64/ESP/LINUX64/examples/corsairlite/gp.py
cp -p -f corsairlite/hoburg_blackbox.py /jenkins/workspace/ESP_MemcheckCaps/7.8/CAPS/unit/LINUX64/ESP/LINUX64/examples/corsairlite/hoburg_blackbox.py
cp -p -f corsairlite/hoburg_gp.py /jenkins/workspace/ESP_MemcheckCaps/7.8/CAPS/unit/LINUX64/ESP/LINUX64/examples/corsairlite/hoburg_gp.py
cp -p -f corsairlite/qp.py /jenkins/workspace/ESP_MemcheckCaps/7.8/CAPS/unit/LINUX64/ESP/LINUX64/examples/corsairlite/qp.py
cp -p -f corsairlite/sp.py /jenkins/workspace/ESP_MemcheckCaps/7.8/CAPS/unit/LINUX64/ESP/LINUX64/examples/corsairlite/sp.py
cp -p -f corsairlite/capsPhase/csm/wing1.csm /jenkins/workspace/ESP_MemcheckCaps/7.8/CAPS/unit/LINUX64/ESP/LINUX64/examples/corsairlite/capsPhase/csm/wing1.csm
cp -p -f corsairlite/capsPhase/csm/wing2.csm /jenkins/workspace/ESP_MemcheckCaps/7.8/CAPS/unit/LINUX64/ESP/LINUX64/examples/corsairlite/capsPhase/csm/wing2.csm
cp -p -f corsairlite/capsPhase/pyCAPS/optTaperAvl.py /jenkins/workspace/ESP_MemcheckCaps/7.8/CAPS/unit/LINUX64/ESP/LINUX64/examples/corsairlite/capsPhase/pyCAPS/optTaperAvl.py
cp -p -f corsairlite/capsPhase/pyCAPS/optWingAvl.py /jenkins/workspace/ESP_MemcheckCaps/7.8/CAPS/unit/LINUX64/ESP/LINUX64/examples/corsairlite/capsPhase/pyCAPS/optWingAvl.py
cp -p -f corsairlite/capsPhase/pyCAPS/sizeWing.py /jenkins/workspace/ESP_MemcheckCaps/7.8/CAPS/unit/LINUX64/ESP/LINUX64/examples/corsairlite/capsPhase/pyCAPS/sizeWing.py
cp -p -f corsairlite/multifidelity/csm/naca.csm /jenkins/workspace/ESP_MemcheckCaps/7.8/CAPS/unit/LINUX64/ESP/LINUX64/examples/corsairlite/multifidelity/csm/naca.csm
cp -p -f corsairlite/multifidelity/pyCAPS/Camber.py /jenkins/workspace/ESP_MemcheckCaps/7.8/CAPS/unit/LINUX64/ESP/LINUX64/examples/corsairlite/multifidelity/pyCAPS/Camber.py
cp -p -f corsairlite/multifidelity/pyCAPS/CMConstraint.py /jenkins/workspace/ESP_MemcheckCaps/7.8/CAPS/unit/LINUX64/ESP/LINUX64/examples/corsairlite/multifidelity/pyCAPS/CMConstraint.py
cp -p -f corsairlite/multifidelity/pyCAPS/FlowTrip.py /jenkins/workspace/ESP_MemcheckCaps/7.8/CAPS/unit/LINUX64/ESP/LINUX64/examples/corsairlite/multifidelity/pyCAPS/FlowTrip.py
cp -p -f corsairlite/multifidelity/pyCAPS/fullModelKulfan.py /jenkins/workspace/ESP_MemcheckCaps/7.8/CAPS/unit/LINUX64/ESP/LINUX64/examples/corsairlite/multifidelity/pyCAPS/fullModelKulfan.py
cp -p -f corsairlite/multifidelity/pyCAPS/fullModelNACA.py /jenkins/workspace/ESP_MemcheckCaps/7.8/CAPS/unit/LINUX64/ESP/LINUX64/examples/corsairlite/multifidelity/pyCAPS/fullModelNACA.py
cp -p -f corsairlite/multifidelity/pyCAPS/GPSize.py /jenkins/workspace/ESP_MemcheckCaps/7.8/CAPS/unit/LINUX64/ESP/LINUX64/examples/corsairlite/multifidelity/pyCAPS/GPSize.py
cp -p -f corsairlite/multifidelity/pyCAPS/Kulfan2.py /jenkins/workspace/ESP_MemcheckCaps/7.8/CAPS/unit/LINUX64/ESP/LINUX64/examples/corsairlite/multifidelity/pyCAPS/Kulfan2.py
cp -p -f corsairlite/multifidelity/pyCAPS/Kulfan4.py /jenkins/workspace/ESP_MemcheckCaps/7.8/CAPS/unit/LINUX64/ESP/LINUX64/examples/corsairlite/multifidelity/pyCAPS/Kulfan4.py
cp -p -f corsairlite/multifidelity/pyCAPS/MSES.py /jenkins/workspace/ESP_MemcheckCaps/7.8/CAPS/unit/LINUX64/ESP/LINUX64/examples/corsairlite/multifidelity/pyCAPS/MSES.py
cp -p -f regressionTest/execute_CTestRegression.sh /jenkins/workspace/ESP_MemcheckCaps/7.8/CAPS/unit/LINUX64/ESP/LINUX64/examples/regressionTest/execute_CTestRegression.sh
cp -p -f regressionTest/execute_PyTestRegression.sh /jenkins/workspace/ESP_MemcheckCaps/7.8/CAPS/unit/LINUX64/ESP/LINUX64/examples/regressionTest/execute_PyTestRegression.sh
(make -C cCAPS -f aeroelastic_SU2.make)
make[2]: Entering directory '/jenkins/workspace/ESP_MemcheckCaps/7.8/CAPS/unit/LINUX64/CAPS/examples/cCAPS'
gcc-11 -g -fsanitize=address -fno-omit-frame-pointer -fuse-ld=gold -c -O -fno-unit-at-a-time -fPIC -Wall -Wno-dangling-else -Wno-parentheses -Wno-unused-result -Wno-format-truncation -DREVISION=7.8 -I/jenkins/workspace/ESP_MemcheckCaps/7.8/CAPS/unit/LINUX64/ESP/LINUX64/include aeroelasticSimple_Iterative_SU2_and_MystranTest.c -o /jenkins/workspace/ESP_MemcheckCaps/7.8/CAPS/unit/LINUX64/ESP/LINUX64/obj/aeroelasticSimple_Iterative_SU2_and_MystranTest.o
gcc-11 -g -fsanitize=address -fno-omit-frame-pointer -fuse-ld=gold -o /jenkins/workspace/ESP_MemcheckCaps/7.8/CAPS/unit/LINUX64/ESP/LINUX64/examples/cCAPS/aeroelasticSimple_Iterative_SU2_and_MystranTest /jenkins/workspace/ESP_MemcheckCaps/7.8/CAPS/unit/LINUX64/ESP/LINUX64/obj/aeroelasticSimple_Iterative_SU2_and_MystranTest.o -L/jenkins/workspace/ESP_MemcheckCaps/7.8/CAPS/unit/LINUX64/ESP/LINUX64/lib -lcaps -locsm -legads \
	-ludunits2 -lrt -lm -ldl
make[2]: Leaving directory '/jenkins/workspace/ESP_MemcheckCaps/7.8/CAPS/unit/LINUX64/CAPS/examples/cCAPS'
(make -C cCAPS -f avlTest.make)
make[2]: Entering directory '/jenkins/workspace/ESP_MemcheckCaps/7.8/CAPS/unit/LINUX64/CAPS/examples/cCAPS'
gcc-11 -g -fsanitize=address -fno-omit-frame-pointer -fuse-ld=gold -c -O -fno-unit-at-a-time -fPIC -Wall -Wno-dangling-else -Wno-parentheses -Wno-unused-result -Wno-format-truncation -DREVISION=7.8 -I/jenkins/workspace/ESP_MemcheckCaps/7.8/CAPS/unit/LINUX64/ESP/LINUX64/include avlTest.c -o /jenkins/workspace/ESP_MemcheckCaps/7.8/CAPS/unit/LINUX64/ESP/LINUX64/obj/avlTest.o
gcc-11 -g -fsanitize=address -fno-omit-frame-pointer -fuse-ld=gold -o /jenkins/workspace/ESP_MemcheckCaps/7.8/CAPS/unit/LINUX64/ESP/LINUX64/examples/cCAPS/avlTest /jenkins/workspace/ESP_MemcheckCaps/7.8/CAPS/unit/LINUX64/ESP/LINUX64/obj/avlTest.o -L/jenkins/workspace/ESP_MemcheckCaps/7.8/CAPS/unit/LINUX64/ESP/LINUX64/lib -lcaps -legads -locsm \
	-ludunits2 -lrt -lm -ldl
make[2]: Leaving directory '/jenkins/workspace/ESP_MemcheckCaps/7.8/CAPS/unit/LINUX64/CAPS/examples/cCAPS'
(make -C cCAPS -f awaveTest.make)
make[2]: Entering directory '/jenkins/workspace/ESP_MemcheckCaps/7.8/CAPS/unit/LINUX64/CAPS/examples/cCAPS'
gcc-11 -g -fsanitize=address -fno-omit-frame-pointer -fuse-ld=gold -c -O -fno-unit-at-a-time -fPIC -Wall -Wno-dangling-else -Wno-parentheses -Wno-unused-result -Wno-format-truncation -DREVISION=7.8 -I/jenkins/workspace/ESP_MemcheckCaps/7.8/CAPS/unit/LINUX64/ESP/LINUX64/include awaveTest.c -o /jenkins/workspace/ESP_MemcheckCaps/7.8/CAPS/unit/LINUX64/ESP/LINUX64/obj/awaveTest.o
gcc-11 -g -fsanitize=address -fno-omit-frame-pointer -fuse-ld=gold -o /jenkins/workspace/ESP_MemcheckCaps/7.8/CAPS/unit/LINUX64/ESP/LINUX64/examples/cCAPS/awaveTest /jenkins/workspace/ESP_MemcheckCaps/7.8/CAPS/unit/LINUX64/ESP/LINUX64/obj/awaveTest.o -L/jenkins/workspace/ESP_MemcheckCaps/7.8/CAPS/unit/LINUX64/ESP/LINUX64/lib -lcaps -legads -locsm \
	-ludunits2 -lrt -lm -ldl
make[2]: Leaving directory '/jenkins/workspace/ESP_MemcheckCaps/7.8/CAPS/unit/LINUX64/CAPS/examples/cCAPS'
(make -C cCAPS -f frictionTest.make)
make[2]: Entering directory '/jenkins/workspace/ESP_MemcheckCaps/7.8/CAPS/unit/LINUX64/CAPS/examples/cCAPS'
gcc-11 -g -fsanitize=address -fno-omit-frame-pointer -fuse-ld=gold -c -O -fno-unit-at-a-time -fPIC -Wall -Wno-dangling-else -Wno-parentheses -Wno-unused-result -Wno-format-truncation -DREVISION=7.8 -I/jenkins/workspace/ESP_MemcheckCaps/7.8/CAPS/unit/LINUX64/ESP/LINUX64/include frictionTest.c -o /jenkins/workspace/ESP_MemcheckCaps/7.8/CAPS/unit/LINUX64/ESP/LINUX64/obj/frictionTest.o
gcc-11 -g -fsanitize=address -fno-omit-frame-pointer -fuse-ld=gold -o /jenkins/workspace/ESP_MemcheckCaps/7.8/CAPS/unit/LINUX64/ESP/LINUX64/examples/cCAPS/frictionTest /jenkins/workspace/ESP_MemcheckCaps/7.8/CAPS/unit/LINUX64/ESP/LINUX64/obj/frictionTest.o -L/jenkins/workspace/ESP_MemcheckCaps/7.8/CAPS/unit/LINUX64/ESP/LINUX64/lib -lcaps -locsm -legads \
	-ludunits2 -lrt -lm -ldl
make[2]: Leaving directory '/jenkins/workspace/ESP_MemcheckCaps/7.8/CAPS/unit/LINUX64/CAPS/examples/cCAPS'
(make -C cCAPS -f fun3d.make)
make[2]: Entering directory '/jenkins/workspace/ESP_MemcheckCaps/7.8/CAPS/unit/LINUX64/CAPS/examples/cCAPS'
gcc-11 -g -fsanitize=address -fno-omit-frame-pointer -fuse-ld=gold -c -O -fno-unit-at-a-time -fPIC -Wall -Wno-dangling-else -Wno-parentheses -Wno-unused-result -Wno-format-truncation -DREVISION=7.8 -I/jenkins/workspace/ESP_MemcheckCaps/7.8/CAPS/unit/LINUX64/ESP/LINUX64/include fun3dAFLR2Test.c -o /jenkins/workspace/ESP_MemcheckCaps/7.8/CAPS/unit/LINUX64/ESP/LINUX64/obj/fun3dAFLR2Test.o
gcc-11 -g -fsanitize=address -fno-omit-frame-pointer -fuse-ld=gold -o /jenkins/workspace/ESP_MemcheckCaps/7.8/CAPS/unit/LINUX64/ESP/LINUX64/examples/cCAPS/fun3dAFLR2Test /jenkins/workspace/ESP_MemcheckCaps/7.8/CAPS/unit/LINUX64/ESP/LINUX64/obj/fun3dAFLR2Test.o \
-L/jenkins/workspace/ESP_MemcheckCaps/7.8/CAPS/unit/LINUX64/ESP/LINUX64/lib -lcaps -locsm -legads -ludunits2 -lrt -lm -ldl
gcc-11 -g -fsanitize=address -fno-omit-frame-pointer -fuse-ld=gold -c -O -fno-unit-at-a-time -fPIC -Wall -Wno-dangling-else -Wno-parentheses -Wno-unused-result -Wno-format-truncation -DREVISION=7.8 -I/jenkins/workspace/ESP_MemcheckCaps/7.8/CAPS/unit/LINUX64/ESP/LINUX64/include fun3dTetgenTest.c -o /jenkins/workspace/ESP_MemcheckCaps/7.8/CAPS/unit/LINUX64/ESP/LINUX64/obj/fun3dTetgenTest.o
gcc-11 -g -fsanitize=address -fno-omit-frame-pointer -fuse-ld=gold -o /jenkins/workspace/ESP_MemcheckCaps/7.8/CAPS/unit/LINUX64/ESP/LINUX64/examples/cCAPS/fun3dTetgenTest /jenkins/workspace/ESP_MemcheckCaps/7.8/CAPS/unit/LINUX64/ESP/LINUX64/obj/fun3dTetgenTest.o \
-L/jenkins/workspace/ESP_MemcheckCaps/7.8/CAPS/unit/LINUX64/ESP/LINUX64/lib -lcaps -locsm -legads -ludunits2 -lrt -lm -ldl
gcc-11 -g -fsanitize=address -fno-omit-frame-pointer -fuse-ld=gold -c -O -fno-unit-at-a-time -fPIC -Wall -Wno-dangling-else -Wno-parentheses -Wno-unused-result -Wno-format-truncation -DREVISION=7.8 -I/jenkins/workspace/ESP_MemcheckCaps/7.8/CAPS/unit/LINUX64/ESP/LINUX64/include aeroelasticTest.c -o /jenkins/workspace/ESP_MemcheckCaps/7.8/CAPS/unit/LINUX64/ESP/LINUX64/obj/aeroelasticTest.o
gcc-11 -g -fsanitize=address -fno-omit-frame-pointer -fuse-ld=gold -o /jenkins/workspace/ESP_MemcheckCaps/7.8/CAPS/unit/LINUX64/ESP/LINUX64/examples/cCAPS/aeroelasticTest /jenkins/workspace/ESP_MemcheckCaps/7.8/CAPS/unit/LINUX64/ESP/LINUX64/obj/aeroelasticTest.o \
-L/jenkins/workspace/ESP_MemcheckCaps/7.8/CAPS/unit/LINUX64/ESP/LINUX64/lib -lcaps -locsm -legads -ludunits2 -lrt -lm -ldl
make[2]: Leaving directory '/jenkins/workspace/ESP_MemcheckCaps/7.8/CAPS/unit/LINUX64/CAPS/examples/cCAPS'
(make -C cCAPS -f hsm.make)
make[2]: Entering directory '/jenkins/workspace/ESP_MemcheckCaps/7.8/CAPS/unit/LINUX64/CAPS/examples/cCAPS'
gcc-11 -g -fsanitize=address -fno-omit-frame-pointer -fuse-ld=gold -c -O -fno-unit-at-a-time -fPIC -Wall -Wno-dangling-else -Wno-parentheses -Wno-unused-result -Wno-format-truncation -DREVISION=7.8 -I/jenkins/workspace/ESP_MemcheckCaps/7.8/CAPS/unit/LINUX64/ESP/LINUX64/include hsmTest.c -o /jenkins/workspace/ESP_MemcheckCaps/7.8/CAPS/unit/LINUX64/ESP/LINUX64/obj/hsmTest.o   
gcc-11 -g -fsanitize=address -fno-omit-frame-pointer -fuse-ld=gold -o /jenkins/workspace/ESP_MemcheckCaps/7.8/CAPS/unit/LINUX64/ESP/LINUX64/examples/cCAPS/hsmTest /jenkins/workspace/ESP_MemcheckCaps/7.8/CAPS/unit/LINUX64/ESP/LINUX64/obj/hsmTest.o \
	-L/jenkins/workspace/ESP_MemcheckCaps/7.8/CAPS/unit/LINUX64/ESP/LINUX64/lib -lcaps -locsm -legads -ludunits2 -lrt -lm -ldl
gcc-11 -g -fsanitize=address -fno-omit-frame-pointer -fuse-ld=gold -c -O -fno-unit-at-a-time -fPIC -Wall -Wno-dangling-else -Wno-parentheses -Wno-unused-result -Wno-format-truncation -DREVISION=7.8 -I/jenkins/workspace/ESP_MemcheckCaps/7.8/CAPS/unit/LINUX64/ESP/LINUX64/include hsmSimplePlateTest.c -o /jenkins/workspace/ESP_MemcheckCaps/7.8/CAPS/unit/LINUX64/ESP/LINUX64/obj/hsmSimplePlateTest.o  
gcc-11 -g -fsanitize=address -fno-omit-frame-pointer -fuse-ld=gold -o /jenkins/workspace/ESP_MemcheckCaps/7.8/CAPS/unit/LINUX64/ESP/LINUX64/examples/cCAPS/hsmSimplePlateTest /jenkins/workspace/ESP_MemcheckCaps/7.8/CAPS/unit/LINUX64/ESP/LINUX64/obj/hsmSimplePlateTest.o \
	-L/jenkins/workspace/ESP_MemcheckCaps/7.8/CAPS/unit/LINUX64/ESP/LINUX64/lib -lcaps -locsm -legads -ludunits2 -lrt -lm -ldl
gcc-11 -g -fsanitize=address -fno-omit-frame-pointer -fuse-ld=gold -c -O -fno-unit-at-a-time -fPIC -Wall -Wno-dangling-else -Wno-parentheses -Wno-unused-result -Wno-format-truncation -DREVISION=7.8 -I/jenkins/workspace/ESP_MemcheckCaps/7.8/CAPS/unit/LINUX64/ESP/LINUX64/include hsmCantileverPlateTest.c -o /jenkins/workspace/ESP_MemcheckCaps/7.8/CAPS/unit/LINUX64/ESP/LINUX64/obj/hsmCantileverPlateTest.o  
gcc-11 -g -fsanitize=address -fno-omit-frame-pointer -fuse-ld=gold -o /jenkins/workspace/ESP_MemcheckCaps/7.8/CAPS/unit/LINUX64/ESP/LINUX64/examples/cCAPS/hsmCantileverPlateTest /jenkins/workspace/ESP_MemcheckCaps/7.8/CAPS/unit/LINUX64/ESP/LINUX64/obj/hsmCantileverPlateTest.o \
	-L/jenkins/workspace/ESP_MemcheckCaps/7.8/CAPS/unit/LINUX64/ESP/LINUX64/lib -lcaps -locsm -legads -ludunits2 -lrt -lm -ldl
gcc-11 -g -fsanitize=address -fno-omit-frame-pointer -fuse-ld=gold -c -O -fno-unit-at-a-time -fPIC -Wall -Wno-dangling-else -Wno-parentheses -Wno-unused-result -Wno-format-truncation -DREVISION=7.8 -I/jenkins/workspace/ESP_MemcheckCaps/7.8/CAPS/unit/LINUX64/ESP/LINUX64/include hsmJoinedPlateTest.c -o /jenkins/workspace/ESP_MemcheckCaps/7.8/CAPS/unit/LINUX64/ESP/LINUX64/obj/hsmJoinedPlateTest.o  
gcc-11 -g -fsanitize=address -fno-omit-frame-pointer -fuse-ld=gold -o /jenkins/workspace/ESP_MemcheckCaps/7.8/CAPS/unit/LINUX64/ESP/LINUX64/examples/cCAPS/hsmJoinedPlateTest /jenkins/workspace/ESP_MemcheckCaps/7.8/CAPS/unit/LINUX64/ESP/LINUX64/obj/hsmJoinedPlateTest.o \
	-L/jenkins/workspace/ESP_MemcheckCaps/7.8/CAPS/unit/LINUX64/ESP/LINUX64/lib -lcaps -locsm -legads -ludunits2 -lrt -lm -ldl
make[2]: Leaving directory '/jenkins/workspace/ESP_MemcheckCaps/7.8/CAPS/unit/LINUX64/CAPS/examples/cCAPS'
(make -C cCAPS -f interferenceTest.make)
make[2]: Entering directory '/jenkins/workspace/ESP_MemcheckCaps/7.8/CAPS/unit/LINUX64/CAPS/examples/cCAPS'
gcc-11 -g -fsanitize=address -fno-omit-frame-pointer -fuse-ld=gold -c -O -fno-unit-at-a-time -fPIC -Wall -Wno-dangling-else -Wno-parentheses -Wno-unused-result -Wno-format-truncation -DREVISION=7.8 -I/jenkins/workspace/ESP_MemcheckCaps/7.8/CAPS/unit/LINUX64/ESP/LINUX64/include interferenceTest.c \
	-o /jenkins/workspace/ESP_MemcheckCaps/7.8/CAPS/unit/LINUX64/ESP/LINUX64/obj/interferenceTest.o   
gcc-11 -g -fsanitize=address -fno-omit-frame-pointer -fuse-ld=gold -o /jenkins/workspace/ESP_MemcheckCaps/7.8/CAPS/unit/LINUX64/ESP/LINUX64/examples/cCAPS/interferenceTest /jenkins/workspace/ESP_MemcheckCaps/7.8/CAPS/unit/LINUX64/ESP/LINUX64/obj/interferenceTest.o \
	-L/jenkins/workspace/ESP_MemcheckCaps/7.8/CAPS/unit/LINUX64/ESP/LINUX64/lib -lcaps -locsm -legads -ludunits2 -lrt -lm -ldl
make[2]: Leaving directory '/jenkins/workspace/ESP_MemcheckCaps/7.8/CAPS/unit/LINUX64/CAPS/examples/cCAPS'
(make -C cCAPS -f msesTest.make)
make[2]: Entering directory '/jenkins/workspace/ESP_MemcheckCaps/7.8/CAPS/unit/LINUX64/CAPS/examples/cCAPS'
gcc-11 -g -fsanitize=address -fno-omit-frame-pointer -fuse-ld=gold -c -O -fno-unit-at-a-time -fPIC -Wall -Wno-dangling-else -Wno-parentheses -Wno-unused-result -Wno-format-truncation -DREVISION=7.8 -I/jenkins/workspace/ESP_MemcheckCaps/7.8/CAPS/unit/LINUX64/ESP/LINUX64/include msesTest.c -o /jenkins/workspace/ESP_MemcheckCaps/7.8/CAPS/unit/LINUX64/ESP/LINUX64/obj/msesTest.o
gcc-11 -g -fsanitize=address -fno-omit-frame-pointer -fuse-ld=gold -o /jenkins/workspace/ESP_MemcheckCaps/7.8/CAPS/unit/LINUX64/ESP/LINUX64/examples/cCAPS/msesTest /jenkins/workspace/ESP_MemcheckCaps/7.8/CAPS/unit/LINUX64/ESP/LINUX64/obj/msesTest.o -L/jenkins/workspace/ESP_MemcheckCaps/7.8/CAPS/unit/LINUX64/ESP/LINUX64/lib -lcaps -legads -locsm \
	-ludunits2 -lrt -lm -ldl
make[2]: Leaving directory '/jenkins/workspace/ESP_MemcheckCaps/7.8/CAPS/unit/LINUX64/CAPS/examples/cCAPS'
(make -C cCAPS -f mystran.make)
make[2]: Entering directory '/jenkins/workspace/ESP_MemcheckCaps/7.8/CAPS/unit/LINUX64/CAPS/examples/cCAPS'
gcc-11 -g -fsanitize=address -fno-omit-frame-pointer -fuse-ld=gold -c -O -fno-unit-at-a-time -fPIC -Wall -Wno-dangling-else -Wno-parentheses -Wno-unused-result -Wno-format-truncation -DREVISION=7.8 -I/jenkins/workspace/ESP_MemcheckCaps/7.8/CAPS/unit/LINUX64/ESP/LINUX64/include mystranTest.c -o /jenkins/workspace/ESP_MemcheckCaps/7.8/CAPS/unit/LINUX64/ESP/LINUX64/obj/mystranTest.o   
gcc-11 -g -fsanitize=address -fno-omit-frame-pointer -fuse-ld=gold -o /jenkins/workspace/ESP_MemcheckCaps/7.8/CAPS/unit/LINUX64/ESP/LINUX64/examples/cCAPS/mystranTest /jenkins/workspace/ESP_MemcheckCaps/7.8/CAPS/unit/LINUX64/ESP/LINUX64/obj/mystranTest.o \
	-L/jenkins/workspace/ESP_MemcheckCaps/7.8/CAPS/unit/LINUX64/ESP/LINUX64/lib -lcaps -locsm -legads -ludunits2 -lrt -lm -ldl
make[2]: Leaving directory '/jenkins/workspace/ESP_MemcheckCaps/7.8/CAPS/unit/LINUX64/CAPS/examples/cCAPS'
(make -C cCAPS -f pointwiseTest.make)
make[2]: Entering directory '/jenkins/workspace/ESP_MemcheckCaps/7.8/CAPS/unit/LINUX64/CAPS/examples/cCAPS'
gcc-11 -g -fsanitize=address -fno-omit-frame-pointer -fuse-ld=gold -c -O -fno-unit-at-a-time -fPIC -Wall -Wno-dangling-else -Wno-parentheses -Wno-unused-result -Wno-format-truncation -DREVISION=7.8 -I/jenkins/workspace/ESP_MemcheckCaps/7.8/CAPS/unit/LINUX64/ESP/LINUX64/include pointwiseTest.c -o /jenkins/workspace/ESP_MemcheckCaps/7.8/CAPS/unit/LINUX64/ESP/LINUX64/obj/pointwiseTest.o
gcc-11 -g -fsanitize=address -fno-omit-frame-pointer -fuse-ld=gold -o /jenkins/workspace/ESP_MemcheckCaps/7.8/CAPS/unit/LINUX64/ESP/LINUX64/examples/cCAPS/pointwiseTest /jenkins/workspace/ESP_MemcheckCaps/7.8/CAPS/unit/LINUX64/ESP/LINUX64/obj/pointwiseTest.o -L/jenkins/workspace/ESP_MemcheckCaps/7.8/CAPS/unit/LINUX64/ESP/LINUX64/lib -lcaps -locsm -legads \
	-ludunits2 -lrt -lm -ldl
make[2]: Leaving directory '/jenkins/workspace/ESP_MemcheckCaps/7.8/CAPS/unit/LINUX64/CAPS/examples/cCAPS'
make[1]: Leaving directory '/jenkins/workspace/ESP_MemcheckCaps/7.8/CAPS/unit/LINUX64/CAPS/examples'
+++ find /jenkins/workspace/ESP_MemcheckCaps/7.8/CAPS/unit/LINUX64/CAPS/training/ -name Makefile
++ for i in `find $WORKSPACE/CAPS/training/ -name Makefile`
++ [[ /jenkins/workspace/ESP_MemcheckCaps/7.8/CAPS/unit/LINUX64/CAPS/training/2023/lectures/Makefile == *\l\e\c\t\u\r\e\s* ]]
++ continue
++ for i in `find $WORKSPACE/CAPS/training/ -name Makefile`
++ [[ /jenkins/workspace/ESP_MemcheckCaps/7.8/CAPS/unit/LINUX64/CAPS/training/2023/data/session01/Makefile == *\l\e\c\t\u\r\e\s* ]]
+++ dirname /jenkins/workspace/ESP_MemcheckCaps/7.8/CAPS/unit/LINUX64/CAPS/training/2023/data/session01/Makefile
++ cd /jenkins/workspace/ESP_MemcheckCaps/7.8/CAPS/unit/LINUX64/CAPS/training/2023/data/session01
++ make
gcc-11 -g -fsanitize=address -fno-omit-frame-pointer -fuse-ld=gold -c -O -fno-unit-at-a-time -fPIC -Wall -Wno-dangling-else -Wno-parentheses -Wno-unused-result -Wno-format-truncation -DREVISION=7.8 -I/jenkins/workspace/ESP_MemcheckCaps/7.8/CAPS/unit/LINUX64/ESP/LINUX64/include template_avl.c -o /jenkins/workspace/ESP_MemcheckCaps/7.8/CAPS/unit/LINUX64/ESP/LINUX64/obj/template_avl.o
gcc-11 -g -fsanitize=address -fno-omit-frame-pointer -fuse-ld=gold -o /jenkins/workspace/ESP_MemcheckCaps/7.8/CAPS/unit/LINUX64/ESP/LINUX64/test/template_avl /jenkins/workspace/ESP_MemcheckCaps/7.8/CAPS/unit/LINUX64/ESP/LINUX64/obj/template_avl.o -L/jenkins/workspace/ESP_MemcheckCaps/7.8/CAPS/unit/LINUX64/ESP/LINUX64/lib -lcaps -legads -lrt -lm -ldl
++ for i in `find $WORKSPACE/CAPS/training/ -name Makefile`
++ [[ /jenkins/workspace/ESP_MemcheckCaps/7.8/CAPS/unit/LINUX64/CAPS/training/data/session01/Makefile == *\l\e\c\t\u\r\e\s* ]]
+++ dirname /jenkins/workspace/ESP_MemcheckCaps/7.8/CAPS/unit/LINUX64/CAPS/training/data/session01/Makefile
++ cd /jenkins/workspace/ESP_MemcheckCaps/7.8/CAPS/unit/LINUX64/CAPS/training/data/session01
++ make
make: Nothing to be done for 'default'.
++ cd /jenkins/workspace/ESP_MemcheckCaps/7.8/CAPS/unit/LINUX64/OpenCSM/trunk/src
++ make -f serveESP.make
gcc-11 -g -fsanitize=address -fno-omit-frame-pointer -fuse-ld=gold -c -O -fno-unit-at-a-time -fPIC -Wall -Wno-dangling-else -Wno-parentheses -Wno-unused-result -Wno-format-truncation -DREVISION=7.8 -I/jenkins/workspace/ESP_MemcheckCaps/7.8/CAPS/unit/LINUX64/ESP/LINUX64/include -I. timCapsMode.c -o /jenkins/workspace/ESP_MemcheckCaps/7.8/CAPS/unit/LINUX64/ESP/LINUX64/obj/timCapsMode.o
touch /jenkins/workspace/ESP_MemcheckCaps/7.8/CAPS/unit/LINUX64/ESP/LINUX64/lib/capsMode.so
rm /jenkins/workspace/ESP_MemcheckCaps/7.8/CAPS/unit/LINUX64/ESP/LINUX64/lib/capsMode.so
g++-11 -g -fsanitize=address -fno-omit-frame-pointer -fuse-ld=gold -shared -Wl,-no-undefined  -o /jenkins/workspace/ESP_MemcheckCaps/7.8/CAPS/unit/LINUX64/ESP/LINUX64/lib/capsMode.so /jenkins/workspace/ESP_MemcheckCaps/7.8/CAPS/unit/LINUX64/ESP/LINUX64/obj/timCapsMode.o -L/jenkins/workspace/ESP_MemcheckCaps/7.8/CAPS/unit/LINUX64/ESP/LINUX64/lib -lcaps -locsm -lwsserver -legads -ldl -lm
gcc-11 -g -fsanitize=address -fno-omit-frame-pointer -fuse-ld=gold -c -O -fno-unit-at-a-time -fPIC -Wall -Wno-dangling-else -Wno-parentheses -Wno-unused-result -Wno-format-truncation -DREVISION=7.8 -I/jenkins/workspace/ESP_MemcheckCaps/7.8/CAPS/unit/LINUX64/ESP/LINUX64/include -I. timFlowchart.c -o /jenkins/workspace/ESP_MemcheckCaps/7.8/CAPS/unit/LINUX64/ESP/LINUX64/obj/timFlowchart.o
touch /jenkins/workspace/ESP_MemcheckCaps/7.8/CAPS/unit/LINUX64/ESP/LINUX64/lib/flowchart.so
rm /jenkins/workspace/ESP_MemcheckCaps/7.8/CAPS/unit/LINUX64/ESP/LINUX64/lib/flowchart.so
g++-11 -g -fsanitize=address -fno-omit-frame-pointer -fuse-ld=gold -shared -Wl,-no-undefined  -o /jenkins/workspace/ESP_MemcheckCaps/7.8/CAPS/unit/LINUX64/ESP/LINUX64/lib/flowchart.so /jenkins/workspace/ESP_MemcheckCaps/7.8/CAPS/unit/LINUX64/ESP/LINUX64/obj/timFlowchart.o -L/jenkins/workspace/ESP_MemcheckCaps/7.8/CAPS/unit/LINUX64/ESP/LINUX64/lib -lcaps -locsm -lwsserver -legads -ldl -lm
gcc-11 -g -fsanitize=address -fno-omit-frame-pointer -fuse-ld=gold -c -O -fno-unit-at-a-time -fPIC -Wall -Wno-dangling-else -Wno-parentheses -Wno-unused-result -Wno-format-truncation -DREVISION=7.8 -I/jenkins/workspace/ESP_MemcheckCaps/7.8/CAPS/unit/LINUX64/ESP/LINUX64/include -I. timViewer.c -o /jenkins/workspace/ESP_MemcheckCaps/7.8/CAPS/unit/LINUX64/ESP/LINUX64/obj/timViewer.o
touch /jenkins/workspace/ESP_MemcheckCaps/7.8/CAPS/unit/LINUX64/ESP/LINUX64/lib/viewer.so
rm /jenkins/workspace/ESP_MemcheckCaps/7.8/CAPS/unit/LINUX64/ESP/LINUX64/lib/viewer.so
g++-11 -g -fsanitize=address -fno-omit-frame-pointer -fuse-ld=gold -shared -Wl,-no-undefined  -o /jenkins/workspace/ESP_MemcheckCaps/7.8/CAPS/unit/LINUX64/ESP/LINUX64/lib/viewer.so /jenkins/workspace/ESP_MemcheckCaps/7.8/CAPS/unit/LINUX64/ESP/LINUX64/obj/timViewer.o -L/jenkins/workspace/ESP_MemcheckCaps/7.8/CAPS/unit/LINUX64/ESP/LINUX64/lib -lcaps -locsm -lwsserver -legads -ldl -lm
gcc-11 -g -fsanitize=address -fno-omit-frame-pointer -fuse-ld=gold -c -O -fno-unit-at-a-time -fPIC -Wall -Wno-dangling-else -Wno-parentheses -Wno-unused-result -Wno-format-truncation -DREVISION=7.8 -I/jenkins/workspace/ESP_MemcheckCaps/7.8/CAPS/unit/LINUX64/ESP/LINUX64/include -I. -I. -I/home/jenkins/util/python/Python-3.11.9_address/install/include/python3.11d -I/home/jenkins/util/python/Python-3.11.9_address/install/include/python3.11d timPyscript.c -o /jenkins/workspace/ESP_MemcheckCaps/7.8/CAPS/unit/LINUX64/ESP/LINUX64/obj/timPyscript.o
touch /jenkins/workspace/ESP_MemcheckCaps/7.8/CAPS/unit/LINUX64/ESP/LINUX64/lib/pyscript.so
rm /jenkins/workspace/ESP_MemcheckCaps/7.8/CAPS/unit/LINUX64/ESP/LINUX64/lib/pyscript.so
g++-11 -g -fsanitize=address -fno-omit-frame-pointer -fuse-ld=gold -shared -Wl,-no-undefined  -o /jenkins/workspace/ESP_MemcheckCaps/7.8/CAPS/unit/LINUX64/ESP/LINUX64/lib/pyscript.so /jenkins/workspace/ESP_MemcheckCaps/7.8/CAPS/unit/LINUX64/ESP/LINUX64/obj/timPyscript.o  -L/home/jenkins/util/python/Python-3.11.9_address/install/lib -lpython3.11d -ldl  -lm  -L/jenkins/workspace/ESP_MemcheckCaps/7.8/CAPS/unit/LINUX64/ESP/LINUX64/lib -lcaps -locsm -lwsserver -legads -ldl -lrt -Wl,-rpath /home/jenkins/util/python/Python-3.11.9_address/install/lib
++ ln -f -s /jenkins/workspace/ESP_MemcheckCaps/7.8/CAPS/unit/LINUX64/OpenCSM/trunk/udc /jenkins/workspace/ESP_MemcheckCaps/7.8/CAPS/unit/LINUX64/ESP/LINUX64
+++ find /jenkins/workspace/ESP_MemcheckCaps/7.8/CAPS/unit/LINUX64/OpenCSM/trunk/data/training/ -name Makefile
find: ‘/jenkins/workspace/ESP_MemcheckCaps/7.8/CAPS/unit/LINUX64/OpenCSM/trunk/data/training/’: No such file or directory
+ [[ reynolds == \m\a\c\y\s ]]
+ [[ reynolds == \v\i\g\g\e\n ]]
+ [[ reynolds == *\r\e\y\n\o\l\d\s* ]]
+ export LD_PRELOAD=/usr/lib/x86_64-linux-gnu/libasan.so.6
+ LD_PRELOAD=/usr/lib/x86_64-linux-gnu/libasan.so.6
+ [[ CAPS/unit == *\v\s\p\3* ]]
+ source /jenkins/workspace/ESP_MemcheckCaps/7.8/CAPS/unit/LINUX64/JenkinsESP/ESP_Sanitize.sh
++ '[' -z '' ']'
++ OUTLEVEL=0
++ mkdir -p /jenkins/workspace/ESP_MemcheckCaps/7.8/CAPS/unit/LINUX64/ESP/test
++ cd /jenkins/workspace/ESP_MemcheckCaps/7.8/CAPS/unit/LINUX64/ESP/test
++ [[ CAPS/unit =~ [0-9]+.[0-9]+ ]]
++ export ESPTEST=CAPS/unit
++ ESPTEST=CAPS/unit
++ [[ CAPS/unit == \C\A\P\S* ]]
++ export CAPSTARGET=unit
++ CAPSTARGET=unit
++ [[ unit == \u\n\i\t ]]
++ cd /jenkins/workspace/ESP_MemcheckCaps/7.8/CAPS/unit/LINUX64/EGADS/trunk/test
++ ./runUnitTest.sh

=================================================
+ /jenkins/workspace/ESP_MemcheckCaps/7.8/CAPS/unit/LINUX64/ESP/LINUX64/test/egadsGeom_dot
+ tee -a /jenkins/workspace/ESP_MemcheckCaps/7.8/CAPS/unit/LINUX64/EGADS/trunk/test/egadslog.txt

real	0m8.204s
user	0m7.767s
sys	0m0.455s
+ status=0
+ set +x

=================================================
EGADS test egadsGeom_dot passed (as expected)
=================================================


=================================================
+ /jenkins/workspace/ESP_MemcheckCaps/7.8/CAPS/unit/LINUX64/ESP/LINUX64/test/egadsSpline_dot
+ tee -a /jenkins/workspace/ESP_MemcheckCaps/7.8/CAPS/unit/LINUX64/EGADS/trunk/test/egadslog.txt

real	4m5.995s
user	4m2.967s
sys	0m1.636s
+ status=0
+ set +x

=================================================
EGADS test egadsSpline_dot passed (as expected)
=================================================


=================================================
+ /jenkins/workspace/ESP_MemcheckCaps/7.8/CAPS/unit/LINUX64/ESP/LINUX64/test/egadsTopo_dot
+ tee -a /jenkins/workspace/ESP_MemcheckCaps/7.8/CAPS/unit/LINUX64/EGADS/trunk/test/egadslog.txt

real	0m0.610s
user	0m0.476s
sys	0m0.199s
+ status=0
+ set +x

=================================================
EGADS test egadsTopo_dot passed (as expected)
=================================================


=================================================
+ /jenkins/workspace/ESP_MemcheckCaps/7.8/CAPS/unit/LINUX64/ESP/LINUX64/test/egadsHLevel_dot
+ tee -a /jenkins/workspace/ESP_MemcheckCaps/7.8/CAPS/unit/LINUX64/EGADS/trunk/test/egadslog.txt

real	0m0.573s
user	0m0.559s
sys	0m0.102s
+ status=1
+ set +x

=================================================
EGADS test egadsHLevel_dot failed (as expected)
=================================================


All tests pass!

++ cd /jenkins/workspace/ESP_MemcheckCaps/7.8/CAPS/unit/LINUX64/EGADS/trunk/docs/Tutorial
++ ./tire
EG_open -> status=0
EG_makeTopology -> status=0
EG_saveModel -> status=0
EG_close -> status=0
 EGADS Info: 77 Objects, 197 Reference in Use (of 1955) at Close!
 EGADS Info: 73 unattached Objects (197 References) removed!
EG_close -> status=0
++ cd /jenkins/workspace/ESP_MemcheckCaps/7.8/CAPS/unit/LINUX64/EGADS/trunk/docs/EGADS_dot/src
++ make test
./circle1_dot
 Circle np1 = 65
 EGADS Info: 44 Objects, 88 Reference in Use (of 160) at Close!
 EGADS Info: 44 unattached Objects (88 References) removed!
 EGADS_SUCCESS!
./circle2_dot
 Circle np1 = 65
 EGADS Info: 84 Objects, 168 Reference in Use (of 280) at Close!
 EGADS Info: 84 unattached Objects (168 References) removed!
 EGADS_SUCCESS!
./naca_dot

 sharpte = 0
 Ping NACA Edge 1 np1 = 20
 Ping NACA Edge 2 np1 = 20
 Ping NACA Edge 3 np1 = 2
 Ping NACA Face 1 np1 = 50

 sharpte = 1
 Ping NACA Edge 1 np1 = 20
 Ping NACA Edge 2 np1 = 20
 Ping NACA Face 1 np1 = 49
 EGADS Info: 76 Objects, 172 Reference in Use (of 296) at Close!
 EGADS Info: 76 unattached Objects (172 References) removed!
 EGADS_SUCCESS!
./ruled_naca_dot

 sharpte = 0
 Ping Ruled NACA Edge 1 np1 = 33
 Ping Ruled NACA Edge 2 np1 = 13
 Ping Ruled NACA Edge 3 np1 = 129
 Ping Ruled NACA Edge 4 np1 = 13
 Ping Ruled NACA Edge 5 np1 = 13
 Ping Ruled NACA Edge 6 np1 = 33
 Ping Ruled NACA Edge 7 np1 = 13
 Ping Ruled NACA Edge 8 np1 = 2
 Ping Ruled NACA Edge 9 np1 = 2
 Ping Ruled NACA Face 1 np1 = 1428
 Ping Ruled NACA Face 2 np1 = 728
 Ping Ruled NACA Face 3 np1 = 66
 Ping Ruled NACA Face 4 np1 = 25
 Ping Ruled NACA Face 5 np1 = 25

 sharpte = 1
 Ping Ruled NACA Edge 1 np1 = 33
 Ping Ruled NACA Edge 2 np1 = 13
 Ping Ruled NACA Edge 3 np1 = 129
 Ping Ruled NACA Edge 4 np1 = 13
 Ping Ruled NACA Edge 5 np1 = 13
 Ping Ruled NACA Edge 6 np1 = 13
 Ping Ruled NACA Face 1 np1 = 1427
 Ping Ruled NACA Face 2 np1 = 536
 Ping Ruled NACA Face 3 np1 = 24
 Ping Ruled NACA Face 4 np1 = 24
 EGADS Info: 200 Objects, 345 Reference in Use (of 880) at Close!
 EGADS Info: 105 unattached Objects (345 References) removed!
 EGADS_SUCCESS!
++ cd /jenkins/workspace/ESP_MemcheckCaps/7.8/CAPS/unit/LINUX64/EGADS/trunk/pyEGADS/test
++ make
python --version
Python 3.11.9
python -u -m unittest discover
EE
======================================================================
ERROR: test_egads (unittest.loader._FailedTest.test_egads)
----------------------------------------------------------------------
ImportError: Failed to import test module: test_egads
Traceback (most recent call last):
  File "/home/jenkins/util/python/Python-3.11.9_address/install/lib/python3.11/unittest/loader.py", line 419, in _find_test_path
    module = self._get_module_from_name(name)
             ^^^^^^^^^^^^^^^^^^^^^^^^^^^^^^^^
  File "/home/jenkins/util/python/Python-3.11.9_address/install/lib/python3.11/unittest/loader.py", line 362, in _get_module_from_name
    __import__(name)
  File "/jenkins/workspace/ESP_MemcheckCaps/7.8/CAPS/unit/LINUX64/EGADS/trunk/pyEGADS/test/test_egads.py", line 2, in <module>
    from pyEGADS import egads
  File "/jenkins/workspace/ESP_MemcheckCaps/7.8/CAPS/unit/LINUX64/EGADS/trunk/pyEGADS/pyEGADS/egads.py", line 34, in <module>
    _egads = ctypes.CDLL(_ESP_ROOT + "/lib/libegads.so")
             ^^^^^^^^^^^^^^^^^^^^^^^^^^^^^^^^^^^^^^^^^^^
  File "/home/jenkins/util/python/Python-3.11.9_address/install/lib/python3.11/ctypes/__init__.py", line 376, in __init__
    self._handle = _dlopen(self._name, mode)
                   ^^^^^^^^^^^^^^^^^^^^^^^^^
OSError: /home/jenkins/util/ESP/opencascade-7.8/trunk/build_address/install/lib/libTKService.so.7.8: undefined symbol: XStoreName


======================================================================
ERROR: setUpClass (test_egadslite.TestEGADSlite)
----------------------------------------------------------------------
Traceback (most recent call last):
  File "/jenkins/workspace/ESP_MemcheckCaps/7.8/CAPS/unit/LINUX64/EGADS/trunk/pyEGADS/test/test_egadslite.py", line 11, in setUpClass
    from pyEGADS import egads, egads_common
  File "/jenkins/workspace/ESP_MemcheckCaps/7.8/CAPS/unit/LINUX64/EGADS/trunk/pyEGADS/pyEGADS/egads.py", line 34, in <module>
    _egads = ctypes.CDLL(_ESP_ROOT + "/lib/libegads.so")
             ^^^^^^^^^^^^^^^^^^^^^^^^^^^^^^^^^^^^^^^^^^^
  File "/home/jenkins/util/python/Python-3.11.9_address/install/lib/python3.11/ctypes/__init__.py", line 376, in __init__
    self._handle = _dlopen(self._name, mode)
                   ^^^^^^^^^^^^^^^^^^^^^^^^^
OSError: /home/jenkins/util/ESP/opencascade-7.8/trunk/build_address/install/lib/libTKService.so.7.8: undefined symbol: XStoreName

----------------------------------------------------------------------
Ran 1 test in 0.046s

FAILED (errors=2)
make: *** [Makefile:4: test] Error 1
++ true
++ cd /jenkins/workspace/ESP_MemcheckCaps/7.8/CAPS/unit/LINUX64/EGADS/trunk/docs/Tutorial
++ python -u tire.py
Traceback (most recent call last):
  File "/jenkins/workspace/ESP_MemcheckCaps/7.8/CAPS/unit/LINUX64/EGADS/trunk/docs/Tutorial/tire.py", line 13, in <module>
    from pyEGADS import egads
  File "/jenkins/workspace/ESP_MemcheckCaps/7.8/CAPS/unit/LINUX64/EGADS/trunk/pyEGADS/pyEGADS/egads.py", line 34, in <module>
    _egads = ctypes.CDLL(_ESP_ROOT + "/lib/libegads.so")
             ^^^^^^^^^^^^^^^^^^^^^^^^^^^^^^^^^^^^^^^^^^^
  File "/home/jenkins/util/python/Python-3.11.9_address/install/lib/python3.11/ctypes/__init__.py", line 376, in __init__
    self._handle = _dlopen(self._name, mode)
                   ^^^^^^^^^^^^^^^^^^^^^^^^^
OSError: /home/jenkins/util/ESP/opencascade-7.8/trunk/build_address/install/lib/libTKService.so.7.8: undefined symbol: XStoreName
++ true
++ cd /jenkins/workspace/ESP_MemcheckCaps/7.8/CAPS/unit/LINUX64/CAPS
++ make unit
(cd src; make)
make[1]: Entering directory '/jenkins/workspace/ESP_MemcheckCaps/7.8/CAPS/unit/LINUX64/CAPS/src'
make[1]: Nothing to be done for 'default'.
make[1]: Leaving directory '/jenkins/workspace/ESP_MemcheckCaps/7.8/CAPS/unit/LINUX64/CAPS/src'
(cd aim; make)
make[1]: Entering directory '/jenkins/workspace/ESP_MemcheckCaps/7.8/CAPS/unit/LINUX64/CAPS/aim'
make -C utils
make[2]: Entering directory '/jenkins/workspace/ESP_MemcheckCaps/7.8/CAPS/unit/LINUX64/CAPS/aim/utils'
make[2]: Nothing to be done for 'default'.
make[2]: Leaving directory '/jenkins/workspace/ESP_MemcheckCaps/7.8/CAPS/unit/LINUX64/CAPS/aim/utils'
make -C abaqus 
make[2]: Entering directory '/jenkins/workspace/ESP_MemcheckCaps/7.8/CAPS/unit/LINUX64/CAPS/aim/abaqus'
make[2]: '/jenkins/workspace/ESP_MemcheckCaps/7.8/CAPS/unit/LINUX64/ESP/LINUX64/lib/abaqusAIM.so' is up to date.
make[2]: Leaving directory '/jenkins/workspace/ESP_MemcheckCaps/7.8/CAPS/unit/LINUX64/CAPS/aim/abaqus'
make -C aflr2 
make[2]: Entering directory '/jenkins/workspace/ESP_MemcheckCaps/7.8/CAPS/unit/LINUX64/CAPS/aim/aflr2'
make[2]: Nothing to be done for 'default'.
make[2]: Leaving directory '/jenkins/workspace/ESP_MemcheckCaps/7.8/CAPS/unit/LINUX64/CAPS/aim/aflr2'
make -C aflr3 
make[2]: Entering directory '/jenkins/workspace/ESP_MemcheckCaps/7.8/CAPS/unit/LINUX64/CAPS/aim/aflr3'
make[2]: Nothing to be done for 'default'.
make[2]: Leaving directory '/jenkins/workspace/ESP_MemcheckCaps/7.8/CAPS/unit/LINUX64/CAPS/aim/aflr3'
make -C aflr4 
make[2]: Entering directory '/jenkins/workspace/ESP_MemcheckCaps/7.8/CAPS/unit/LINUX64/CAPS/aim/aflr4'
make[2]: Nothing to be done for 'default'.
make[2]: Leaving directory '/jenkins/workspace/ESP_MemcheckCaps/7.8/CAPS/unit/LINUX64/CAPS/aim/aflr4'
make -C astros 
make[2]: Entering directory '/jenkins/workspace/ESP_MemcheckCaps/7.8/CAPS/unit/LINUX64/CAPS/aim/astros'
make[2]: '/jenkins/workspace/ESP_MemcheckCaps/7.8/CAPS/unit/LINUX64/ESP/LINUX64/lib/astrosAIM.so' is up to date.
make[2]: Leaving directory '/jenkins/workspace/ESP_MemcheckCaps/7.8/CAPS/unit/LINUX64/CAPS/aim/astros'
make -C avl 
make[2]: Entering directory '/jenkins/workspace/ESP_MemcheckCaps/7.8/CAPS/unit/LINUX64/CAPS/aim/avl'
make[2]: '/jenkins/workspace/ESP_MemcheckCaps/7.8/CAPS/unit/LINUX64/ESP/LINUX64/lib/avlAIM.so' is up to date.
make[2]: Leaving directory '/jenkins/workspace/ESP_MemcheckCaps/7.8/CAPS/unit/LINUX64/CAPS/aim/avl'
make -C awave 
make[2]: Entering directory '/jenkins/workspace/ESP_MemcheckCaps/7.8/CAPS/unit/LINUX64/CAPS/aim/awave'
make[2]: Nothing to be done for 'default'.
make[2]: Leaving directory '/jenkins/workspace/ESP_MemcheckCaps/7.8/CAPS/unit/LINUX64/CAPS/aim/awave'
make -C cart3d 
make[2]: Entering directory '/jenkins/workspace/ESP_MemcheckCaps/7.8/CAPS/unit/LINUX64/CAPS/aim/cart3d'
make[2]: Nothing to be done for 'default'.
make[2]: Leaving directory '/jenkins/workspace/ESP_MemcheckCaps/7.8/CAPS/unit/LINUX64/CAPS/aim/cart3d'
make -C cbaero 
make[2]: Entering directory '/jenkins/workspace/ESP_MemcheckCaps/7.8/CAPS/unit/LINUX64/CAPS/aim/cbaero'
make[2]: Nothing to be done for 'default'.
make[2]: Leaving directory '/jenkins/workspace/ESP_MemcheckCaps/7.8/CAPS/unit/LINUX64/CAPS/aim/cbaero'
make -C cgt 
make[2]: Entering directory '/jenkins/workspace/ESP_MemcheckCaps/7.8/CAPS/unit/LINUX64/CAPS/aim/cgt'
make[2]: '/jenkins/workspace/ESP_MemcheckCaps/7.8/CAPS/unit/LINUX64/ESP/LINUX64/test/egads2cgt' is up to date.
make[2]: Leaving directory '/jenkins/workspace/ESP_MemcheckCaps/7.8/CAPS/unit/LINUX64/CAPS/aim/cgt'
make -C custom 
make[2]: Entering directory '/jenkins/workspace/ESP_MemcheckCaps/7.8/CAPS/unit/LINUX64/CAPS/aim/custom'
make[2]: Nothing to be done for 'default'.
make[2]: Leaving directory '/jenkins/workspace/ESP_MemcheckCaps/7.8/CAPS/unit/LINUX64/CAPS/aim/custom'
make -C delaundo 
make[2]: Entering directory '/jenkins/workspace/ESP_MemcheckCaps/7.8/CAPS/unit/LINUX64/CAPS/aim/delaundo'
make[2]: '/jenkins/workspace/ESP_MemcheckCaps/7.8/CAPS/unit/LINUX64/ESP/LINUX64/lib/delaundoAIM.so' is up to date.
make[2]: Leaving directory '/jenkins/workspace/ESP_MemcheckCaps/7.8/CAPS/unit/LINUX64/CAPS/aim/delaundo'
make -C egadsTess 
make[2]: Entering directory '/jenkins/workspace/ESP_MemcheckCaps/7.8/CAPS/unit/LINUX64/CAPS/aim/egadsTess'
make[2]: '/jenkins/workspace/ESP_MemcheckCaps/7.8/CAPS/unit/LINUX64/ESP/LINUX64/lib/egadsTessAIM.so' is up to date.
make[2]: Leaving directory '/jenkins/workspace/ESP_MemcheckCaps/7.8/CAPS/unit/LINUX64/CAPS/aim/egadsTess'
make -C friction 
make[2]: Entering directory '/jenkins/workspace/ESP_MemcheckCaps/7.8/CAPS/unit/LINUX64/CAPS/aim/friction'
make[2]: Nothing to be done for 'default'.
make[2]: Leaving directory '/jenkins/workspace/ESP_MemcheckCaps/7.8/CAPS/unit/LINUX64/CAPS/aim/friction'
make -C fun3d 
make[2]: Entering directory '/jenkins/workspace/ESP_MemcheckCaps/7.8/CAPS/unit/LINUX64/CAPS/aim/fun3d'
make[2]: '/jenkins/workspace/ESP_MemcheckCaps/7.8/CAPS/unit/LINUX64/ESP/LINUX64/lib/fun3dAIM.so' is up to date.
make[2]: Leaving directory '/jenkins/workspace/ESP_MemcheckCaps/7.8/CAPS/unit/LINUX64/CAPS/aim/fun3d'
make -C hsm 
make[2]: Entering directory '/jenkins/workspace/ESP_MemcheckCaps/7.8/CAPS/unit/LINUX64/CAPS/aim/hsm'
make[2]: Nothing to be done for 'default'.
make[2]: Leaving directory '/jenkins/workspace/ESP_MemcheckCaps/7.8/CAPS/unit/LINUX64/CAPS/aim/hsm'
make -C interference 
make[2]: Entering directory '/jenkins/workspace/ESP_MemcheckCaps/7.8/CAPS/unit/LINUX64/CAPS/aim/interference'
make[2]: '/jenkins/workspace/ESP_MemcheckCaps/7.8/CAPS/unit/LINUX64/ESP/LINUX64/lib/interferenceAIM.so' is up to date.
make[2]: Leaving directory '/jenkins/workspace/ESP_MemcheckCaps/7.8/CAPS/unit/LINUX64/CAPS/aim/interference'
make -C jfd3 
make[2]: Entering directory '/jenkins/workspace/ESP_MemcheckCaps/7.8/CAPS/unit/LINUX64/CAPS/aim/jfd3'
make[2]: '/jenkins/workspace/ESP_MemcheckCaps/7.8/CAPS/unit/LINUX64/ESP/LINUX64/lib/jfd3AIM.so' is up to date.
make[2]: Leaving directory '/jenkins/workspace/ESP_MemcheckCaps/7.8/CAPS/unit/LINUX64/CAPS/aim/jfd3'
make -C masstran 
make[2]: Entering directory '/jenkins/workspace/ESP_MemcheckCaps/7.8/CAPS/unit/LINUX64/CAPS/aim/masstran'
make[2]: Nothing to be done for 'default'.
make[2]: Leaving directory '/jenkins/workspace/ESP_MemcheckCaps/7.8/CAPS/unit/LINUX64/CAPS/aim/masstran'
make -C meshWriter 
make[2]: Entering directory '/jenkins/workspace/ESP_MemcheckCaps/7.8/CAPS/unit/LINUX64/CAPS/aim/meshWriter'
make -C bstlWriter 
make[3]: Entering directory '/jenkins/workspace/ESP_MemcheckCaps/7.8/CAPS/unit/LINUX64/CAPS/aim/meshWriter/bstlWriter'
make[3]: Nothing to be done for 'default'.
make[3]: Leaving directory '/jenkins/workspace/ESP_MemcheckCaps/7.8/CAPS/unit/LINUX64/CAPS/aim/meshWriter/bstlWriter'
make -C bvtkWriter 
make[3]: Entering directory '/jenkins/workspace/ESP_MemcheckCaps/7.8/CAPS/unit/LINUX64/CAPS/aim/meshWriter/bvtkWriter'
make[3]: Nothing to be done for 'default'.
make[3]: Leaving directory '/jenkins/workspace/ESP_MemcheckCaps/7.8/CAPS/unit/LINUX64/CAPS/aim/meshWriter/bvtkWriter'
make -C exodusWriter 
make[3]: Entering directory '/jenkins/workspace/ESP_MemcheckCaps/7.8/CAPS/unit/LINUX64/CAPS/aim/meshWriter/exodusWriter'
make[3]: Nothing to be done for 'default'.
make[3]: Leaving directory '/jenkins/workspace/ESP_MemcheckCaps/7.8/CAPS/unit/LINUX64/CAPS/aim/meshWriter/exodusWriter'
make -C fastWriter 
make[3]: Entering directory '/jenkins/workspace/ESP_MemcheckCaps/7.8/CAPS/unit/LINUX64/CAPS/aim/meshWriter/fastWriter'
make[3]: Nothing to be done for 'default'.
make[3]: Leaving directory '/jenkins/workspace/ESP_MemcheckCaps/7.8/CAPS/unit/LINUX64/CAPS/aim/meshWriter/fastWriter'
make -C libmeshbWriter 
make[3]: Entering directory '/jenkins/workspace/ESP_MemcheckCaps/7.8/CAPS/unit/LINUX64/CAPS/aim/meshWriter/libmeshbWriter'
make[3]: Nothing to be done for 'default'.
make[3]: Leaving directory '/jenkins/workspace/ESP_MemcheckCaps/7.8/CAPS/unit/LINUX64/CAPS/aim/meshWriter/libmeshbWriter'
make -C stlWriter 
make[3]: Entering directory '/jenkins/workspace/ESP_MemcheckCaps/7.8/CAPS/unit/LINUX64/CAPS/aim/meshWriter/stlWriter'
make[3]: Nothing to be done for 'default'.
make[3]: Leaving directory '/jenkins/workspace/ESP_MemcheckCaps/7.8/CAPS/unit/LINUX64/CAPS/aim/meshWriter/stlWriter'
make -C su2Writer 
make[3]: Entering directory '/jenkins/workspace/ESP_MemcheckCaps/7.8/CAPS/unit/LINUX64/CAPS/aim/meshWriter/su2Writer'
make[3]: Nothing to be done for 'default'.
make[3]: Leaving directory '/jenkins/workspace/ESP_MemcheckCaps/7.8/CAPS/unit/LINUX64/CAPS/aim/meshWriter/su2Writer'
make -C tecplotWriter 
make[3]: Entering directory '/jenkins/workspace/ESP_MemcheckCaps/7.8/CAPS/unit/LINUX64/CAPS/aim/meshWriter/tecplotWriter'
make[3]: Nothing to be done for 'default'.
make[3]: Leaving directory '/jenkins/workspace/ESP_MemcheckCaps/7.8/CAPS/unit/LINUX64/CAPS/aim/meshWriter/tecplotWriter'
make -C ugridWriter 
make[3]: Entering directory '/jenkins/workspace/ESP_MemcheckCaps/7.8/CAPS/unit/LINUX64/CAPS/aim/meshWriter/ugridWriter'
make[3]: Nothing to be done for 'default'.
make[3]: Leaving directory '/jenkins/workspace/ESP_MemcheckCaps/7.8/CAPS/unit/LINUX64/CAPS/aim/meshWriter/ugridWriter'
make -C vtkWriter 
make[3]: Entering directory '/jenkins/workspace/ESP_MemcheckCaps/7.8/CAPS/unit/LINUX64/CAPS/aim/meshWriter/vtkWriter'
make[3]: Nothing to be done for 'default'.
make[3]: Leaving directory '/jenkins/workspace/ESP_MemcheckCaps/7.8/CAPS/unit/LINUX64/CAPS/aim/meshWriter/vtkWriter'
make[2]: Leaving directory '/jenkins/workspace/ESP_MemcheckCaps/7.8/CAPS/unit/LINUX64/CAPS/aim/meshWriter'
make -C mses 
make[2]: Entering directory '/jenkins/workspace/ESP_MemcheckCaps/7.8/CAPS/unit/LINUX64/CAPS/aim/mses'
make[2]: '/jenkins/workspace/ESP_MemcheckCaps/7.8/CAPS/unit/LINUX64/ESP/LINUX64/lib/msesAIM.so' is up to date.
make[2]: Leaving directory '/jenkins/workspace/ESP_MemcheckCaps/7.8/CAPS/unit/LINUX64/CAPS/aim/mses'
make -C mystran 
make[2]: Entering directory '/jenkins/workspace/ESP_MemcheckCaps/7.8/CAPS/unit/LINUX64/CAPS/aim/mystran'
make[2]: '/jenkins/workspace/ESP_MemcheckCaps/7.8/CAPS/unit/LINUX64/ESP/LINUX64/lib/mystranAIM.so' is up to date.
make[2]: Leaving directory '/jenkins/workspace/ESP_MemcheckCaps/7.8/CAPS/unit/LINUX64/CAPS/aim/mystran'
make -C nastran 
make[2]: Entering directory '/jenkins/workspace/ESP_MemcheckCaps/7.8/CAPS/unit/LINUX64/CAPS/aim/nastran'
make[2]: '/jenkins/workspace/ESP_MemcheckCaps/7.8/CAPS/unit/LINUX64/ESP/LINUX64/lib/nastranAIM.so' is up to date.
make[2]: Leaving directory '/jenkins/workspace/ESP_MemcheckCaps/7.8/CAPS/unit/LINUX64/CAPS/aim/nastran'
make -C plato 
make[2]: Entering directory '/jenkins/workspace/ESP_MemcheckCaps/7.8/CAPS/unit/LINUX64/CAPS/aim/plato'
make[2]: '/jenkins/workspace/ESP_MemcheckCaps/7.8/CAPS/unit/LINUX64/ESP/LINUX64/lib/platoAIM.so' is up to date.
make[2]: Leaving directory '/jenkins/workspace/ESP_MemcheckCaps/7.8/CAPS/unit/LINUX64/CAPS/aim/plato'
make -C pointwise 
make[2]: Entering directory '/jenkins/workspace/ESP_MemcheckCaps/7.8/CAPS/unit/LINUX64/CAPS/aim/pointwise'
make[2]: Nothing to be done for 'default'.
make[2]: Leaving directory '/jenkins/workspace/ESP_MemcheckCaps/7.8/CAPS/unit/LINUX64/CAPS/aim/pointwise'
make -C refine 
make[2]: Entering directory '/jenkins/workspace/ESP_MemcheckCaps/7.8/CAPS/unit/LINUX64/CAPS/aim/refine'
make[2]: '/jenkins/workspace/ESP_MemcheckCaps/7.8/CAPS/unit/LINUX64/ESP/LINUX64/lib/refineAIM.so' is up to date.
make[2]: Leaving directory '/jenkins/workspace/ESP_MemcheckCaps/7.8/CAPS/unit/LINUX64/CAPS/aim/refine'
make -C sierraSD 
make[2]: Entering directory '/jenkins/workspace/ESP_MemcheckCaps/7.8/CAPS/unit/LINUX64/CAPS/aim/sierraSD'
make[2]: '/jenkins/workspace/ESP_MemcheckCaps/7.8/CAPS/unit/LINUX64/ESP/LINUX64/lib/sierraSDAIM.so' is up to date.
make[2]: Leaving directory '/jenkins/workspace/ESP_MemcheckCaps/7.8/CAPS/unit/LINUX64/CAPS/aim/sierraSD'
make -C sierraSM 
make[2]: Entering directory '/jenkins/workspace/ESP_MemcheckCaps/7.8/CAPS/unit/LINUX64/CAPS/aim/sierraSM'
make[2]: '/jenkins/workspace/ESP_MemcheckCaps/7.8/CAPS/unit/LINUX64/ESP/LINUX64/lib/sierraSMAIM.so' is up to date.
make[2]: Leaving directory '/jenkins/workspace/ESP_MemcheckCaps/7.8/CAPS/unit/LINUX64/CAPS/aim/sierraSM'
make -C skeleton 
make[2]: Entering directory '/jenkins/workspace/ESP_MemcheckCaps/7.8/CAPS/unit/LINUX64/CAPS/aim/skeleton'
make[2]: '/jenkins/workspace/ESP_MemcheckCaps/7.8/CAPS/unit/LINUX64/ESP/LINUX64/lib/skeletonAIM.so' is up to date.
make[2]: Leaving directory '/jenkins/workspace/ESP_MemcheckCaps/7.8/CAPS/unit/LINUX64/CAPS/aim/skeleton'
make -C spinnaker 
make[2]: Entering directory '/jenkins/workspace/ESP_MemcheckCaps/7.8/CAPS/unit/LINUX64/CAPS/aim/spinnaker'
make[2]: '/jenkins/workspace/ESP_MemcheckCaps/7.8/CAPS/unit/LINUX64/ESP/LINUX64/lib/spinnakerAIM.so' is up to date.
make[2]: Leaving directory '/jenkins/workspace/ESP_MemcheckCaps/7.8/CAPS/unit/LINUX64/CAPS/aim/spinnaker'
make -C su2 
make[2]: Entering directory '/jenkins/workspace/ESP_MemcheckCaps/7.8/CAPS/unit/LINUX64/CAPS/aim/su2'
make[2]: '/jenkins/workspace/ESP_MemcheckCaps/7.8/CAPS/unit/LINUX64/ESP/LINUX64/lib/su2AIM.so' is up to date.
make[2]: Leaving directory '/jenkins/workspace/ESP_MemcheckCaps/7.8/CAPS/unit/LINUX64/CAPS/aim/su2'
make -C tacs 
make[2]: Entering directory '/jenkins/workspace/ESP_MemcheckCaps/7.8/CAPS/unit/LINUX64/CAPS/aim/tacs'
make[2]: '/jenkins/workspace/ESP_MemcheckCaps/7.8/CAPS/unit/LINUX64/ESP/LINUX64/lib/tacsAIM.so' is up to date.
make[2]: Leaving directory '/jenkins/workspace/ESP_MemcheckCaps/7.8/CAPS/unit/LINUX64/CAPS/aim/tacs'
make -C tetgen 
make[2]: Entering directory '/jenkins/workspace/ESP_MemcheckCaps/7.8/CAPS/unit/LINUX64/CAPS/aim/tetgen'
make[2]: Nothing to be done for 'default'.
make[2]: Leaving directory '/jenkins/workspace/ESP_MemcheckCaps/7.8/CAPS/unit/LINUX64/CAPS/aim/tetgen'
make -C tsfoil 
make[2]: Entering directory '/jenkins/workspace/ESP_MemcheckCaps/7.8/CAPS/unit/LINUX64/CAPS/aim/tsfoil'
make[2]: '/jenkins/workspace/ESP_MemcheckCaps/7.8/CAPS/unit/LINUX64/ESP/LINUX64/lib/tsfoilAIM.so' is up to date.
make[2]: Leaving directory '/jenkins/workspace/ESP_MemcheckCaps/7.8/CAPS/unit/LINUX64/CAPS/aim/tsfoil'
make -C unitTest 
make[2]: Entering directory '/jenkins/workspace/ESP_MemcheckCaps/7.8/CAPS/unit/LINUX64/CAPS/aim/unitTest'
make[2]: Nothing to be done for 'all'.
make[2]: Leaving directory '/jenkins/workspace/ESP_MemcheckCaps/7.8/CAPS/unit/LINUX64/CAPS/aim/unitTest'
make -C xfoil 
make[2]: Entering directory '/jenkins/workspace/ESP_MemcheckCaps/7.8/CAPS/unit/LINUX64/CAPS/aim/xfoil'
make[2]: '/jenkins/workspace/ESP_MemcheckCaps/7.8/CAPS/unit/LINUX64/ESP/LINUX64/lib/xfoilAIM.so' is up to date.
make[2]: Leaving directory '/jenkins/workspace/ESP_MemcheckCaps/7.8/CAPS/unit/LINUX64/CAPS/aim/xfoil'
make -C zaero 
make[2]: Entering directory '/jenkins/workspace/ESP_MemcheckCaps/7.8/CAPS/unit/LINUX64/CAPS/aim/zaero'
make[2]: Nothing to be done for 'default'.
make[2]: Leaving directory '/jenkins/workspace/ESP_MemcheckCaps/7.8/CAPS/unit/LINUX64/CAPS/aim/zaero'
make[1]: Leaving directory '/jenkins/workspace/ESP_MemcheckCaps/7.8/CAPS/unit/LINUX64/CAPS/aim'
(cd Slugs/src; make)
make[1]: Entering directory '/jenkins/workspace/ESP_MemcheckCaps/7.8/CAPS/unit/LINUX64/CAPS/Slugs/src'
make[1]: Nothing to be done for 'all'.
make[1]: Leaving directory '/jenkins/workspace/ESP_MemcheckCaps/7.8/CAPS/unit/LINUX64/CAPS/Slugs/src'
(cd test; make -f aim.make)
make[1]: Entering directory '/jenkins/workspace/ESP_MemcheckCaps/7.8/CAPS/unit/LINUX64/CAPS/test'
make[1]: Nothing to be done for 'default'.
make[1]: Leaving directory '/jenkins/workspace/ESP_MemcheckCaps/7.8/CAPS/unit/LINUX64/CAPS/test'
(cd test; make -f autoExec.make)
make[1]: Entering directory '/jenkins/workspace/ESP_MemcheckCaps/7.8/CAPS/unit/LINUX64/CAPS/test'
make[1]: Nothing to be done for 'default'.
make[1]: Leaving directory '/jenkins/workspace/ESP_MemcheckCaps/7.8/CAPS/unit/LINUX64/CAPS/test'
(cd test; make -f newPhase.make)
make[1]: Entering directory '/jenkins/workspace/ESP_MemcheckCaps/7.8/CAPS/unit/LINUX64/CAPS/test'
make[1]: '/jenkins/workspace/ESP_MemcheckCaps/7.8/CAPS/unit/LINUX64/ESP/LINUX64/test/newPhase' is up to date.
make[1]: Leaving directory '/jenkins/workspace/ESP_MemcheckCaps/7.8/CAPS/unit/LINUX64/CAPS/test'
(cd test; make -f basic.make)
make[1]: Entering directory '/jenkins/workspace/ESP_MemcheckCaps/7.8/CAPS/unit/LINUX64/CAPS/test'
make[1]: '/jenkins/workspace/ESP_MemcheckCaps/7.8/CAPS/unit/LINUX64/ESP/LINUX64/test/basic' is up to date.
make[1]: Leaving directory '/jenkins/workspace/ESP_MemcheckCaps/7.8/CAPS/unit/LINUX64/CAPS/test'
(cd test; make -f geomIn.make)
make[1]: Entering directory '/jenkins/workspace/ESP_MemcheckCaps/7.8/CAPS/unit/LINUX64/CAPS/test'
make[1]: '/jenkins/workspace/ESP_MemcheckCaps/7.8/CAPS/unit/LINUX64/ESP/LINUX64/test/geomIn' is up to date.
make[1]: Leaving directory '/jenkins/workspace/ESP_MemcheckCaps/7.8/CAPS/unit/LINUX64/CAPS/test'
(cd test; make -f utilsTest.make)
make[1]: Entering directory '/jenkins/workspace/ESP_MemcheckCaps/7.8/CAPS/unit/LINUX64/CAPS/test'
make[1]: Nothing to be done for 'default'.
make[1]: Leaving directory '/jenkins/workspace/ESP_MemcheckCaps/7.8/CAPS/unit/LINUX64/CAPS/test'
(cd test; make -f vVS.make)
make[1]: Entering directory '/jenkins/workspace/ESP_MemcheckCaps/7.8/CAPS/unit/LINUX64/CAPS/test'
make[1]: '/jenkins/workspace/ESP_MemcheckCaps/7.8/CAPS/unit/LINUX64/ESP/LINUX64/test/vVS' is up to date.
make[1]: Leaving directory '/jenkins/workspace/ESP_MemcheckCaps/7.8/CAPS/unit/LINUX64/CAPS/test'
(cd examples; make)
make[1]: Entering directory '/jenkins/workspace/ESP_MemcheckCaps/7.8/CAPS/unit/LINUX64/CAPS/examples'
(make -C cCAPS -f aeroelastic_SU2.make)
make[2]: Entering directory '/jenkins/workspace/ESP_MemcheckCaps/7.8/CAPS/unit/LINUX64/CAPS/examples/cCAPS'
make[2]: '/jenkins/workspace/ESP_MemcheckCaps/7.8/CAPS/unit/LINUX64/ESP/LINUX64/examples/cCAPS/aeroelasticSimple_Iterative_SU2_and_MystranTest' is up to date.
make[2]: Leaving directory '/jenkins/workspace/ESP_MemcheckCaps/7.8/CAPS/unit/LINUX64/CAPS/examples/cCAPS'
(make -C cCAPS -f avlTest.make)
make[2]: Entering directory '/jenkins/workspace/ESP_MemcheckCaps/7.8/CAPS/unit/LINUX64/CAPS/examples/cCAPS'
make[2]: '/jenkins/workspace/ESP_MemcheckCaps/7.8/CAPS/unit/LINUX64/ESP/LINUX64/examples/cCAPS/avlTest' is up to date.
make[2]: Leaving directory '/jenkins/workspace/ESP_MemcheckCaps/7.8/CAPS/unit/LINUX64/CAPS/examples/cCAPS'
(make -C cCAPS -f awaveTest.make)
make[2]: Entering directory '/jenkins/workspace/ESP_MemcheckCaps/7.8/CAPS/unit/LINUX64/CAPS/examples/cCAPS'
make[2]: '/jenkins/workspace/ESP_MemcheckCaps/7.8/CAPS/unit/LINUX64/ESP/LINUX64/examples/cCAPS/awaveTest' is up to date.
make[2]: Leaving directory '/jenkins/workspace/ESP_MemcheckCaps/7.8/CAPS/unit/LINUX64/CAPS/examples/cCAPS'
(make -C cCAPS -f frictionTest.make)
make[2]: Entering directory '/jenkins/workspace/ESP_MemcheckCaps/7.8/CAPS/unit/LINUX64/CAPS/examples/cCAPS'
make[2]: '/jenkins/workspace/ESP_MemcheckCaps/7.8/CAPS/unit/LINUX64/ESP/LINUX64/examples/cCAPS/frictionTest' is up to date.
make[2]: Leaving directory '/jenkins/workspace/ESP_MemcheckCaps/7.8/CAPS/unit/LINUX64/CAPS/examples/cCAPS'
(make -C cCAPS -f fun3d.make)
make[2]: Entering directory '/jenkins/workspace/ESP_MemcheckCaps/7.8/CAPS/unit/LINUX64/CAPS/examples/cCAPS'
make[2]: Nothing to be done for 'fun3d'.
make[2]: Leaving directory '/jenkins/workspace/ESP_MemcheckCaps/7.8/CAPS/unit/LINUX64/CAPS/examples/cCAPS'
(make -C cCAPS -f hsm.make)
make[2]: Entering directory '/jenkins/workspace/ESP_MemcheckCaps/7.8/CAPS/unit/LINUX64/CAPS/examples/cCAPS'
make[2]: 'hsm' is up to date.
make[2]: Leaving directory '/jenkins/workspace/ESP_MemcheckCaps/7.8/CAPS/unit/LINUX64/CAPS/examples/cCAPS'
(make -C cCAPS -f interferenceTest.make)
make[2]: Entering directory '/jenkins/workspace/ESP_MemcheckCaps/7.8/CAPS/unit/LINUX64/CAPS/examples/cCAPS'
make[2]: '/jenkins/workspace/ESP_MemcheckCaps/7.8/CAPS/unit/LINUX64/ESP/LINUX64/examples/cCAPS/interferenceTest' is up to date.
make[2]: Leaving directory '/jenkins/workspace/ESP_MemcheckCaps/7.8/CAPS/unit/LINUX64/CAPS/examples/cCAPS'
(make -C cCAPS -f msesTest.make)
make[2]: Entering directory '/jenkins/workspace/ESP_MemcheckCaps/7.8/CAPS/unit/LINUX64/CAPS/examples/cCAPS'
make[2]: '/jenkins/workspace/ESP_MemcheckCaps/7.8/CAPS/unit/LINUX64/ESP/LINUX64/examples/cCAPS/msesTest' is up to date.
make[2]: Leaving directory '/jenkins/workspace/ESP_MemcheckCaps/7.8/CAPS/unit/LINUX64/CAPS/examples/cCAPS'
(make -C cCAPS -f mystran.make)
make[2]: Entering directory '/jenkins/workspace/ESP_MemcheckCaps/7.8/CAPS/unit/LINUX64/CAPS/examples/cCAPS'
make[2]: '/jenkins/workspace/ESP_MemcheckCaps/7.8/CAPS/unit/LINUX64/ESP/LINUX64/examples/cCAPS/mystranTest' is up to date.
make[2]: Leaving directory '/jenkins/workspace/ESP_MemcheckCaps/7.8/CAPS/unit/LINUX64/CAPS/examples/cCAPS'
(make -C cCAPS -f pointwiseTest.make)
make[2]: Entering directory '/jenkins/workspace/ESP_MemcheckCaps/7.8/CAPS/unit/LINUX64/CAPS/examples/cCAPS'
make[2]: '/jenkins/workspace/ESP_MemcheckCaps/7.8/CAPS/unit/LINUX64/ESP/LINUX64/examples/cCAPS/pointwiseTest' is up to date.
make[2]: Leaving directory '/jenkins/workspace/ESP_MemcheckCaps/7.8/CAPS/unit/LINUX64/CAPS/examples/cCAPS'
make[1]: Leaving directory '/jenkins/workspace/ESP_MemcheckCaps/7.8/CAPS/unit/LINUX64/CAPS/examples'
make -C pyCAPS/unitTest test
make[1]: Entering directory '/jenkins/workspace/ESP_MemcheckCaps/7.8/CAPS/unit/LINUX64/CAPS/pyCAPS/unitTest'
python --version
Python 3.11.9
python -u -m unittest discover
EEEEEEEEEEEE
======================================================================
ERROR: testAnalysis (unittest.loader._FailedTest.testAnalysis)
----------------------------------------------------------------------
ImportError: Failed to import test module: testAnalysis
Traceback (most recent call last):
  File "/home/jenkins/util/python/Python-3.11.9_address/install/lib/python3.11/unittest/loader.py", line 419, in _find_test_path
    module = self._get_module_from_name(name)
             ^^^^^^^^^^^^^^^^^^^^^^^^^^^^^^^^
  File "/home/jenkins/util/python/Python-3.11.9_address/install/lib/python3.11/unittest/loader.py", line 362, in _get_module_from_name
    __import__(name)
  File "/jenkins/workspace/ESP_MemcheckCaps/7.8/CAPS/unit/LINUX64/CAPS/pyCAPS/unitTest/testAnalysis.py", line 11, in <module>
    import pyCAPS
  File "/jenkins/workspace/ESP_MemcheckCaps/7.8/CAPS/unit/LINUX64/CAPS/pyCAPS/pyCAPS/__init__.py", line 2, in <module>
    from .caps import *
  File "/jenkins/workspace/ESP_MemcheckCaps/7.8/CAPS/unit/LINUX64/CAPS/pyCAPS/pyCAPS/caps.py", line 24, in <module>
    from pyEGADS import egads
  File "/jenkins/workspace/ESP_MemcheckCaps/7.8/CAPS/unit/LINUX64/EGADS/trunk/pyEGADS/pyEGADS/egads.py", line 34, in <module>
    _egads = ctypes.CDLL(_ESP_ROOT + "/lib/libegads.so")
             ^^^^^^^^^^^^^^^^^^^^^^^^^^^^^^^^^^^^^^^^^^^
  File "/home/jenkins/util/python/Python-3.11.9_address/install/lib/python3.11/ctypes/__init__.py", line 376, in __init__
    self._handle = _dlopen(self._name, mode)
                   ^^^^^^^^^^^^^^^^^^^^^^^^^
OSError: /home/jenkins/util/ESP/opencascade-7.8/trunk/build_address/install/lib/libTKService.so.7.8: undefined symbol: XStoreName


======================================================================
ERROR: testBound (unittest.loader._FailedTest.testBound)
----------------------------------------------------------------------
ImportError: Failed to import test module: testBound
Traceback (most recent call last):
  File "/home/jenkins/util/python/Python-3.11.9_address/install/lib/python3.11/unittest/loader.py", line 419, in _find_test_path
    module = self._get_module_from_name(name)
             ^^^^^^^^^^^^^^^^^^^^^^^^^^^^^^^^
  File "/home/jenkins/util/python/Python-3.11.9_address/install/lib/python3.11/unittest/loader.py", line 362, in _get_module_from_name
    __import__(name)
  File "/jenkins/workspace/ESP_MemcheckCaps/7.8/CAPS/unit/LINUX64/CAPS/pyCAPS/unitTest/testBound.py", line 11, in <module>
    import pyCAPS
  File "/jenkins/workspace/ESP_MemcheckCaps/7.8/CAPS/unit/LINUX64/CAPS/pyCAPS/pyCAPS/__init__.py", line 2, in <module>
    from .caps import *
  File "/jenkins/workspace/ESP_MemcheckCaps/7.8/CAPS/unit/LINUX64/CAPS/pyCAPS/pyCAPS/caps.py", line 24, in <module>
    from pyEGADS import egads
  File "/jenkins/workspace/ESP_MemcheckCaps/7.8/CAPS/unit/LINUX64/EGADS/trunk/pyEGADS/pyEGADS/egads.py", line 34, in <module>
    _egads = ctypes.CDLL(_ESP_ROOT + "/lib/libegads.so")
             ^^^^^^^^^^^^^^^^^^^^^^^^^^^^^^^^^^^^^^^^^^^
  File "/home/jenkins/util/python/Python-3.11.9_address/install/lib/python3.11/ctypes/__init__.py", line 376, in __init__
    self._handle = _dlopen(self._name, mode)
                   ^^^^^^^^^^^^^^^^^^^^^^^^^
OSError: /home/jenkins/util/ESP/opencascade-7.8/trunk/build_address/install/lib/libTKService.so.7.8: undefined symbol: XStoreName


======================================================================
ERROR: testExperiment (unittest.loader._FailedTest.testExperiment)
----------------------------------------------------------------------
ImportError: Failed to import test module: testExperiment
Traceback (most recent call last):
  File "/home/jenkins/util/python/Python-3.11.9_address/install/lib/python3.11/unittest/loader.py", line 419, in _find_test_path
    module = self._get_module_from_name(name)
             ^^^^^^^^^^^^^^^^^^^^^^^^^^^^^^^^
  File "/home/jenkins/util/python/Python-3.11.9_address/install/lib/python3.11/unittest/loader.py", line 362, in _get_module_from_name
    __import__(name)
  File "/jenkins/workspace/ESP_MemcheckCaps/7.8/CAPS/unit/LINUX64/CAPS/pyCAPS/unitTest/testExperiment.py", line 10, in <module>
    import pyCAPS
  File "/jenkins/workspace/ESP_MemcheckCaps/7.8/CAPS/unit/LINUX64/CAPS/pyCAPS/pyCAPS/__init__.py", line 2, in <module>
    from .caps import *
  File "/jenkins/workspace/ESP_MemcheckCaps/7.8/CAPS/unit/LINUX64/CAPS/pyCAPS/pyCAPS/caps.py", line 24, in <module>
    from pyEGADS import egads
  File "/jenkins/workspace/ESP_MemcheckCaps/7.8/CAPS/unit/LINUX64/EGADS/trunk/pyEGADS/pyEGADS/egads.py", line 34, in <module>
    _egads = ctypes.CDLL(_ESP_ROOT + "/lib/libegads.so")
             ^^^^^^^^^^^^^^^^^^^^^^^^^^^^^^^^^^^^^^^^^^^
  File "/home/jenkins/util/python/Python-3.11.9_address/install/lib/python3.11/ctypes/__init__.py", line 376, in __init__
    self._handle = _dlopen(self._name, mode)
                   ^^^^^^^^^^^^^^^^^^^^^^^^^
OSError: /home/jenkins/util/ESP/opencascade-7.8/trunk/build_address/install/lib/libTKService.so.7.8: undefined symbol: XStoreName


======================================================================
ERROR: testGeometry (unittest.loader._FailedTest.testGeometry)
----------------------------------------------------------------------
ImportError: Failed to import test module: testGeometry
Traceback (most recent call last):
  File "/home/jenkins/util/python/Python-3.11.9_address/install/lib/python3.11/unittest/loader.py", line 419, in _find_test_path
    module = self._get_module_from_name(name)
             ^^^^^^^^^^^^^^^^^^^^^^^^^^^^^^^^
  File "/home/jenkins/util/python/Python-3.11.9_address/install/lib/python3.11/unittest/loader.py", line 362, in _get_module_from_name
    __import__(name)
  File "/jenkins/workspace/ESP_MemcheckCaps/7.8/CAPS/unit/LINUX64/CAPS/pyCAPS/unitTest/testGeometry.py", line 15, in <module>
    import pyCAPS
  File "/jenkins/workspace/ESP_MemcheckCaps/7.8/CAPS/unit/LINUX64/CAPS/pyCAPS/pyCAPS/__init__.py", line 2, in <module>
    from .caps import *
  File "/jenkins/workspace/ESP_MemcheckCaps/7.8/CAPS/unit/LINUX64/CAPS/pyCAPS/pyCAPS/caps.py", line 24, in <module>
    from pyEGADS import egads
  File "/jenkins/workspace/ESP_MemcheckCaps/7.8/CAPS/unit/LINUX64/EGADS/trunk/pyEGADS/pyEGADS/egads.py", line 34, in <module>
    _egads = ctypes.CDLL(_ESP_ROOT + "/lib/libegads.so")
             ^^^^^^^^^^^^^^^^^^^^^^^^^^^^^^^^^^^^^^^^^^^
  File "/home/jenkins/util/python/Python-3.11.9_address/install/lib/python3.11/ctypes/__init__.py", line 376, in __init__
    self._handle = _dlopen(self._name, mode)
                   ^^^^^^^^^^^^^^^^^^^^^^^^^
OSError: /home/jenkins/util/ESP/opencascade-7.8/trunk/build_address/install/lib/libTKService.so.7.8: undefined symbol: XStoreName


======================================================================
ERROR: testJournal (unittest.loader._FailedTest.testJournal)
----------------------------------------------------------------------
ImportError: Failed to import test module: testJournal
Traceback (most recent call last):
  File "/home/jenkins/util/python/Python-3.11.9_address/install/lib/python3.11/unittest/loader.py", line 419, in _find_test_path
    module = self._get_module_from_name(name)
             ^^^^^^^^^^^^^^^^^^^^^^^^^^^^^^^^
  File "/home/jenkins/util/python/Python-3.11.9_address/install/lib/python3.11/unittest/loader.py", line 362, in _get_module_from_name
    __import__(name)
  File "/jenkins/workspace/ESP_MemcheckCaps/7.8/CAPS/unit/LINUX64/CAPS/pyCAPS/unitTest/testJournal.py", line 10, in <module>
    import pyCAPS
  File "/jenkins/workspace/ESP_MemcheckCaps/7.8/CAPS/unit/LINUX64/CAPS/pyCAPS/pyCAPS/__init__.py", line 2, in <module>
    from .caps import *
  File "/jenkins/workspace/ESP_MemcheckCaps/7.8/CAPS/unit/LINUX64/CAPS/pyCAPS/pyCAPS/caps.py", line 24, in <module>
    from pyEGADS import egads
  File "/jenkins/workspace/ESP_MemcheckCaps/7.8/CAPS/unit/LINUX64/EGADS/trunk/pyEGADS/pyEGADS/egads.py", line 34, in <module>
    _egads = ctypes.CDLL(_ESP_ROOT + "/lib/libegads.so")
             ^^^^^^^^^^^^^^^^^^^^^^^^^^^^^^^^^^^^^^^^^^^
  File "/home/jenkins/util/python/Python-3.11.9_address/install/lib/python3.11/ctypes/__init__.py", line 376, in __init__
    self._handle = _dlopen(self._name, mode)
                   ^^^^^^^^^^^^^^^^^^^^^^^^^
OSError: /home/jenkins/util/ESP/opencascade-7.8/trunk/build_address/install/lib/libTKService.so.7.8: undefined symbol: XStoreName


======================================================================
ERROR: testParameter (unittest.loader._FailedTest.testParameter)
----------------------------------------------------------------------
ImportError: Failed to import test module: testParameter
Traceback (most recent call last):
  File "/home/jenkins/util/python/Python-3.11.9_address/install/lib/python3.11/unittest/loader.py", line 419, in _find_test_path
    module = self._get_module_from_name(name)
             ^^^^^^^^^^^^^^^^^^^^^^^^^^^^^^^^
  File "/home/jenkins/util/python/Python-3.11.9_address/install/lib/python3.11/unittest/loader.py", line 362, in _get_module_from_name
    __import__(name)
  File "/jenkins/workspace/ESP_MemcheckCaps/7.8/CAPS/unit/LINUX64/CAPS/pyCAPS/unitTest/testParameter.py", line 8, in <module>
    import pyCAPS
  File "/jenkins/workspace/ESP_MemcheckCaps/7.8/CAPS/unit/LINUX64/CAPS/pyCAPS/pyCAPS/__init__.py", line 2, in <module>
    from .caps import *
  File "/jenkins/workspace/ESP_MemcheckCaps/7.8/CAPS/unit/LINUX64/CAPS/pyCAPS/pyCAPS/caps.py", line 24, in <module>
    from pyEGADS import egads
  File "/jenkins/workspace/ESP_MemcheckCaps/7.8/CAPS/unit/LINUX64/EGADS/trunk/pyEGADS/pyEGADS/egads.py", line 34, in <module>
    _egads = ctypes.CDLL(_ESP_ROOT + "/lib/libegads.so")
             ^^^^^^^^^^^^^^^^^^^^^^^^^^^^^^^^^^^^^^^^^^^
  File "/home/jenkins/util/python/Python-3.11.9_address/install/lib/python3.11/ctypes/__init__.py", line 376, in __init__
    self._handle = _dlopen(self._name, mode)
                   ^^^^^^^^^^^^^^^^^^^^^^^^^
OSError: /home/jenkins/util/ESP/opencascade-7.8/trunk/build_address/install/lib/libTKService.so.7.8: undefined symbol: XStoreName


======================================================================
ERROR: testProblem (unittest.loader._FailedTest.testProblem)
----------------------------------------------------------------------
ImportError: Failed to import test module: testProblem
Traceback (most recent call last):
  File "/home/jenkins/util/python/Python-3.11.9_address/install/lib/python3.11/unittest/loader.py", line 419, in _find_test_path
    module = self._get_module_from_name(name)
             ^^^^^^^^^^^^^^^^^^^^^^^^^^^^^^^^
  File "/home/jenkins/util/python/Python-3.11.9_address/install/lib/python3.11/unittest/loader.py", line 362, in _get_module_from_name
    __import__(name)
  File "/jenkins/workspace/ESP_MemcheckCaps/7.8/CAPS/unit/LINUX64/CAPS/pyCAPS/unitTest/testProblem.py", line 10, in <module>
    import pyCAPS
  File "/jenkins/workspace/ESP_MemcheckCaps/7.8/CAPS/unit/LINUX64/CAPS/pyCAPS/pyCAPS/__init__.py", line 2, in <module>
    from .caps import *
  File "/jenkins/workspace/ESP_MemcheckCaps/7.8/CAPS/unit/LINUX64/CAPS/pyCAPS/pyCAPS/caps.py", line 24, in <module>
    from pyEGADS import egads
  File "/jenkins/workspace/ESP_MemcheckCaps/7.8/CAPS/unit/LINUX64/EGADS/trunk/pyEGADS/pyEGADS/egads.py", line 34, in <module>
    _egads = ctypes.CDLL(_ESP_ROOT + "/lib/libegads.so")
             ^^^^^^^^^^^^^^^^^^^^^^^^^^^^^^^^^^^^^^^^^^^
  File "/home/jenkins/util/python/Python-3.11.9_address/install/lib/python3.11/ctypes/__init__.py", line 376, in __init__
    self._handle = _dlopen(self._name, mode)
                   ^^^^^^^^^^^^^^^^^^^^^^^^^
OSError: /home/jenkins/util/ESP/opencascade-7.8/trunk/build_address/install/lib/libTKService.so.7.8: undefined symbol: XStoreName


======================================================================
ERROR: test_capsObjAnalysis (unittest.loader._FailedTest.test_capsObjAnalysis)
----------------------------------------------------------------------
ImportError: Failed to import test module: test_capsObjAnalysis
Traceback (most recent call last):
  File "/home/jenkins/util/python/Python-3.11.9_address/install/lib/python3.11/unittest/loader.py", line 419, in _find_test_path
    module = self._get_module_from_name(name)
             ^^^^^^^^^^^^^^^^^^^^^^^^^^^^^^^^
  File "/home/jenkins/util/python/Python-3.11.9_address/install/lib/python3.11/unittest/loader.py", line 362, in _get_module_from_name
    __import__(name)
  File "/jenkins/workspace/ESP_MemcheckCaps/7.8/CAPS/unit/LINUX64/CAPS/pyCAPS/unitTest/test_capsObjAnalysis.py", line 12, in <module>
    from pyCAPS import caps
  File "/jenkins/workspace/ESP_MemcheckCaps/7.8/CAPS/unit/LINUX64/CAPS/pyCAPS/pyCAPS/__init__.py", line 2, in <module>
    from .caps import *
  File "/jenkins/workspace/ESP_MemcheckCaps/7.8/CAPS/unit/LINUX64/CAPS/pyCAPS/pyCAPS/caps.py", line 24, in <module>
    from pyEGADS import egads
  File "/jenkins/workspace/ESP_MemcheckCaps/7.8/CAPS/unit/LINUX64/EGADS/trunk/pyEGADS/pyEGADS/egads.py", line 34, in <module>
    _egads = ctypes.CDLL(_ESP_ROOT + "/lib/libegads.so")
             ^^^^^^^^^^^^^^^^^^^^^^^^^^^^^^^^^^^^^^^^^^^
  File "/home/jenkins/util/python/Python-3.11.9_address/install/lib/python3.11/ctypes/__init__.py", line 376, in __init__
    self._handle = _dlopen(self._name, mode)
                   ^^^^^^^^^^^^^^^^^^^^^^^^^
OSError: /home/jenkins/util/ESP/opencascade-7.8/trunk/build_address/install/lib/libTKService.so.7.8: undefined symbol: XStoreName


======================================================================
ERROR: test_capsObjBound (unittest.loader._FailedTest.test_capsObjBound)
----------------------------------------------------------------------
ImportError: Failed to import test module: test_capsObjBound
Traceback (most recent call last):
  File "/home/jenkins/util/python/Python-3.11.9_address/install/lib/python3.11/unittest/loader.py", line 419, in _find_test_path
    module = self._get_module_from_name(name)
             ^^^^^^^^^^^^^^^^^^^^^^^^^^^^^^^^
  File "/home/jenkins/util/python/Python-3.11.9_address/install/lib/python3.11/unittest/loader.py", line 362, in _get_module_from_name
    __import__(name)
  File "/jenkins/workspace/ESP_MemcheckCaps/7.8/CAPS/unit/LINUX64/CAPS/pyCAPS/unitTest/test_capsObjBound.py", line 11, in <module>
    from pyCAPS import caps
  File "/jenkins/workspace/ESP_MemcheckCaps/7.8/CAPS/unit/LINUX64/CAPS/pyCAPS/pyCAPS/__init__.py", line 2, in <module>
    from .caps import *
  File "/jenkins/workspace/ESP_MemcheckCaps/7.8/CAPS/unit/LINUX64/CAPS/pyCAPS/pyCAPS/caps.py", line 24, in <module>
    from pyEGADS import egads
  File "/jenkins/workspace/ESP_MemcheckCaps/7.8/CAPS/unit/LINUX64/EGADS/trunk/pyEGADS/pyEGADS/egads.py", line 34, in <module>
    _egads = ctypes.CDLL(_ESP_ROOT + "/lib/libegads.so")
             ^^^^^^^^^^^^^^^^^^^^^^^^^^^^^^^^^^^^^^^^^^^
  File "/home/jenkins/util/python/Python-3.11.9_address/install/lib/python3.11/ctypes/__init__.py", line 376, in __init__
    self._handle = _dlopen(self._name, mode)
                   ^^^^^^^^^^^^^^^^^^^^^^^^^
OSError: /home/jenkins/util/ESP/opencascade-7.8/trunk/build_address/install/lib/libTKService.so.7.8: undefined symbol: XStoreName


======================================================================
ERROR: test_capsObjProblem (unittest.loader._FailedTest.test_capsObjProblem)
----------------------------------------------------------------------
ImportError: Failed to import test module: test_capsObjProblem
Traceback (most recent call last):
  File "/home/jenkins/util/python/Python-3.11.9_address/install/lib/python3.11/unittest/loader.py", line 419, in _find_test_path
    module = self._get_module_from_name(name)
             ^^^^^^^^^^^^^^^^^^^^^^^^^^^^^^^^
  File "/home/jenkins/util/python/Python-3.11.9_address/install/lib/python3.11/unittest/loader.py", line 362, in _get_module_from_name
    __import__(name)
  File "/jenkins/workspace/ESP_MemcheckCaps/7.8/CAPS/unit/LINUX64/CAPS/pyCAPS/unitTest/test_capsObjProblem.py", line 8, in <module>
    from pyCAPS import caps
  File "/jenkins/workspace/ESP_MemcheckCaps/7.8/CAPS/unit/LINUX64/CAPS/pyCAPS/pyCAPS/__init__.py", line 2, in <module>
    from .caps import *
  File "/jenkins/workspace/ESP_MemcheckCaps/7.8/CAPS/unit/LINUX64/CAPS/pyCAPS/pyCAPS/caps.py", line 24, in <module>
    from pyEGADS import egads
  File "/jenkins/workspace/ESP_MemcheckCaps/7.8/CAPS/unit/LINUX64/EGADS/trunk/pyEGADS/pyEGADS/egads.py", line 34, in <module>
    _egads = ctypes.CDLL(_ESP_ROOT + "/lib/libegads.so")
             ^^^^^^^^^^^^^^^^^^^^^^^^^^^^^^^^^^^^^^^^^^^
  File "/home/jenkins/util/python/Python-3.11.9_address/install/lib/python3.11/ctypes/__init__.py", line 376, in __init__
    self._handle = _dlopen(self._name, mode)
                   ^^^^^^^^^^^^^^^^^^^^^^^^^
OSError: /home/jenkins/util/ESP/opencascade-7.8/trunk/build_address/install/lib/libTKService.so.7.8: undefined symbol: XStoreName


======================================================================
ERROR: test_capsObjUnits (unittest.loader._FailedTest.test_capsObjUnits)
----------------------------------------------------------------------
ImportError: Failed to import test module: test_capsObjUnits
Traceback (most recent call last):
  File "/home/jenkins/util/python/Python-3.11.9_address/install/lib/python3.11/unittest/loader.py", line 419, in _find_test_path
    module = self._get_module_from_name(name)
             ^^^^^^^^^^^^^^^^^^^^^^^^^^^^^^^^
  File "/home/jenkins/util/python/Python-3.11.9_address/install/lib/python3.11/unittest/loader.py", line 362, in _get_module_from_name
    __import__(name)
  File "/jenkins/workspace/ESP_MemcheckCaps/7.8/CAPS/unit/LINUX64/CAPS/pyCAPS/unitTest/test_capsObjUnits.py", line 6, in <module>
    from pyCAPS import caps
  File "/jenkins/workspace/ESP_MemcheckCaps/7.8/CAPS/unit/LINUX64/CAPS/pyCAPS/pyCAPS/__init__.py", line 2, in <module>
    from .caps import *
  File "/jenkins/workspace/ESP_MemcheckCaps/7.8/CAPS/unit/LINUX64/CAPS/pyCAPS/pyCAPS/caps.py", line 24, in <module>
    from pyEGADS import egads
  File "/jenkins/workspace/ESP_MemcheckCaps/7.8/CAPS/unit/LINUX64/EGADS/trunk/pyEGADS/pyEGADS/egads.py", line 34, in <module>
    _egads = ctypes.CDLL(_ESP_ROOT + "/lib/libegads.so")
             ^^^^^^^^^^^^^^^^^^^^^^^^^^^^^^^^^^^^^^^^^^^
  File "/home/jenkins/util/python/Python-3.11.9_address/install/lib/python3.11/ctypes/__init__.py", line 376, in __init__
    self._handle = _dlopen(self._name, mode)
                   ^^^^^^^^^^^^^^^^^^^^^^^^^
OSError: /home/jenkins/util/ESP/opencascade-7.8/trunk/build_address/install/lib/libTKService.so.7.8: undefined symbol: XStoreName


======================================================================
ERROR: test_capsObjValue (unittest.loader._FailedTest.test_capsObjValue)
----------------------------------------------------------------------
ImportError: Failed to import test module: test_capsObjValue
Traceback (most recent call last):
  File "/home/jenkins/util/python/Python-3.11.9_address/install/lib/python3.11/unittest/loader.py", line 419, in _find_test_path
    module = self._get_module_from_name(name)
             ^^^^^^^^^^^^^^^^^^^^^^^^^^^^^^^^
  File "/home/jenkins/util/python/Python-3.11.9_address/install/lib/python3.11/unittest/loader.py", line 362, in _get_module_from_name
    __import__(name)
  File "/jenkins/workspace/ESP_MemcheckCaps/7.8/CAPS/unit/LINUX64/CAPS/pyCAPS/unitTest/test_capsObjValue.py", line 8, in <module>
    from pyCAPS import caps
  File "/jenkins/workspace/ESP_MemcheckCaps/7.8/CAPS/unit/LINUX64/CAPS/pyCAPS/pyCAPS/__init__.py", line 2, in <module>
    from .caps import *
  File "/jenkins/workspace/ESP_MemcheckCaps/7.8/CAPS/unit/LINUX64/CAPS/pyCAPS/pyCAPS/caps.py", line 24, in <module>
    from pyEGADS import egads
  File "/jenkins/workspace/ESP_MemcheckCaps/7.8/CAPS/unit/LINUX64/EGADS/trunk/pyEGADS/pyEGADS/egads.py", line 34, in <module>
    _egads = ctypes.CDLL(_ESP_ROOT + "/lib/libegads.so")
             ^^^^^^^^^^^^^^^^^^^^^^^^^^^^^^^^^^^^^^^^^^^
  File "/home/jenkins/util/python/Python-3.11.9_address/install/lib/python3.11/ctypes/__init__.py", line 376, in __init__
    self._handle = _dlopen(self._name, mode)
                   ^^^^^^^^^^^^^^^^^^^^^^^^^
OSError: /home/jenkins/util/ESP/opencascade-7.8/trunk/build_address/install/lib/libTKService.so.7.8: undefined symbol: XStoreName


----------------------------------------------------------------------
Ran 12 tests in 0.008s

FAILED (errors=12)
-----------------------------------------------------
Suppressions used:
  count      bytes template
      2         96 *PyFloat_FromDouble*
      3        240 *numpy*
-----------------------------------------------------

make[1]: *** [Makefile:4: test] Error 1
make[1]: Leaving directory '/jenkins/workspace/ESP_MemcheckCaps/7.8/CAPS/unit/LINUX64/CAPS/pyCAPS/unitTest'
make: *** [Makefile:69: unitpy] Error 2
++ true
[GNU C Compiler (gcc)] Parsing console log (workspace: '/jenkins/workspace/ESP_MemcheckCaps/7.8/CAPS/unit/LINUX64')
[GNU C Compiler (gcc)] Successfully parsed console log
[GNU C Compiler (gcc)] -> found 0 issues (skipped 0 duplicates)
[GNU C Compiler (gcc)] Skipping post processing
[GNU C Compiler (gcc)] No filter has been set, publishing all 0 issues
[GNU C Compiler (gcc)] Repository miner is not configured, skipping repository mining
[Clang] Parsing console log (workspace: '/jenkins/workspace/ESP_MemcheckCaps/7.8/CAPS/unit/LINUX64')
[Clang] -> found 0 issues (skipped 0 duplicates)
[Clang] Parsing console log (workspace: '/jenkins/workspace/ESP_MemcheckCaps/7.8/CAPS/unit/LINUX64')
[Clang] Skipping post processing
[Clang] No filter has been set, publishing all 0 issues
[Clang] Repository miner is not configured, skipping repository mining
[Static Analysis] Successfully parsed console log
[Static Analysis] -> found 0 issues (skipped 0 duplicates)
[Static Analysis] Parsing console log (workspace: '/jenkins/workspace/ESP_MemcheckCaps/7.8/CAPS/unit/LINUX64')
[Static Analysis] Successfully parsed console log
[Static Analysis] -> found 0 issues (skipped 0 duplicates)
[Static Analysis] Skipping post processing
[Static Analysis] No filter has been set, publishing all 0 issues
[Static Analysis] Repository miner is not configured, skipping repository mining
[Static Analysis] Parsing console log (workspace: '/jenkins/workspace/ESP_MemcheckCaps/7.8/CAPS/unit/LINUX64')
[Static Analysis] Skipping post processing
[Static Analysis] No filter has been set, publishing all 0 issues
[Static Analysis] Repository miner is not configured, skipping repository mining
[Static Analysis] Reference build recorder is not configured
[Static Analysis] No valid reference build found
[Static Analysis] All reported issues will be considered outstanding
[Static Analysis] No quality gates have been set - skipping
[Static Analysis] Health report is disabled - skipping
[Static Analysis] Created analysis result for 0 issues (found 0 new issues, fixed 0 issues)
[Static Analysis] Attaching ResultAction with ID 'analysis' to build 'ESP_MemcheckCaps/CASREV=7.8,ESPTEST=CAPS/unit,ESP_ARCH=LINUX64,buildnode=reynolds #1420'.
[Checks API] No suitable checks publisher found.
Build step 'Console output (build log) parsing' changed build result to FAILURE
[PostBuildScript] - [INFO] Executing post build scripts.
[PostBuildScript] - [INFO] build step #0 should only be executed on MATRIX
[WS-CLEANUP] Deleting project workspace...
[WS-CLEANUP] Skipped based on build state FAILURE
Finished: FAILURE