Console Output

Skipping 325 KB.. Full Log
[ 94%] Building CXX object src/pde/ShallowWater/CMakeFiles/ShallowWaterLib.dir/PDEShallowWater2D.cpp.o
[ 94%] Building CXX object src/pde/ShallowWater/CMakeFiles/ShallowWaterLib.dir/ShallowWaterSolution2D.cpp.o
[ 94%] Building CXX object src/pde/ShallowWater/CMakeFiles/ShallowWaterLib.dir/BCShallowWater2D.cpp.o
[ 94%] Building CXX object src/pde/ShallowWater/CMakeFiles/ShallowWaterLib.dir/PDEShallowWater2D_manifold.cpp.o
[ 94%] Building CXX object src/pde/ShallowWater/CMakeFiles/ShallowWaterLib.dir/ShallowWaterSolution2D_manifold.cpp.o
[ 94%] Building CXX object src/pde/ShallowWater/CMakeFiles/ShallowWaterLib.dir/BCShallowWater2D_manifold.cpp.o
[ 94%] Linking CXX static library libShallowWaterLib.a
[ 94%] Built target ShallowWaterLib
Scanning dependencies of target Adjoint2D_HDG_Triangle_AD_mitState_btest_OBJECT
[ 94%] Building CXX object test/system/Asymptotic/CMakeFiles/Adjoint2D_HDG_Triangle_AD_mitState_btest_OBJECT.dir/Adjoint2D_HDG_Triangle_AD_mitState_btest.cpp.o
[ 94%] Built target Adjoint2D_HDG_Triangle_AD_mitState_btest_OBJECT
Scanning dependencies of target Adjoint2D_HDG_Triangle_AD_mitState_btest_build
[ 94%] Linking CXX executable Adjoint2D_HDG_Triangle_AD_mitState_btest
[ 94%] Built target Adjoint2D_HDG_Triangle_AD_mitState_btest_build
Scanning dependencies of target ErrorOrder_2D_CGStabilized_RANS_MMS_btest_OBJECT
[ 94%] Building CXX object test/system/Asymptotic/CMakeFiles/ErrorOrder_2D_CGStabilized_RANS_MMS_btest_OBJECT.dir/ErrorOrder_2D_CGStabilized_RANS_MMS_btest.cpp.o
[ 94%] Built target ErrorOrder_2D_CGStabilized_RANS_MMS_btest_OBJECT
Scanning dependencies of target ErrorOrder_2D_CGStabilized_RANS_MMS_btest_build_vera
[ 94%] Checking style of test/system/Asymptotic/ErrorOrder_2D_CGStabilized_RANS_MMS_btest.cpp
[ 94%] Built target ErrorOrder_2D_CGStabilized_RANS_MMS_btest_build_vera
Scanning dependencies of target ErrorOrder_2D_CGStabilized_RANS_MMS_btest_build
[ 94%] Linking CXX executable ErrorOrder_2D_CGStabilized_RANS_MMS_btest
[ 94%] Built target ErrorOrder_2D_CGStabilized_RANS_MMS_btest_build
Scanning dependencies of target ErrorOrder_2D_DGAdvective_Annulus_Quad_btest_OBJECT
[ 94%] Building CXX object test/system/Asymptotic/CMakeFiles/ErrorOrder_2D_DGAdvective_Annulus_Quad_btest_OBJECT.dir/ErrorOrder_2D_DGAdvective_Annulus_Quad_btest.cpp.o
[ 94%] Built target ErrorOrder_2D_DGAdvective_Annulus_Quad_btest_OBJECT
Scanning dependencies of target ErrorOrder_2D_DGAdvective_Annulus_Quad_btest_build_vera
[ 94%] Checking style of test/system/Asymptotic/ErrorOrder_2D_DGAdvective_Annulus_Quad_btest.cpp
[ 94%] Built target ErrorOrder_2D_DGAdvective_Annulus_Quad_btest_build_vera
Scanning dependencies of target ErrorOrder_2D_DGAdvective_Annulus_Quad_btest_build
[ 94%] Linking CXX executable ErrorOrder_2D_DGAdvective_Annulus_Quad_btest
[ 94%] Built target ErrorOrder_2D_DGAdvective_Annulus_Quad_btest_build
Scanning dependencies of target ErrorOrder_1D_DGBR2_AD_HB_btest_build_vera
[ 94%] Checking style of test/system/Asymptotic/ErrorOrder_1D_DGBR2_AD_HB_btest.cpp
[ 94%] Built target ErrorOrder_1D_DGBR2_AD_HB_btest_build_vera
Scanning dependencies of target ErrorOrder_1D_DGBR2_AD_HB_btest_OBJECT
[ 94%] Building CXX object test/system/Asymptotic/CMakeFiles/ErrorOrder_1D_DGBR2_AD_HB_btest_OBJECT.dir/ErrorOrder_1D_DGBR2_AD_HB_btest.cpp.o
[ 94%] Built target ErrorOrder_1D_DGBR2_AD_HB_btest_OBJECT
Scanning dependencies of target ErrorOrder_1D_DGBR2_AD_HB_btest_build
[ 94%] Linking CXX executable ErrorOrder_1D_DGBR2_AD_HB_btest
[ 94%] Built target ErrorOrder_1D_DGBR2_AD_HB_btest_build
Scanning dependencies of target ErrorOrder_3D_DGBR2_Periodic_Hex_AD_btest_build_vera
[ 94%] Checking style of test/system/Asymptotic/ErrorOrder_3D_DGBR2_Periodic_Hex_AD_btest.cpp
[ 94%] Built target ErrorOrder_3D_DGBR2_Periodic_Hex_AD_btest_build_vera
Scanning dependencies of target ErrorOrder_3D_DGBR2_Periodic_Hex_AD_btest_OBJECT
[ 94%] Building CXX object test/system/Asymptotic/CMakeFiles/ErrorOrder_3D_DGBR2_Periodic_Hex_AD_btest_OBJECT.dir/ErrorOrder_3D_DGBR2_Periodic_Hex_AD_btest.cpp.o
[ 94%] Built target ErrorOrder_3D_DGBR2_Periodic_Hex_AD_btest_OBJECT
Scanning dependencies of target ErrorOrder_3D_DGBR2_Periodic_Hex_AD_btest_build
[ 94%] Linking CXX executable ErrorOrder_3D_DGBR2_Periodic_Hex_AD_btest
[ 94%] Built target ErrorOrder_3D_DGBR2_Periodic_Hex_AD_btest_build
Scanning dependencies of target Adjoint2D_DGBR2_Triangle_AD_btest_build_vera
[ 94%] Checking style of test/system/Asymptotic/Adjoint2D_DGBR2_Triangle_AD_btest.cpp
[ 94%] Built target Adjoint2D_DGBR2_Triangle_AD_btest_build_vera
Scanning dependencies of target Adjoint2D_DGBR2_Triangle_AD_btest_OBJECT
[ 94%] Building CXX object test/system/Asymptotic/CMakeFiles/Adjoint2D_DGBR2_Triangle_AD_btest_OBJECT.dir/Adjoint2D_DGBR2_Triangle_AD_btest.cpp.o
[ 94%] Built target Adjoint2D_DGBR2_Triangle_AD_btest_OBJECT
Scanning dependencies of target Adjoint2D_DGBR2_Triangle_AD_btest_build
[ 94%] Linking CXX executable Adjoint2D_DGBR2_Triangle_AD_btest
[ 94%] Built target Adjoint2D_DGBR2_Triangle_AD_btest_build
Scanning dependencies of target ErrorEstimateOrder_3D_CG_Tet_AD_btest_build_vera
[ 94%] Checking style of test/system/Asymptotic/ErrorEstimateOrder_3D_CG_Tet_AD_btest.cpp
[ 94%] Built target ErrorEstimateOrder_3D_CG_Tet_AD_btest_build_vera
Scanning dependencies of target ErrorEstimateOrder_3D_CG_Tet_AD_btest_OBJECT
[ 94%] Building CXX object test/system/Asymptotic/CMakeFiles/ErrorEstimateOrder_3D_CG_Tet_AD_btest_OBJECT.dir/ErrorEstimateOrder_3D_CG_Tet_AD_btest.cpp.o
[ 94%] Built target ErrorEstimateOrder_3D_CG_Tet_AD_btest_OBJECT
Scanning dependencies of target ErrorEstimateOrder_3D_CG_Tet_AD_btest_build
[ 94%] Linking CXX executable ErrorEstimateOrder_3D_CG_Tet_AD_btest
[ 94%] Built target ErrorEstimateOrder_3D_CG_Tet_AD_btest_build
Scanning dependencies of target ErrorOrder_1D_CG_AD_btest_build_vera
[ 94%] Checking style of test/system/Asymptotic/ErrorOrder_1D_CG_AD_btest.cpp
[ 94%] Built target ErrorOrder_1D_CG_AD_btest_build_vera
Scanning dependencies of target ErrorOrder_1D_CG_AD_btest_OBJECT
[ 94%] Building CXX object test/system/Asymptotic/CMakeFiles/ErrorOrder_1D_CG_AD_btest_OBJECT.dir/ErrorOrder_1D_CG_AD_btest.cpp.o
[ 94%] Built target ErrorOrder_1D_CG_AD_btest_OBJECT
Scanning dependencies of target ErrorOrder_1D_CG_AD_btest_build
[ 94%] Linking CXX executable ErrorOrder_1D_CG_AD_btest
[ 94%] Built target ErrorOrder_1D_CG_AD_btest_build
Scanning dependencies of target Adjoint2D_CG_Triangle_AD_btest_build_vera
[ 94%] Checking style of test/system/Asymptotic/Adjoint2D_CG_Triangle_AD_btest.cpp
[ 94%] Built target Adjoint2D_CG_Triangle_AD_btest_build_vera
Scanning dependencies of target Adjoint2D_CG_Triangle_AD_btest_OBJECT
[ 94%] Building CXX object test/system/Asymptotic/CMakeFiles/Adjoint2D_CG_Triangle_AD_btest_OBJECT.dir/Adjoint2D_CG_Triangle_AD_btest.cpp.o
[ 94%] Built target Adjoint2D_CG_Triangle_AD_btest_OBJECT
Scanning dependencies of target Adjoint2D_CG_Triangle_AD_btest_build
[ 94%] Linking CXX executable Adjoint2D_CG_Triangle_AD_btest
[ 94%] Built target Adjoint2D_CG_Triangle_AD_btest_build
Scanning dependencies of target ErrorOrder_2D_DGBR2_Triangle_AD_btest_OBJECT
[ 94%] Building CXX object test/system/Asymptotic/CMakeFiles/ErrorOrder_2D_DGBR2_Triangle_AD_btest_OBJECT.dir/ErrorOrder_2D_DGBR2_Triangle_AD_btest.cpp.o
[ 94%] Built target ErrorOrder_2D_DGBR2_Triangle_AD_btest_OBJECT
Scanning dependencies of target ErrorOrder_2D_DGBR2_Triangle_AD_btest_build_vera
[ 94%] Checking style of test/system/Asymptotic/ErrorOrder_2D_DGBR2_Triangle_AD_btest.cpp
[ 94%] Built target ErrorOrder_2D_DGBR2_Triangle_AD_btest_build_vera
Scanning dependencies of target ErrorOrder_2D_DGBR2_Triangle_AD_btest_build
[ 94%] Linking CXX executable ErrorOrder_2D_DGBR2_Triangle_AD_btest
[ 94%] Built target ErrorOrder_2D_DGBR2_Triangle_AD_btest_build
Scanning dependencies of target ErrorOrder_2D_DGBR2_RANS_MMS_btest_OBJECT
[ 94%] Building CXX object test/system/Asymptotic/CMakeFiles/ErrorOrder_2D_DGBR2_RANS_MMS_btest_OBJECT.dir/ErrorOrder_2D_DGBR2_RANS_MMS_btest.cpp.o
[ 94%] Built target ErrorOrder_2D_DGBR2_RANS_MMS_btest_OBJECT
Scanning dependencies of target ErrorOrder_2D_DGBR2_RANS_MMS_btest_build_vera
[ 94%] Checking style of test/system/Asymptotic/ErrorOrder_2D_DGBR2_RANS_MMS_btest.cpp
[ 94%] Built target ErrorOrder_2D_DGBR2_RANS_MMS_btest_build_vera
Scanning dependencies of target ErrorOrder_2D_DGBR2_RANS_MMS_btest_build
[ 94%] Linking CXX executable ErrorOrder_2D_DGBR2_RANS_MMS_btest
[ 94%] Built target ErrorOrder_2D_DGBR2_RANS_MMS_btest_build
Scanning dependencies of target Adjoint2D_HDG_Triangle_AD_sansLG_btest_build_vera
[ 94%] Checking style of test/system/Asymptotic/Adjoint2D_HDG_Triangle_AD_sansLG_btest.cpp
[ 94%] Built target Adjoint2D_HDG_Triangle_AD_sansLG_btest_build_vera
Scanning dependencies of target Adjoint2D_HDG_Triangle_AD_sansLG_btest_OBJECT
[ 94%] Building CXX object test/system/Asymptotic/CMakeFiles/Adjoint2D_HDG_Triangle_AD_sansLG_btest_OBJECT.dir/Adjoint2D_HDG_Triangle_AD_sansLG_btest.cpp.o
[ 94%] Built target Adjoint2D_HDG_Triangle_AD_sansLG_btest_OBJECT
Scanning dependencies of target Adjoint2D_HDG_Triangle_AD_sansLG_btest_build
[ 94%] Linking CXX executable Adjoint2D_HDG_Triangle_AD_sansLG_btest
[ 94%] Built target Adjoint2D_HDG_Triangle_AD_sansLG_btest_build
Scanning dependencies of target ErrorEstimateOrder_2D_DGAdvective_Triangle_AD_btest_OBJECT
[ 94%] Building CXX object test/system/Asymptotic/CMakeFiles/ErrorEstimateOrder_2D_DGAdvective_Triangle_AD_btest_OBJECT.dir/ErrorEstimateOrder_2D_DGAdvective_Triangle_AD_btest.cpp.o
[ 94%] Built target ErrorEstimateOrder_2D_DGAdvective_Triangle_AD_btest_OBJECT
Scanning dependencies of target ErrorEstimateOrder_2D_DGAdvective_Triangle_AD_btest_build_vera
[ 94%] Checking style of test/system/Asymptotic/ErrorEstimateOrder_2D_DGAdvective_Triangle_AD_btest.cpp
[ 94%] Built target ErrorEstimateOrder_2D_DGAdvective_Triangle_AD_btest_build_vera
Scanning dependencies of target ErrorEstimateOrder_2D_DGAdvective_Triangle_AD_btest_build
[ 94%] Linking CXX executable ErrorEstimateOrder_2D_DGAdvective_Triangle_AD_btest
[ 94%] Built target ErrorEstimateOrder_2D_DGAdvective_Triangle_AD_btest_build
Scanning dependencies of target ErrorOrder_3D_DGBR2_Tet_AD_btest_OBJECT
[ 94%] Building CXX object test/system/Asymptotic/CMakeFiles/ErrorOrder_3D_DGBR2_Tet_AD_btest_OBJECT.dir/ErrorOrder_3D_DGBR2_Tet_AD_btest.cpp.o
[ 94%] Built target ErrorOrder_3D_DGBR2_Tet_AD_btest_OBJECT
Scanning dependencies of target ErrorOrder_3D_DGBR2_Tet_AD_btest_build_vera
[ 94%] Checking style of test/system/Asymptotic/ErrorOrder_3D_DGBR2_Tet_AD_btest.cpp
[ 94%] Built target ErrorOrder_3D_DGBR2_Tet_AD_btest_build_vera
Scanning dependencies of target ErrorOrder_3D_DGBR2_Tet_AD_btest_build
[ 94%] Linking CXX executable ErrorOrder_3D_DGBR2_Tet_AD_btest
[ 94%] Built target ErrorOrder_3D_DGBR2_Tet_AD_btest_build
Scanning dependencies of target ErrorOrder_3D_CG_Tet_AD_btest_build_vera
[ 94%] Checking style of test/system/Asymptotic/ErrorOrder_3D_CG_Tet_AD_btest.cpp
[ 94%] Built target ErrorOrder_3D_CG_Tet_AD_btest_build_vera
Scanning dependencies of target ErrorOrder_3D_CG_Tet_AD_btest_OBJECT
[ 94%] Building CXX object test/system/Asymptotic/CMakeFiles/ErrorOrder_3D_CG_Tet_AD_btest_OBJECT.dir/ErrorOrder_3D_CG_Tet_AD_btest.cpp.o
[ 94%] Built target ErrorOrder_3D_CG_Tet_AD_btest_OBJECT
Scanning dependencies of target ErrorOrder_3D_CG_Tet_AD_btest_build
[ 94%] Linking CXX executable ErrorOrder_3D_CG_Tet_AD_btest
[ 94%] Built target ErrorOrder_3D_CG_Tet_AD_btest_build
Scanning dependencies of target ErrorOrder_3D_DGBR2_Sphere_Triangle_AD_btest_build_vera
[ 94%] Checking style of test/system/Asymptotic/ErrorOrder_3D_DGBR2_Sphere_Triangle_AD_btest.cpp
[ 94%] Built target ErrorOrder_3D_DGBR2_Sphere_Triangle_AD_btest_build_vera
Scanning dependencies of target ErrorOrder_3D_DGBR2_Sphere_Triangle_AD_btest_OBJECT
[ 94%] Building CXX object test/system/Asymptotic/CMakeFiles/ErrorOrder_3D_DGBR2_Sphere_Triangle_AD_btest_OBJECT.dir/ErrorOrder_3D_DGBR2_Sphere_Triangle_AD_btest.cpp.o
[ 94%] Built target ErrorOrder_3D_DGBR2_Sphere_Triangle_AD_btest_OBJECT
Scanning dependencies of target ErrorOrder_3D_DGBR2_Sphere_Triangle_AD_btest_build
[ 94%] Linking CXX executable ErrorOrder_3D_DGBR2_Sphere_Triangle_AD_btest
[ 94%] Built target ErrorOrder_3D_DGBR2_Sphere_Triangle_AD_btest_build
Scanning dependencies of target ErrorOrder_1D_DGBR2_Burgers_btest_build_vera
[ 94%] Checking style of test/system/Asymptotic/ErrorOrder_1D_DGBR2_Burgers_btest.cpp
[ 94%] Built target ErrorOrder_1D_DGBR2_Burgers_btest_build_vera
Scanning dependencies of target ErrorOrder_1D_DGBR2_Burgers_btest_OBJECT
[ 94%] Building CXX object test/system/Asymptotic/CMakeFiles/ErrorOrder_1D_DGBR2_Burgers_btest_OBJECT.dir/ErrorOrder_1D_DGBR2_Burgers_btest.cpp.o
[ 94%] Built target ErrorOrder_1D_DGBR2_Burgers_btest_OBJECT
Scanning dependencies of target ErrorOrder_1D_DGBR2_Burgers_btest_build
[ 94%] Linking CXX executable ErrorOrder_1D_DGBR2_Burgers_btest
[ 94%] Built target ErrorOrder_1D_DGBR2_Burgers_btest_build
Scanning dependencies of target Solve2D_DGAdvective_LinearRobin_mitLG_sansLG_Consistency_AD_btest_build_vera
[ 94%] Checking style of test/system/Asymptotic/Solve2D_DGAdvective_LinearRobin_mitLG_sansLG_Consistency_AD_btest.cpp
[ 94%] Built target Solve2D_DGAdvective_LinearRobin_mitLG_sansLG_Consistency_AD_btest_build_vera
Scanning dependencies of target Solve2D_DGAdvective_LinearRobin_mitLG_sansLG_Consistency_AD_btest_OBJECT
[ 94%] Building CXX object test/system/Asymptotic/CMakeFiles/Solve2D_DGAdvective_LinearRobin_mitLG_sansLG_Consistency_AD_btest_OBJECT.dir/Solve2D_DGAdvective_LinearRobin_mitLG_sansLG_Consistency_AD_btest.cpp.o
[ 94%] Built target Solve2D_DGAdvective_LinearRobin_mitLG_sansLG_Consistency_AD_btest_OBJECT
Scanning dependencies of target Solve2D_DGAdvective_LinearRobin_mitLG_sansLG_Consistency_AD_btest_build
[ 94%] Linking CXX executable Solve2D_DGAdvective_LinearRobin_mitLG_sansLG_Consistency_AD_btest
[ 94%] Built target Solve2D_DGAdvective_LinearRobin_mitLG_sansLG_Consistency_AD_btest_build
Scanning dependencies of target Adjoint2D_DGAdvective_Triangle_AD_btest_build_vera
[ 94%] Checking style of test/system/Asymptotic/Adjoint2D_DGAdvective_Triangle_AD_btest.cpp
[ 94%] Built target Adjoint2D_DGAdvective_Triangle_AD_btest_build_vera
Scanning dependencies of target Adjoint2D_DGAdvective_Triangle_AD_btest_OBJECT
[ 94%] Building CXX object test/system/Asymptotic/CMakeFiles/Adjoint2D_DGAdvective_Triangle_AD_btest_OBJECT.dir/Adjoint2D_DGAdvective_Triangle_AD_btest.cpp.o
[ 94%] Built target Adjoint2D_DGAdvective_Triangle_AD_btest_OBJECT
Scanning dependencies of target Adjoint2D_DGAdvective_Triangle_AD_btest_build
[ 94%] Linking CXX executable Adjoint2D_DGAdvective_Triangle_AD_btest
[ 94%] Built target Adjoint2D_DGAdvective_Triangle_AD_btest_build
Scanning dependencies of target ErrorOrder_4D_DG_Pentatope_btest_OBJECT
[ 94%] Building CXX object test/system/Asymptotic/CMakeFiles/ErrorOrder_4D_DG_Pentatope_btest_OBJECT.dir/ErrorOrder_4D_DG_Pentatope_btest.cpp.o
[ 94%] Built target ErrorOrder_4D_DG_Pentatope_btest_OBJECT
Scanning dependencies of target ErrorOrder_4D_DG_Pentatope_btest_build_vera
[ 94%] Checking style of test/system/Asymptotic/ErrorOrder_4D_DG_Pentatope_btest.cpp
[ 94%] Built target ErrorOrder_4D_DG_Pentatope_btest_build_vera
Scanning dependencies of target ErrorOrder_4D_DG_Pentatope_btest_build
[ 94%] Linking CXX executable ErrorOrder_4D_DG_Pentatope_btest
[ 94%] Built target ErrorOrder_4D_DG_Pentatope_btest_build
Scanning dependencies of target ErrorOrder_2D_EDG_Triangle_AD_btest_OBJECT
[ 94%] Building CXX object test/system/Asymptotic/CMakeFiles/ErrorOrder_2D_EDG_Triangle_AD_btest_OBJECT.dir/ErrorOrder_2D_EDG_Triangle_AD_btest.cpp.o
[ 94%] Built target ErrorOrder_2D_EDG_Triangle_AD_btest_OBJECT
Scanning dependencies of target ErrorOrder_2D_EDG_Triangle_AD_btest_build_vera
[ 94%] Checking style of test/system/Asymptotic/ErrorOrder_2D_EDG_Triangle_AD_btest.cpp
[ 94%] Built target ErrorOrder_2D_EDG_Triangle_AD_btest_build_vera
Scanning dependencies of target ErrorOrder_2D_EDG_Triangle_AD_btest_build
[ 94%] Linking CXX executable ErrorOrder_2D_EDG_Triangle_AD_btest
[ 94%] Built target ErrorOrder_2D_EDG_Triangle_AD_btest_build
Scanning dependencies of target ErrorEstimateOrder_1D_CG_Line_AD_btest_OBJECT
[ 94%] Building CXX object test/system/Asymptotic/CMakeFiles/ErrorEstimateOrder_1D_CG_Line_AD_btest_OBJECT.dir/ErrorEstimateOrder_1D_CG_Line_AD_btest.cpp.o
[ 94%] Built target ErrorEstimateOrder_1D_CG_Line_AD_btest_OBJECT
Scanning dependencies of target ErrorEstimateOrder_1D_CG_Line_AD_btest_build_vera
[ 94%] Checking style of test/system/Asymptotic/ErrorEstimateOrder_1D_CG_Line_AD_btest.cpp
[ 94%] Built target ErrorEstimateOrder_1D_CG_Line_AD_btest_build_vera
Scanning dependencies of target ErrorEstimateOrder_1D_CG_Line_AD_btest_build
[ 94%] Linking CXX executable ErrorEstimateOrder_1D_CG_Line_AD_btest
[ 94%] Built target ErrorEstimateOrder_1D_CG_Line_AD_btest_build
Scanning dependencies of target ErrorEstimateOrder_2D_HDG_Triangle_AD_btest_build_vera
[ 94%] Checking style of test/system/Asymptotic/ErrorEstimateOrder_2D_HDG_Triangle_AD_btest.cpp
[ 94%] Built target ErrorEstimateOrder_2D_HDG_Triangle_AD_btest_build_vera
Scanning dependencies of target ErrorEstimateOrder_2D_HDG_Triangle_AD_btest_OBJECT
[ 94%] Building CXX object test/system/Asymptotic/CMakeFiles/ErrorEstimateOrder_2D_HDG_Triangle_AD_btest_OBJECT.dir/ErrorEstimateOrder_2D_HDG_Triangle_AD_btest.cpp.o
[ 94%] Built target ErrorEstimateOrder_2D_HDG_Triangle_AD_btest_OBJECT
Scanning dependencies of target ErrorEstimateOrder_2D_HDG_Triangle_AD_btest_build
[ 94%] Linking CXX executable ErrorEstimateOrder_2D_HDG_Triangle_AD_btest
[ 94%] Built target ErrorEstimateOrder_2D_HDG_Triangle_AD_btest_build
Scanning dependencies of target ErrorOrder_1D_HDG_Burgers_btest_OBJECT
[ 94%] Building CXX object test/system/Asymptotic/CMakeFiles/ErrorOrder_1D_HDG_Burgers_btest_OBJECT.dir/ErrorOrder_1D_HDG_Burgers_btest.cpp.o
[ 94%] Built target ErrorOrder_1D_HDG_Burgers_btest_OBJECT
Scanning dependencies of target ErrorOrder_1D_HDG_Burgers_btest_build_vera
[ 94%] Checking style of test/system/Asymptotic/ErrorOrder_1D_HDG_Burgers_btest.cpp
[ 94%] Built target ErrorOrder_1D_HDG_Burgers_btest_build_vera
Scanning dependencies of target ErrorOrder_1D_HDG_Burgers_btest_build
[ 94%] Linking CXX executable ErrorOrder_1D_HDG_Burgers_btest
[ 94%] Built target ErrorOrder_1D_HDG_Burgers_btest_build
Scanning dependencies of target ErrorOrder_1D_DGBR2_TwoPhase_ST_btest_build_vera
[ 94%] Checking style of test/system/Asymptotic/ErrorOrder_1D_DGBR2_TwoPhase_ST_btest.cpp
[ 94%] Built target ErrorOrder_1D_DGBR2_TwoPhase_ST_btest_build_vera
Scanning dependencies of target ErrorOrder_1D_DGBR2_TwoPhase_ST_btest_OBJECT
[ 94%] Building CXX object test/system/Asymptotic/CMakeFiles/ErrorOrder_1D_DGBR2_TwoPhase_ST_btest_OBJECT.dir/ErrorOrder_1D_DGBR2_TwoPhase_ST_btest.cpp.o
[ 94%] Built target ErrorOrder_1D_DGBR2_TwoPhase_ST_btest_OBJECT
Scanning dependencies of target ErrorOrder_1D_DGBR2_TwoPhase_ST_btest_build
[ 94%] Linking CXX executable ErrorOrder_1D_DGBR2_TwoPhase_ST_btest
[ 94%] Built target ErrorOrder_1D_DGBR2_TwoPhase_ST_btest_build
Scanning dependencies of target Adjoint1D_DGBR2_BuckleyLeverett_ST_btest_build_vera
[ 94%] Checking style of test/system/Asymptotic/Adjoint1D_DGBR2_BuckleyLeverett_ST_btest.cpp
[ 94%] Built target Adjoint1D_DGBR2_BuckleyLeverett_ST_btest_build_vera
Scanning dependencies of target Adjoint1D_DGBR2_BuckleyLeverett_ST_btest_OBJECT
[ 94%] Building CXX object test/system/Asymptotic/CMakeFiles/Adjoint1D_DGBR2_BuckleyLeverett_ST_btest_OBJECT.dir/Adjoint1D_DGBR2_BuckleyLeverett_ST_btest.cpp.o
[ 94%] Built target Adjoint1D_DGBR2_BuckleyLeverett_ST_btest_OBJECT
Scanning dependencies of target Adjoint1D_DGBR2_BuckleyLeverett_ST_btest_build
[ 94%] Linking CXX executable Adjoint1D_DGBR2_BuckleyLeverett_ST_btest
[ 94%] Built target Adjoint1D_DGBR2_BuckleyLeverett_ST_btest_build
Scanning dependencies of target ErrorOrder_3D_CG_Sphere_Triangle_AD_btest_build_vera
[ 94%] Checking style of test/system/Asymptotic/ErrorOrder_3D_CG_Sphere_Triangle_AD_btest.cpp
[ 94%] Built target ErrorOrder_3D_CG_Sphere_Triangle_AD_btest_build_vera
Scanning dependencies of target ErrorOrder_3D_CG_Sphere_Triangle_AD_btest_OBJECT
[ 94%] Building CXX object test/system/Asymptotic/CMakeFiles/ErrorOrder_3D_CG_Sphere_Triangle_AD_btest_OBJECT.dir/ErrorOrder_3D_CG_Sphere_Triangle_AD_btest.cpp.o
[ 94%] Built target ErrorOrder_3D_CG_Sphere_Triangle_AD_btest_OBJECT
Scanning dependencies of target ErrorOrder_3D_CG_Sphere_Triangle_AD_btest_build
[ 94%] Linking CXX executable ErrorOrder_3D_CG_Sphere_Triangle_AD_btest
[ 94%] Built target ErrorOrder_3D_CG_Sphere_Triangle_AD_btest_build
Scanning dependencies of target ErrorOrder_1D_HDG_AD_btest_build_vera
[ 94%] Checking style of test/system/Asymptotic/ErrorOrder_1D_HDG_AD_btest.cpp
[ 94%] Built target ErrorOrder_1D_HDG_AD_btest_build_vera
Scanning dependencies of target ErrorOrder_1D_HDG_AD_btest_OBJECT
[ 94%] Building CXX object test/system/Asymptotic/CMakeFiles/ErrorOrder_1D_HDG_AD_btest_OBJECT.dir/ErrorOrder_1D_HDG_AD_btest.cpp.o
[ 94%] Built target ErrorOrder_1D_HDG_AD_btest_OBJECT
Scanning dependencies of target ErrorOrder_1D_HDG_AD_btest_build
[ 94%] Linking CXX executable ErrorOrder_1D_HDG_AD_btest
[ 94%] Built target ErrorOrder_1D_HDG_AD_btest_build
Scanning dependencies of target ErrorOrder_1D_HDG_AD_BDF_btest_build_vera
[ 94%] Checking style of test/system/Asymptotic/ErrorOrder_1D_HDG_AD_BDF_btest.cpp
[ 94%] Built target ErrorOrder_1D_HDG_AD_BDF_btest_build_vera
Scanning dependencies of target ErrorOrder_1D_HDG_AD_BDF_btest_OBJECT
[ 94%] Building CXX object test/system/Asymptotic/CMakeFiles/ErrorOrder_1D_HDG_AD_BDF_btest_OBJECT.dir/ErrorOrder_1D_HDG_AD_BDF_btest.cpp.o
[ 94%] Built target ErrorOrder_1D_HDG_AD_BDF_btest_OBJECT
Scanning dependencies of target ErrorOrder_1D_HDG_AD_BDF_btest_build
[ 94%] Linking CXX executable ErrorOrder_1D_HDG_AD_BDF_btest
[ 94%] Built target ErrorOrder_1D_HDG_AD_BDF_btest_build
Scanning dependencies of target ErrorOrder_1D_DGBR2_AD_BDF_btest_build_vera
[ 94%] Checking style of test/system/Asymptotic/ErrorOrder_1D_DGBR2_AD_BDF_btest.cpp
[ 94%] Built target ErrorOrder_1D_DGBR2_AD_BDF_btest_build_vera
Scanning dependencies of target ErrorOrder_1D_DGBR2_AD_BDF_btest_OBJECT
[ 94%] Building CXX object test/system/Asymptotic/CMakeFiles/ErrorOrder_1D_DGBR2_AD_BDF_btest_OBJECT.dir/ErrorOrder_1D_DGBR2_AD_BDF_btest.cpp.o
[ 94%] Built target ErrorOrder_1D_DGBR2_AD_BDF_btest_OBJECT
Scanning dependencies of target ErrorOrder_1D_DGBR2_AD_BDF_btest_build
[ 94%] Linking CXX executable ErrorOrder_1D_DGBR2_AD_BDF_btest
[ 94%] Built target ErrorOrder_1D_DGBR2_AD_BDF_btest_build
Scanning dependencies of target ErrorOrder_1D_HDGAdvective_Advection_btest_build_vera
[ 94%] Checking style of test/system/Asymptotic/ErrorOrder_1D_HDGAdvective_Advection_btest.cpp
[ 94%] Built target ErrorOrder_1D_HDGAdvective_Advection_btest_build_vera
Scanning dependencies of target ErrorOrder_1D_HDGAdvective_Advection_btest_OBJECT
[ 94%] Building CXX object test/system/Asymptotic/CMakeFiles/ErrorOrder_1D_HDGAdvective_Advection_btest_OBJECT.dir/ErrorOrder_1D_HDGAdvective_Advection_btest.cpp.o
[ 94%] Built target ErrorOrder_1D_HDGAdvective_Advection_btest_OBJECT
Scanning dependencies of target ErrorOrder_1D_HDGAdvective_Advection_btest_build
[ 94%] Linking CXX executable ErrorOrder_1D_HDGAdvective_Advection_btest
[ 94%] Built target ErrorOrder_1D_HDGAdvective_Advection_btest_build
Scanning dependencies of target ErrorEstimateOrder_2D_CG_Triangle_AD_btest_OBJECT
[ 94%] Building CXX object test/system/Asymptotic/CMakeFiles/ErrorEstimateOrder_2D_CG_Triangle_AD_btest_OBJECT.dir/ErrorEstimateOrder_2D_CG_Triangle_AD_btest.cpp.o
[ 94%] Built target ErrorEstimateOrder_2D_CG_Triangle_AD_btest_OBJECT
Scanning dependencies of target ErrorEstimateOrder_2D_CG_Triangle_AD_btest_build_vera
[ 94%] Checking style of test/system/Asymptotic/ErrorEstimateOrder_2D_CG_Triangle_AD_btest.cpp
[ 94%] Built target ErrorEstimateOrder_2D_CG_Triangle_AD_btest_build_vera
Scanning dependencies of target ErrorEstimateOrder_2D_CG_Triangle_AD_btest_build
[ 94%] Linking CXX executable ErrorEstimateOrder_2D_CG_Triangle_AD_btest
[ 94%] Built target ErrorEstimateOrder_2D_CG_Triangle_AD_btest_build
Scanning dependencies of target ErrorOrder_1D_CG_AD_BDF_btest_OBJECT
[ 94%] Building CXX object test/system/Asymptotic/CMakeFiles/ErrorOrder_1D_CG_AD_BDF_btest_OBJECT.dir/ErrorOrder_1D_CG_AD_BDF_btest.cpp.o
[ 94%] Built target ErrorOrder_1D_CG_AD_BDF_btest_OBJECT
Scanning dependencies of target ErrorOrder_1D_CG_AD_BDF_btest_build_vera
[ 94%] Checking style of test/system/Asymptotic/ErrorOrder_1D_CG_AD_BDF_btest.cpp
[ 94%] Built target ErrorOrder_1D_CG_AD_BDF_btest_build_vera
Scanning dependencies of target ErrorOrder_1D_CG_AD_BDF_btest_build
[ 94%] Linking CXX executable ErrorOrder_1D_CG_AD_BDF_btest
[ 94%] Built target ErrorOrder_1D_CG_AD_BDF_btest_build
Scanning dependencies of target ErrorEstimateOrder_1D_DGBR2_Line_AD_btest_build_vera
[ 94%] Checking style of test/system/Asymptotic/ErrorEstimateOrder_1D_DGBR2_Line_AD_btest.cpp
[ 94%] Built target ErrorEstimateOrder_1D_DGBR2_Line_AD_btest_build_vera
Scanning dependencies of target ErrorEstimateOrder_1D_DGBR2_Line_AD_btest_OBJECT
[ 94%] Building CXX object test/system/Asymptotic/CMakeFiles/ErrorEstimateOrder_1D_DGBR2_Line_AD_btest_OBJECT.dir/ErrorEstimateOrder_1D_DGBR2_Line_AD_btest.cpp.o
[ 94%] Built target ErrorEstimateOrder_1D_DGBR2_Line_AD_btest_OBJECT
Scanning dependencies of target ErrorEstimateOrder_1D_DGBR2_Line_AD_btest_build
[ 94%] Linking CXX executable ErrorEstimateOrder_1D_DGBR2_Line_AD_btest
[ 94%] Built target ErrorEstimateOrder_1D_DGBR2_Line_AD_btest_build
Scanning dependencies of target ErrorOrder_3D_CG_Hex_AD_btest_OBJECT
[ 94%] Building CXX object test/system/Asymptotic/CMakeFiles/ErrorOrder_3D_CG_Hex_AD_btest_OBJECT.dir/ErrorOrder_3D_CG_Hex_AD_btest.cpp.o
[ 94%] Built target ErrorOrder_3D_CG_Hex_AD_btest_OBJECT
Scanning dependencies of target ErrorOrder_3D_CG_Hex_AD_btest_build_vera
[ 94%] Checking style of test/system/Asymptotic/ErrorOrder_3D_CG_Hex_AD_btest.cpp
[ 94%] Built target ErrorOrder_3D_CG_Hex_AD_btest_build_vera
Scanning dependencies of target ErrorOrder_3D_CG_Hex_AD_btest_build
[ 94%] Linking CXX executable ErrorOrder_3D_CG_Hex_AD_btest
[ 94%] Built target ErrorOrder_3D_CG_Hex_AD_btest_build
Scanning dependencies of target ErrorEstimateOrder_2D_CG_Nodal_Triangle_AD_btest_OBJECT
[ 94%] Building CXX object test/system/Asymptotic/CMakeFiles/ErrorEstimateOrder_2D_CG_Nodal_Triangle_AD_btest_OBJECT.dir/ErrorEstimateOrder_2D_CG_Nodal_Triangle_AD_btest.cpp.o
[ 94%] Built target ErrorEstimateOrder_2D_CG_Nodal_Triangle_AD_btest_OBJECT
Scanning dependencies of target ErrorEstimateOrder_2D_CG_Nodal_Triangle_AD_btest_build_vera
[ 94%] Checking style of test/system/Asymptotic/ErrorEstimateOrder_2D_CG_Nodal_Triangle_AD_btest.cpp
[ 94%] Built target ErrorEstimateOrder_2D_CG_Nodal_Triangle_AD_btest_build_vera
Scanning dependencies of target ErrorEstimateOrder_2D_CG_Nodal_Triangle_AD_btest_build
[ 94%] Linking CXX executable ErrorEstimateOrder_2D_CG_Nodal_Triangle_AD_btest
[ 94%] Built target ErrorEstimateOrder_2D_CG_Nodal_Triangle_AD_btest_build
Scanning dependencies of target ErrorOrder_2D_DGAdvective_Flat_Line_AD_btest_OBJECT
[ 94%] Building CXX object test/system/Asymptotic/CMakeFiles/ErrorOrder_2D_DGAdvective_Flat_Line_AD_btest_OBJECT.dir/ErrorOrder_2D_DGAdvective_Flat_Line_AD_btest.cpp.o
[ 94%] Built target ErrorOrder_2D_DGAdvective_Flat_Line_AD_btest_OBJECT
Scanning dependencies of target ErrorOrder_2D_DGAdvective_Flat_Line_AD_btest_build_vera
[ 94%] Checking style of test/system/Asymptotic/ErrorOrder_2D_DGAdvective_Flat_Line_AD_btest.cpp
[ 94%] Built target ErrorOrder_2D_DGAdvective_Flat_Line_AD_btest_build_vera
Scanning dependencies of target ErrorOrder_2D_DGAdvective_Flat_Line_AD_btest_build
[ 94%] Linking CXX executable ErrorOrder_2D_DGAdvective_Flat_Line_AD_btest
[ 94%] Built target ErrorOrder_2D_DGAdvective_Flat_Line_AD_btest_build
Scanning dependencies of target ErrorOrder_1D_DGBR2_AD_btest_OBJECT
[ 94%] Building CXX object test/system/Asymptotic/CMakeFiles/ErrorOrder_1D_DGBR2_AD_btest_OBJECT.dir/ErrorOrder_1D_DGBR2_AD_btest.cpp.o
[ 94%] Built target ErrorOrder_1D_DGBR2_AD_btest_OBJECT
Scanning dependencies of target ErrorOrder_1D_DGBR2_AD_btest_build_vera
[ 94%] Checking style of test/system/Asymptotic/ErrorOrder_1D_DGBR2_AD_btest.cpp
[ 94%] Built target ErrorOrder_1D_DGBR2_AD_btest_build_vera
Scanning dependencies of target ErrorOrder_1D_DGBR2_AD_btest_build
[ 94%] Linking CXX executable ErrorOrder_1D_DGBR2_AD_btest
[ 94%] Built target ErrorOrder_1D_DGBR2_AD_btest_build
Scanning dependencies of target ErrorOrder_2D_HDG_Triangle_AD_btest_build_vera
[ 94%] Checking style of test/system/Asymptotic/ErrorOrder_2D_HDG_Triangle_AD_btest.cpp
[ 94%] Built target ErrorOrder_2D_HDG_Triangle_AD_btest_build_vera
Scanning dependencies of target ErrorOrder_2D_HDG_Triangle_AD_btest_OBJECT
[ 94%] Building CXX object test/system/Asymptotic/CMakeFiles/ErrorOrder_2D_HDG_Triangle_AD_btest_OBJECT.dir/ErrorOrder_2D_HDG_Triangle_AD_btest.cpp.o
[ 94%] Built target ErrorOrder_2D_HDG_Triangle_AD_btest_OBJECT
Scanning dependencies of target ErrorOrder_2D_HDG_Triangle_AD_btest_build
[ 94%] Linking CXX executable ErrorOrder_2D_HDG_Triangle_AD_btest
[ 94%] Built target ErrorOrder_2D_HDG_Triangle_AD_btest_build
Scanning dependencies of target ErrorOrder_2D_DGAdvective_Annulus_Triangle_btest_OBJECT
[ 94%] Building CXX object test/system/Asymptotic/CMakeFiles/ErrorOrder_2D_DGAdvective_Annulus_Triangle_btest_OBJECT.dir/ErrorOrder_2D_DGAdvective_Annulus_Triangle_btest.cpp.o
[ 94%] Built target ErrorOrder_2D_DGAdvective_Annulus_Triangle_btest_OBJECT
Scanning dependencies of target ErrorOrder_2D_DGAdvective_Annulus_Triangle_btest_build_vera
[ 94%] Checking style of test/system/Asymptotic/ErrorOrder_2D_DGAdvective_Annulus_Triangle_btest.cpp
[ 94%] Built target ErrorOrder_2D_DGAdvective_Annulus_Triangle_btest_build_vera
Scanning dependencies of target ErrorOrder_2D_DGAdvective_Annulus_Triangle_btest_build
[ 94%] Linking CXX executable ErrorOrder_2D_DGAdvective_Annulus_Triangle_btest
[ 94%] Built target ErrorOrder_2D_DGAdvective_Annulus_Triangle_btest_build
Scanning dependencies of target ErrorOrder_2D_DGAdvective_Circle_Line_AD_btest_OBJECT
[ 94%] Building CXX object test/system/Asymptotic/CMakeFiles/ErrorOrder_2D_DGAdvective_Circle_Line_AD_btest_OBJECT.dir/ErrorOrder_2D_DGAdvective_Circle_Line_AD_btest.cpp.o
[ 94%] Built target ErrorOrder_2D_DGAdvective_Circle_Line_AD_btest_OBJECT
Scanning dependencies of target ErrorOrder_2D_DGAdvective_Circle_Line_AD_btest_build_vera
[ 94%] Checking style of test/system/Asymptotic/ErrorOrder_2D_DGAdvective_Circle_Line_AD_btest.cpp
[ 94%] Built target ErrorOrder_2D_DGAdvective_Circle_Line_AD_btest_build_vera
Scanning dependencies of target ErrorOrder_2D_DGAdvective_Circle_Line_AD_btest_build
[ 94%] Linking CXX executable ErrorOrder_2D_DGAdvective_Circle_Line_AD_btest
[ 94%] Built target ErrorOrder_2D_DGAdvective_Circle_Line_AD_btest_build
Scanning dependencies of target ErrorEstimateOrder_2D_CG_Triangle_RD_btest_OBJECT
[ 94%] Building CXX object test/system/Asymptotic/CMakeFiles/ErrorEstimateOrder_2D_CG_Triangle_RD_btest_OBJECT.dir/ErrorEstimateOrder_2D_CG_Triangle_RD_btest.cpp.o
[ 94%] Built target ErrorEstimateOrder_2D_CG_Triangle_RD_btest_OBJECT
Scanning dependencies of target ErrorEstimateOrder_2D_CG_Triangle_RD_btest_build_vera
[ 94%] Checking style of test/system/Asymptotic/ErrorEstimateOrder_2D_CG_Triangle_RD_btest.cpp
[ 94%] Built target ErrorEstimateOrder_2D_CG_Triangle_RD_btest_build_vera
Scanning dependencies of target ErrorEstimateOrder_2D_CG_Triangle_RD_btest_build
[ 94%] Linking CXX executable ErrorEstimateOrder_2D_CG_Triangle_RD_btest
[ 94%] Built target ErrorEstimateOrder_2D_CG_Triangle_RD_btest_build
Scanning dependencies of target ErrorOrder_2D_CG_Triangle_AD_btest_OBJECT
[ 94%] Building CXX object test/system/Asymptotic/CMakeFiles/ErrorOrder_2D_CG_Triangle_AD_btest_OBJECT.dir/ErrorOrder_2D_CG_Triangle_AD_btest.cpp.o
[ 94%] Built target ErrorOrder_2D_CG_Triangle_AD_btest_OBJECT
Scanning dependencies of target ErrorOrder_2D_CG_Triangle_AD_btest_build_vera
[ 94%] Checking style of test/system/Asymptotic/ErrorOrder_2D_CG_Triangle_AD_btest.cpp
[ 94%] Built target ErrorOrder_2D_CG_Triangle_AD_btest_build_vera
Scanning dependencies of target ErrorOrder_2D_CG_Triangle_AD_btest_build
[ 94%] Linking CXX executable ErrorOrder_2D_CG_Triangle_AD_btest
[ 94%] Built target ErrorOrder_2D_CG_Triangle_AD_btest_build
Scanning dependencies of target ErrorOrder_1D_DGBR2_BuckleyLeverett_ST_btest_build_vera
[ 94%] Checking style of test/system/Asymptotic/ErrorOrder_1D_DGBR2_BuckleyLeverett_ST_btest.cpp
[ 94%] Built target ErrorOrder_1D_DGBR2_BuckleyLeverett_ST_btest_build_vera
Scanning dependencies of target ErrorOrder_1D_DGBR2_BuckleyLeverett_ST_btest_OBJECT
[ 94%] Building CXX object test/system/Asymptotic/CMakeFiles/ErrorOrder_1D_DGBR2_BuckleyLeverett_ST_btest_OBJECT.dir/ErrorOrder_1D_DGBR2_BuckleyLeverett_ST_btest.cpp.o
[ 94%] Built target ErrorOrder_1D_DGBR2_BuckleyLeverett_ST_btest_OBJECT
Scanning dependencies of target ErrorOrder_1D_DGBR2_BuckleyLeverett_ST_btest_build
[ 94%] Linking CXX executable ErrorOrder_1D_DGBR2_BuckleyLeverett_ST_btest
[ 94%] Built target ErrorOrder_1D_DGBR2_BuckleyLeverett_ST_btest_build
Scanning dependencies of target ErrorOrder_2D_CG_Quad_AD_btest_build_vera
[ 94%] Checking style of test/system/Asymptotic/ErrorOrder_2D_CG_Quad_AD_btest.cpp
[ 94%] Built target ErrorOrder_2D_CG_Quad_AD_btest_build_vera
Scanning dependencies of target ErrorOrder_2D_CG_Quad_AD_btest_OBJECT
[ 94%] Building CXX object test/system/Asymptotic/CMakeFiles/ErrorOrder_2D_CG_Quad_AD_btest_OBJECT.dir/ErrorOrder_2D_CG_Quad_AD_btest.cpp.o
[ 94%] Built target ErrorOrder_2D_CG_Quad_AD_btest_OBJECT
Scanning dependencies of target ErrorOrder_2D_CG_Quad_AD_btest_build
[ 94%] Linking CXX executable ErrorOrder_2D_CG_Quad_AD_btest
[ 94%] Built target ErrorOrder_2D_CG_Quad_AD_btest_build
Scanning dependencies of target ErrorEstimateOrder_2D_DGBR2_Triangle_AD_btest_OBJECT
[ 94%] Building CXX object test/system/Asymptotic/CMakeFiles/ErrorEstimateOrder_2D_DGBR2_Triangle_AD_btest_OBJECT.dir/ErrorEstimateOrder_2D_DGBR2_Triangle_AD_btest.cpp.o
[ 94%] Built target ErrorEstimateOrder_2D_DGBR2_Triangle_AD_btest_OBJECT
Scanning dependencies of target ErrorEstimateOrder_2D_DGBR2_Triangle_AD_btest_build_vera
[ 94%] Checking style of test/system/Asymptotic/ErrorEstimateOrder_2D_DGBR2_Triangle_AD_btest.cpp
[ 94%] Built target ErrorEstimateOrder_2D_DGBR2_Triangle_AD_btest_build_vera
Scanning dependencies of target ErrorEstimateOrder_2D_DGBR2_Triangle_AD_btest_build
[ 94%] Linking CXX executable ErrorEstimateOrder_2D_DGBR2_Triangle_AD_btest
[ 94%] Built target ErrorEstimateOrder_2D_DGBR2_Triangle_AD_btest_build
Scanning dependencies of target ErrorOrder_2D_DGAdvective_Circle_Line_ShallowWater_btest_build_vera
[ 94%] Checking style of test/system/Asymptotic/ErrorOrder_2D_DGAdvective_Circle_Line_ShallowWater_btest.cpp
[ 94%] Built target ErrorOrder_2D_DGAdvective_Circle_Line_ShallowWater_btest_build_vera
Scanning dependencies of target ErrorOrder_2D_DGAdvective_Circle_Line_ShallowWater_btest_OBJECT
[ 94%] Building CXX object test/system/Asymptotic/CMakeFiles/ErrorOrder_2D_DGAdvective_Circle_Line_ShallowWater_btest_OBJECT.dir/ErrorOrder_2D_DGAdvective_Circle_Line_ShallowWater_btest.cpp.o
[ 94%] Built target ErrorOrder_2D_DGAdvective_Circle_Line_ShallowWater_btest_OBJECT
Scanning dependencies of target ErrorOrder_2D_DGAdvective_Circle_Line_ShallowWater_btest_build
[ 94%] Linking CXX executable ErrorOrder_2D_DGAdvective_Circle_Line_ShallowWater_btest
[ 94%] Built target ErrorOrder_2D_DGAdvective_Circle_Line_ShallowWater_btest_build
Scanning dependencies of target ErrorOrder_1D_DGAdvective_ShallowWater_btest_OBJECT
[ 94%] Building CXX object test/system/Asymptotic/CMakeFiles/ErrorOrder_1D_DGAdvective_ShallowWater_btest_OBJECT.dir/ErrorOrder_1D_DGAdvective_ShallowWater_btest.cpp.o
[ 94%] Built target ErrorOrder_1D_DGAdvective_ShallowWater_btest_OBJECT
Scanning dependencies of target ErrorOrder_1D_DGAdvective_ShallowWater_btest_build_vera
[ 94%] Checking style of test/system/Asymptotic/ErrorOrder_1D_DGAdvective_ShallowWater_btest.cpp
[ 94%] Built target ErrorOrder_1D_DGAdvective_ShallowWater_btest_build_vera
Scanning dependencies of target ErrorOrder_1D_DGAdvective_ShallowWater_btest_build
[ 94%] Linking CXX executable ErrorOrder_1D_DGAdvective_ShallowWater_btest
[ 94%] Built target ErrorOrder_1D_DGAdvective_ShallowWater_btest_build
Scanning dependencies of target LocalSolve1D_HDG_AD_btest_build_vera
[ 94%] Checking style of test/system/LocalSolve/LocalSolve1D_HDG_AD_btest.cpp
[ 94%] Built target LocalSolve1D_HDG_AD_btest_build_vera
[ 94%] Generating CXX unity source src/Discretization/cotire/BlockLib_CXX_unity.cxx
[ 94%] Generating CXX prefix source src/Discretization/cotire/BlockLib_CXX_prefix.cxx
[ 94%] Generating CXX prefix header src/Discretization/cotire/BlockLib_CXX_prefix.hxx
[ 94%] Building CXX precompiled header src/Discretization/cotire/BlockLib_CXX_prefix.hxx.gch
Scanning dependencies of target BlockLib
[ 94%] Building CXX object src/Discretization/CMakeFiles/BlockLib.dir/Block/AlgebraicEquationSet_Block2x2_Real_Real.cpp.o
[ 94%] Building CXX object src/Discretization/CMakeFiles/BlockLib.dir/Block/AlgebraicEquationSet_Block2x2_VecS3_Real.cpp.o
[ 94%] Building CXX object src/Discretization/CMakeFiles/BlockLib.dir/Block/AlgebraicEquationSet_Block2x2_VecS4_Real.cpp.o
[ 94%] Linking CXX static library libBlockLib.a
[ 94%] Built target BlockLib
Scanning dependencies of target BlockLinAlgLib_vera
[ 94%] Checking style of src/LinearAlgebra/BlockLinAlg/MatrixBlock_3x3.h
[ 94%] Checking style of src/LinearAlgebra/BlockLinAlg/MatrixBlock_2x2.h
[ 94%] Checking style of src/LinearAlgebra/BlockLinAlg/MatrixBlock_2x2_InverseLU.h
[ 94%] Checking style of src/LinearAlgebra/BlockLinAlg/MatrixBlock_2x2_Inverse.h
[ 94%] Checking style of src/LinearAlgebra/BlockLinAlg/BlockLinAlg_Type.h
[ 94%] Checking style of src/LinearAlgebra/BlockLinAlg/MatrixBlock_2x2_Decompose_LU.h
[ 94%] Checking style of src/LinearAlgebra/BlockLinAlg/VectorBlock_4.h
[ 94%] Checking style of src/LinearAlgebra/BlockLinAlg/MatrixBlock_2x2_Transpose.h
[ 94%] Checking style of src/LinearAlgebra/BlockLinAlg/MatrixBlock_2x2_InverseLUP.h
[ 94%] Checking style of src/LinearAlgebra/BlockLinAlg/MatrixBlock_4x4.h
[ 94%] Checking style of src/LinearAlgebra/BlockLinAlg/BlockLinAlg_Add.h
[ 94%] Checking style of src/LinearAlgebra/BlockLinAlg/BlockLinAlg_Mul.h
[ 94%] Checking style of src/LinearAlgebra/BlockLinAlg/MatrixBlock_2x2_Decompose_LUP.h
[ 94%] Checking style of src/LinearAlgebra/BlockLinAlg/VectorBlock_3.h
[ 94%] Checking style of src/LinearAlgebra/BlockLinAlg/VectorBlock_2.h
[ 94%] Checking style of src/LinearAlgebra/BlockLinAlg/MatrixBlock_2x2_InverseLUP.cpp
[ 94%] Checking style of src/LinearAlgebra/BlockLinAlg/MatrixBlock_2x2_Decompose_LUP.cpp
[ 94%] Checking style of src/LinearAlgebra/BlockLinAlg/MatrixBlock_2x2_Decompose_LU.cpp
[ 94%] Checking style of src/LinearAlgebra/BlockLinAlg/MatrixBlock_2x2_InverseLU.cpp
[ 94%] Built target BlockLinAlgLib_vera
[ 94%] Generating CXX unity source src/LinearAlgebra/BlockLinAlg/cotire/BlockLinAlgLib_CXX_unity.cxx
[ 94%] Generating CXX prefix source src/LinearAlgebra/BlockLinAlg/cotire/BlockLinAlgLib_CXX_prefix.cxx
[ 94%] Generating CXX prefix header src/LinearAlgebra/BlockLinAlg/cotire/BlockLinAlgLib_CXX_prefix.hxx
[ 94%] Building CXX precompiled header src/LinearAlgebra/BlockLinAlg/cotire/BlockLinAlgLib_CXX_prefix.hxx.gch
Scanning dependencies of target BlockLinAlgLib
[ 94%] Building CXX object src/LinearAlgebra/BlockLinAlg/CMakeFiles/BlockLinAlgLib.dir/MatrixBlock_2x2_Decompose_LU.cpp.o
[ 94%] Building CXX object src/LinearAlgebra/BlockLinAlg/CMakeFiles/BlockLinAlgLib.dir/MatrixBlock_2x2_Decompose_LUP.cpp.o
[ 94%] Building CXX object src/LinearAlgebra/BlockLinAlg/CMakeFiles/BlockLinAlgLib.dir/MatrixBlock_2x2_InverseLU.cpp.o
[ 94%] Building CXX object src/LinearAlgebra/BlockLinAlg/CMakeFiles/BlockLinAlgLib.dir/MatrixBlock_2x2_InverseLUP.cpp.o
[ 94%] Linking CXX static library libBlockLinAlgLib.a
[ 94%] Built target BlockLinAlgLib
Scanning dependencies of target pdeSensorLib_vera
[ 94%] Checking style of src/pde/Sensor/Sensor_ViscousFlux1D.h
[ 94%] Checking style of src/pde/Sensor/Source1D_JumpSensor.h
[ 94%] Checking style of src/pde/Sensor/BCSensorParameter2D.h
[ 94%] Checking style of src/pde/Sensor/Sensor_Source1D.h
[ 94%] Checking style of src/pde/Sensor/Source2D_JumpSensor.h
[ 94%] Checking style of src/pde/Sensor/Sensor_Source2D.h
[ 94%] Checking style of src/pde/Sensor/PDESensorParameter2D.h
[ 94%] Checking style of src/pde/Sensor/Sensor_AdvectiveFlux2D.h
[ 97%] Checking style of src/pde/Sensor/Sensor_ViscousFlux2D.h
[ 97%] Checking style of src/pde/Sensor/BCSensorParameter1D.h
[ 97%] Checking style of src/pde/Sensor/SensorParameter_Traits.h
[ 97%] Checking style of src/pde/Sensor/PDESensorParameter1D.h
[ 97%] Checking style of src/pde/Sensor/Sensor_AdvectiveFlux1D.h
[ 97%] Checking style of src/pde/Sensor/Sensor_ViscousFlux1D.cpp
[ 97%] Checking style of src/pde/Sensor/Sensor_ViscousFlux2D.cpp
[ 97%] Checking style of src/pde/Sensor/Sensor_AdvectiveFlux1D.cpp
[ 97%] Checking style of src/pde/Sensor/PDESensorParameter1D.cpp
[ 97%] Checking style of src/pde/Sensor/Sensor_AdvectiveFlux2D.cpp
[ 97%] Checking style of src/pde/Sensor/BCSensorParameter2D.cpp
[ 97%] Checking style of src/pde/Sensor/BCSensorParameter1D.cpp
[ 97%] Checking style of src/pde/Sensor/PDESensorParameter2D.cpp
[ 97%] Built target pdeSensorLib_vera
[ 97%] Generating CXX unity source src/pde/Sensor/cotire/pdeSensorLib_CXX_unity.cxx
[ 97%] Generating CXX prefix source src/pde/Sensor/cotire/pdeSensorLib_CXX_prefix.cxx
[ 97%] Generating CXX prefix header src/pde/Sensor/cotire/pdeSensorLib_CXX_prefix.hxx
[ 97%] Building CXX precompiled header src/pde/Sensor/cotire/pdeSensorLib_CXX_prefix.hxx.gch
Scanning dependencies of target pdeSensorLib
[ 97%] Building CXX object src/pde/Sensor/CMakeFiles/pdeSensorLib.dir/BCSensorParameter1D.cpp.o
[ 97%] Building CXX object src/pde/Sensor/CMakeFiles/pdeSensorLib.dir/BCSensorParameter2D.cpp.o
[ 97%] Building CXX object src/pde/Sensor/CMakeFiles/pdeSensorLib.dir/PDESensorParameter1D.cpp.o
[ 97%] Building CXX object src/pde/Sensor/CMakeFiles/pdeSensorLib.dir/PDESensorParameter2D.cpp.o
[ 97%] Building CXX object src/pde/Sensor/CMakeFiles/pdeSensorLib.dir/Sensor_AdvectiveFlux1D.cpp.o
[ 97%] Building CXX object src/pde/Sensor/CMakeFiles/pdeSensorLib.dir/Sensor_AdvectiveFlux2D.cpp.o
[ 97%] Building CXX object src/pde/Sensor/CMakeFiles/pdeSensorLib.dir/Sensor_ViscousFlux1D.cpp.o
[ 97%] Building CXX object src/pde/Sensor/CMakeFiles/pdeSensorLib.dir/Sensor_ViscousFlux2D.cpp.o
[ 97%] Linking CXX static library libpdeSensorLib.a
[ 97%] Built target pdeSensorLib
Scanning dependencies of target LocalSolve1D_HDG_AD_btest_OBJECT
[ 97%] Building CXX object test/system/LocalSolve/CMakeFiles/LocalSolve1D_HDG_AD_btest_OBJECT.dir/LocalSolve1D_HDG_AD_btest.cpp.o
[ 97%] Built target LocalSolve1D_HDG_AD_btest_OBJECT
Scanning dependencies of target LocalSolve1D_HDG_AD_btest_build
[ 97%] Linking CXX executable LocalSolve1D_HDG_AD_btest
[ 97%] Built target LocalSolve1D_HDG_AD_btest_build
Scanning dependencies of target LocalSolve1D_Split_HDG_AD_btest_build_vera
[ 97%] Checking style of test/system/LocalSolve/LocalSolve1D_Split_HDG_AD_btest.cpp
[ 97%] Built target LocalSolve1D_Split_HDG_AD_btest_build_vera
Scanning dependencies of target LocalSolve1D_Split_HDG_AD_btest_OBJECT
[ 97%] Building CXX object test/system/LocalSolve/CMakeFiles/LocalSolve1D_Split_HDG_AD_btest_OBJECT.dir/LocalSolve1D_Split_HDG_AD_btest.cpp.o
[ 97%] Built target LocalSolve1D_Split_HDG_AD_btest_OBJECT
Scanning dependencies of target LocalSolve1D_Split_HDG_AD_btest_build
[ 97%] Linking CXX executable LocalSolve1D_Split_HDG_AD_btest
[ 97%] Built target LocalSolve1D_Split_HDG_AD_btest_build
Scanning dependencies of target LocalSolve2D_Split_DGBR2_Triangle_AD_AV_btest_build_vera
[ 97%] Checking style of test/system/LocalSolve/LocalSolve2D_Split_DGBR2_Triangle_AD_AV_btest.cpp
[ 97%] Built target LocalSolve2D_Split_DGBR2_Triangle_AD_AV_btest_build_vera
Scanning dependencies of target LocalSolve2D_Split_DGBR2_Triangle_AD_AV_btest_OBJECT
[ 97%] Building CXX object test/system/LocalSolve/CMakeFiles/LocalSolve2D_Split_DGBR2_Triangle_AD_AV_btest_OBJECT.dir/LocalSolve2D_Split_DGBR2_Triangle_AD_AV_btest.cpp.o
[ 97%] Built target LocalSolve2D_Split_DGBR2_Triangle_AD_AV_btest_OBJECT
Scanning dependencies of target LocalSolve2D_Split_DGBR2_Triangle_AD_AV_btest_build
[ 97%] Linking CXX executable LocalSolve2D_Split_DGBR2_Triangle_AD_AV_btest
[ 97%] Built target LocalSolve2D_Split_DGBR2_Triangle_AD_AV_btest_build
Scanning dependencies of target LocalSolve1D_Split_DGBR2_AD_btest_build_vera
[ 97%] Checking style of test/system/LocalSolve/LocalSolve1D_Split_DGBR2_AD_btest.cpp
[ 97%] Built target LocalSolve1D_Split_DGBR2_AD_btest_build_vera
Scanning dependencies of target LocalSolve1D_Split_DGBR2_AD_btest_OBJECT
[ 97%] Building CXX object test/system/LocalSolve/CMakeFiles/LocalSolve1D_Split_DGBR2_AD_btest_OBJECT.dir/LocalSolve1D_Split_DGBR2_AD_btest.cpp.o
[ 97%] Built target LocalSolve1D_Split_DGBR2_AD_btest_OBJECT
Scanning dependencies of target LocalSolve1D_Split_DGBR2_AD_btest_build
[ 97%] Linking CXX executable LocalSolve1D_Split_DGBR2_AD_btest
[ 97%] Built target LocalSolve1D_Split_DGBR2_AD_btest_build
Scanning dependencies of target EdgeLocalSolve2D_Dual_Galerkin_Stabilized_Euler_btest_build_vera
[ 97%] Checking style of test/system/LocalSolve/EdgeLocalSolve2D_Dual_Galerkin_Stabilized_Euler_btest.cpp
[ 97%] Built target EdgeLocalSolve2D_Dual_Galerkin_Stabilized_Euler_btest_build_vera
Scanning dependencies of target EdgeLocalSolve2D_Dual_Galerkin_Stabilized_Euler_btest_OBJECT
[ 97%] Building CXX object test/system/LocalSolve/CMakeFiles/EdgeLocalSolve2D_Dual_Galerkin_Stabilized_Euler_btest_OBJECT.dir/EdgeLocalSolve2D_Dual_Galerkin_Stabilized_Euler_btest.cpp.o
[ 97%] Built target EdgeLocalSolve2D_Dual_Galerkin_Stabilized_Euler_btest_OBJECT
Scanning dependencies of target EdgeLocalSolve2D_Dual_Galerkin_Stabilized_Euler_btest_build
[ 97%] Linking CXX executable EdgeLocalSolve2D_Dual_Galerkin_Stabilized_Euler_btest
[ 97%] Built target EdgeLocalSolve2D_Dual_Galerkin_Stabilized_Euler_btest_build
Scanning dependencies of target ElementDualLocalSolve2D_Galerkin_Stabilized_Triangle_AD_btest_build_vera
[ 97%] Checking style of test/system/LocalSolve/ElementDualLocalSolve2D_Galerkin_Stabilized_Triangle_AD_btest.cpp
[ 97%] Built target ElementDualLocalSolve2D_Galerkin_Stabilized_Triangle_AD_btest_build_vera
Scanning dependencies of target ElementDualLocalSolve2D_Galerkin_Stabilized_Triangle_AD_btest_OBJECT
[ 97%] Building CXX object test/system/LocalSolve/CMakeFiles/ElementDualLocalSolve2D_Galerkin_Stabilized_Triangle_AD_btest_OBJECT.dir/ElementDualLocalSolve2D_Galerkin_Stabilized_Triangle_AD_btest.cpp.o
[ 97%] Built target ElementDualLocalSolve2D_Galerkin_Stabilized_Triangle_AD_btest_OBJECT
Scanning dependencies of target ElementDualLocalSolve2D_Galerkin_Stabilized_Triangle_AD_btest_build
[ 97%] Linking CXX executable ElementDualLocalSolve2D_Galerkin_Stabilized_Triangle_AD_btest
[ 97%] Built target ElementDualLocalSolve2D_Galerkin_Stabilized_Triangle_AD_btest_build
Scanning dependencies of target EdgeLocalSolve2D_Dual_Galerkin_Stabilized_AR_btest_OBJECT
[ 97%] Building CXX object test/system/LocalSolve/CMakeFiles/EdgeLocalSolve2D_Dual_Galerkin_Stabilized_AR_btest_OBJECT.dir/EdgeLocalSolve2D_Dual_Galerkin_Stabilized_AR_btest.cpp.o
[ 97%] Built target EdgeLocalSolve2D_Dual_Galerkin_Stabilized_AR_btest_OBJECT
Scanning dependencies of target EdgeLocalSolve2D_Dual_Galerkin_Stabilized_AR_btest_build_vera
[ 97%] Checking style of test/system/LocalSolve/EdgeLocalSolve2D_Dual_Galerkin_Stabilized_AR_btest.cpp
[ 97%] Built target EdgeLocalSolve2D_Dual_Galerkin_Stabilized_AR_btest_build_vera
Scanning dependencies of target EdgeLocalSolve2D_Dual_Galerkin_Stabilized_AR_btest_build
[ 97%] Linking CXX executable EdgeLocalSolve2D_Dual_Galerkin_Stabilized_AR_btest
[ 97%] Built target EdgeLocalSolve2D_Dual_Galerkin_Stabilized_AR_btest_build
Scanning dependencies of target AlgebraicEquationSet_Local_VMSD_Triangle_AD_btest_OBJECT
[ 97%] Building CXX object test/system/LocalSolve/CMakeFiles/AlgebraicEquationSet_Local_VMSD_Triangle_AD_btest_OBJECT.dir/AlgebraicEquationSet_Local_VMSD_Triangle_AD_btest.cpp.o
[ 97%] Built target AlgebraicEquationSet_Local_VMSD_Triangle_AD_btest_OBJECT
Scanning dependencies of target AlgebraicEquationSet_Local_VMSD_Triangle_AD_btest_build_vera
[ 97%] Checking style of test/system/LocalSolve/AlgebraicEquationSet_Local_VMSD_Triangle_AD_btest.cpp
[ 97%] Built target AlgebraicEquationSet_Local_VMSD_Triangle_AD_btest_build_vera
Scanning dependencies of target AlgebraicEquationSet_Local_VMSD_Triangle_AD_btest_build
[ 97%] Linking CXX executable AlgebraicEquationSet_Local_VMSD_Triangle_AD_btest
[ 97%] Built target AlgebraicEquationSet_Local_VMSD_Triangle_AD_btest_build
Scanning dependencies of target LocalSolve3D_HDG_Tet_AD_btest_build_vera
[ 97%] Checking style of test/system/LocalSolve/LocalSolve3D_HDG_Tet_AD_btest.cpp
[ 97%] Built target LocalSolve3D_HDG_Tet_AD_btest_build_vera
Scanning dependencies of target LocalSolve3D_HDG_Tet_AD_btest_OBJECT
[ 97%] Building CXX object test/system/LocalSolve/CMakeFiles/LocalSolve3D_HDG_Tet_AD_btest_OBJECT.dir/LocalSolve3D_HDG_Tet_AD_btest.cpp.o
[ 97%] Built target LocalSolve3D_HDG_Tet_AD_btest_OBJECT
Scanning dependencies of target LocalSolve3D_HDG_Tet_AD_btest_build
[ 97%] Linking CXX executable LocalSolve3D_HDG_Tet_AD_btest
[ 97%] Built target LocalSolve3D_HDG_Tet_AD_btest_build
Scanning dependencies of target ElementLocalSolve3D_DGBR2_Tet_AD_btest_build_vera
[ 97%] Checking style of test/system/LocalSolve/ElementLocalSolve3D_DGBR2_Tet_AD_btest.cpp
[ 97%] Built target ElementLocalSolve3D_DGBR2_Tet_AD_btest_build_vera
Scanning dependencies of target ElementLocalSolve3D_DGBR2_Tet_AD_btest_OBJECT
[ 97%] Building CXX object test/system/LocalSolve/CMakeFiles/ElementLocalSolve3D_DGBR2_Tet_AD_btest_OBJECT.dir/ElementLocalSolve3D_DGBR2_Tet_AD_btest.cpp.o
[ 97%] Built target ElementLocalSolve3D_DGBR2_Tet_AD_btest_OBJECT
Scanning dependencies of target ElementLocalSolve3D_DGBR2_Tet_AD_btest_build
[ 97%] Linking CXX executable ElementLocalSolve3D_DGBR2_Tet_AD_btest
[ 97%] Built target ElementLocalSolve3D_DGBR2_Tet_AD_btest_build
Scanning dependencies of target LocalSolve2D_HDG_Triangle_AD_btest_build_vera
[ 97%] Checking style of test/system/LocalSolve/LocalSolve2D_HDG_Triangle_AD_btest.cpp
[ 97%] Built target LocalSolve2D_HDG_Triangle_AD_btest_build_vera
Scanning dependencies of target LocalSolve2D_HDG_Triangle_AD_btest_OBJECT
[ 97%] Building CXX object test/system/LocalSolve/CMakeFiles/LocalSolve2D_HDG_Triangle_AD_btest_OBJECT.dir/LocalSolve2D_HDG_Triangle_AD_btest.cpp.o
[ 97%] Built target LocalSolve2D_HDG_Triangle_AD_btest_OBJECT
Scanning dependencies of target LocalSolve2D_HDG_Triangle_AD_btest_build
[ 97%] Linking CXX executable LocalSolve2D_HDG_Triangle_AD_btest
[ 97%] Built target LocalSolve2D_HDG_Triangle_AD_btest_build
Scanning dependencies of target EdgeLocalSolve3D_Dual_Galerkin_Stabilized_AD_btest_OBJECT
[ 97%] Building CXX object test/system/LocalSolve/CMakeFiles/EdgeLocalSolve3D_Dual_Galerkin_Stabilized_AD_btest_OBJECT.dir/EdgeLocalSolve3D_Dual_Galerkin_Stabilized_AD_btest.cpp.o
[ 97%] Built target EdgeLocalSolve3D_Dual_Galerkin_Stabilized_AD_btest_OBJECT
Scanning dependencies of target EdgeLocalSolve3D_Dual_Galerkin_Stabilized_AD_btest_build_vera
[ 97%] Checking style of test/system/LocalSolve/EdgeLocalSolve3D_Dual_Galerkin_Stabilized_AD_btest.cpp
[ 97%] Built target EdgeLocalSolve3D_Dual_Galerkin_Stabilized_AD_btest_build_vera
Scanning dependencies of target EdgeLocalSolve3D_Dual_Galerkin_Stabilized_AD_btest_build
[ 97%] Linking CXX executable EdgeLocalSolve3D_Dual_Galerkin_Stabilized_AD_btest
[ 97%] Built target EdgeLocalSolve3D_Dual_Galerkin_Stabilized_AD_btest_build
Scanning dependencies of target LocalSolve3D_Split_HDG_Tet_AD_btest_build_vera
[ 97%] Checking style of test/system/LocalSolve/LocalSolve3D_Split_HDG_Tet_AD_btest.cpp
[ 97%] Built target LocalSolve3D_Split_HDG_Tet_AD_btest_build_vera
Scanning dependencies of target LocalSolve3D_Split_HDG_Tet_AD_btest_OBJECT
[ 97%] Building CXX object test/system/LocalSolve/CMakeFiles/LocalSolve3D_Split_HDG_Tet_AD_btest_OBJECT.dir/LocalSolve3D_Split_HDG_Tet_AD_btest.cpp.o
[ 97%] Built target LocalSolve3D_Split_HDG_Tet_AD_btest_OBJECT
Scanning dependencies of target LocalSolve3D_Split_HDG_Tet_AD_btest_build
[ 97%] Linking CXX executable LocalSolve3D_Split_HDG_Tet_AD_btest
[ 97%] Built target LocalSolve3D_Split_HDG_Tet_AD_btest_build
Scanning dependencies of target LocalSolve2D_Split_HDG_Triangle_AD_btest_OBJECT
[ 97%] Building CXX object test/system/LocalSolve/CMakeFiles/LocalSolve2D_Split_HDG_Triangle_AD_btest_OBJECT.dir/LocalSolve2D_Split_HDG_Triangle_AD_btest.cpp.o
[ 97%] Built target LocalSolve2D_Split_HDG_Triangle_AD_btest_OBJECT
Scanning dependencies of target LocalSolve2D_Split_HDG_Triangle_AD_btest_build_vera
[ 97%] Checking style of test/system/LocalSolve/LocalSolve2D_Split_HDG_Triangle_AD_btest.cpp
[ 97%] Built target LocalSolve2D_Split_HDG_Triangle_AD_btest_build_vera
Scanning dependencies of target LocalSolve2D_Split_HDG_Triangle_AD_btest_build
[ 97%] Linking CXX executable LocalSolve2D_Split_HDG_Triangle_AD_btest
[ 97%] Built target LocalSolve2D_Split_HDG_Triangle_AD_btest_build
Scanning dependencies of target ElementDualLocalSolve3D_Galerkin_Stabilized_Triangle_AD_btest_OBJECT
[ 97%] Building CXX object test/system/LocalSolve/CMakeFiles/ElementDualLocalSolve3D_Galerkin_Stabilized_Triangle_AD_btest_OBJECT.dir/ElementDualLocalSolve3D_Galerkin_Stabilized_Triangle_AD_btest.cpp.o
[ 97%] Built target ElementDualLocalSolve3D_Galerkin_Stabilized_Triangle_AD_btest_OBJECT
Scanning dependencies of target ElementDualLocalSolve3D_Galerkin_Stabilized_Triangle_AD_btest_build_vera
[ 97%] Checking style of test/system/LocalSolve/ElementDualLocalSolve3D_Galerkin_Stabilized_Triangle_AD_btest.cpp
[ 97%] Built target ElementDualLocalSolve3D_Galerkin_Stabilized_Triangle_AD_btest_build_vera
Scanning dependencies of target ElementDualLocalSolve3D_Galerkin_Stabilized_Triangle_AD_btest_build
[ 97%] Linking CXX executable ElementDualLocalSolve3D_Galerkin_Stabilized_Triangle_AD_btest
[ 97%] Built target ElementDualLocalSolve3D_Galerkin_Stabilized_Triangle_AD_btest_build
Scanning dependencies of target ElementLocalSolve2D_DGBR2_Triangle_AD_btest_OBJECT
[ 97%] Building CXX object test/system/LocalSolve/CMakeFiles/ElementLocalSolve2D_DGBR2_Triangle_AD_btest_OBJECT.dir/ElementLocalSolve2D_DGBR2_Triangle_AD_btest.cpp.o
[ 97%] Built target ElementLocalSolve2D_DGBR2_Triangle_AD_btest_OBJECT
Scanning dependencies of target ElementLocalSolve2D_DGBR2_Triangle_AD_btest_build_vera
[ 97%] Checking style of test/system/LocalSolve/ElementLocalSolve2D_DGBR2_Triangle_AD_btest.cpp
[ 97%] Built target ElementLocalSolve2D_DGBR2_Triangle_AD_btest_build_vera
Scanning dependencies of target ElementLocalSolve2D_DGBR2_Triangle_AD_btest_build
[ 97%] Linking CXX executable ElementLocalSolve2D_DGBR2_Triangle_AD_btest
[ 97%] Built target ElementLocalSolve2D_DGBR2_Triangle_AD_btest_build
Scanning dependencies of target EdgeLocalSolve2D_Dual_Galerkin_Stabilized_AD_btest_build_vera
[ 97%] Checking style of test/system/LocalSolve/EdgeLocalSolve2D_Dual_Galerkin_Stabilized_AD_btest.cpp
[ 97%] Built target EdgeLocalSolve2D_Dual_Galerkin_Stabilized_AD_btest_build_vera
Scanning dependencies of target EdgeLocalSolve2D_Dual_Galerkin_Stabilized_AD_btest_OBJECT
[ 97%] Building CXX object test/system/LocalSolve/CMakeFiles/EdgeLocalSolve2D_Dual_Galerkin_Stabilized_AD_btest_OBJECT.dir/EdgeLocalSolve2D_Dual_Galerkin_Stabilized_AD_btest.cpp.o
[ 97%] Built target EdgeLocalSolve2D_Dual_Galerkin_Stabilized_AD_btest_OBJECT
Scanning dependencies of target EdgeLocalSolve2D_Dual_Galerkin_Stabilized_AD_btest_build
[ 97%] Linking CXX executable EdgeLocalSolve2D_Dual_Galerkin_Stabilized_AD_btest
[ 97%] Built target EdgeLocalSolve2D_Dual_Galerkin_Stabilized_AD_btest_build
Scanning dependencies of target ElementLocalSolve1D_DGBR2_Triangle_AD_btest_build_vera
[ 97%] Checking style of test/system/LocalSolve/ElementLocalSolve1D_DGBR2_Triangle_AD_btest.cpp
[ 97%] Built target ElementLocalSolve1D_DGBR2_Triangle_AD_btest_build_vera
Scanning dependencies of target ElementLocalSolve1D_DGBR2_Triangle_AD_btest_OBJECT
[ 97%] Building CXX object test/system/LocalSolve/CMakeFiles/ElementLocalSolve1D_DGBR2_Triangle_AD_btest_OBJECT.dir/ElementLocalSolve1D_DGBR2_Triangle_AD_btest.cpp.o
[ 97%] Built target ElementLocalSolve1D_DGBR2_Triangle_AD_btest_OBJECT
Scanning dependencies of target ElementLocalSolve1D_DGBR2_Triangle_AD_btest_build
[ 97%] Linking CXX executable ElementLocalSolve1D_DGBR2_Triangle_AD_btest
[ 97%] Built target ElementLocalSolve1D_DGBR2_Triangle_AD_btest_build
Scanning dependencies of target AlgebraicEquationSet_Local_VMSDBR2_Triangle_AD_btest_build_vera
[ 97%] Checking style of test/system/LocalSolve/AlgebraicEquationSet_Local_VMSDBR2_Triangle_AD_btest.cpp
[ 97%] Built target AlgebraicEquationSet_Local_VMSDBR2_Triangle_AD_btest_build_vera
Scanning dependencies of target AlgebraicEquationSet_Local_VMSDBR2_Triangle_AD_btest_OBJECT
[ 97%] Building CXX object test/system/LocalSolve/CMakeFiles/AlgebraicEquationSet_Local_VMSDBR2_Triangle_AD_btest_OBJECT.dir/AlgebraicEquationSet_Local_VMSDBR2_Triangle_AD_btest.cpp.o
[ 97%] Built target AlgebraicEquationSet_Local_VMSDBR2_Triangle_AD_btest_OBJECT
Scanning dependencies of target AlgebraicEquationSet_Local_VMSDBR2_Triangle_AD_btest_build
[ 97%] Linking CXX executable AlgebraicEquationSet_Local_VMSDBR2_Triangle_AD_btest
[ 97%] Built target AlgebraicEquationSet_Local_VMSDBR2_Triangle_AD_btest_build
Scanning dependencies of target ElementLocalSolve3D_DGAdvective_Tet_AD_btest_OBJECT
[ 97%] Building CXX object test/system/LocalSolve/CMakeFiles/ElementLocalSolve3D_DGAdvective_Tet_AD_btest_OBJECT.dir/ElementLocalSolve3D_DGAdvective_Tet_AD_btest.cpp.o
[ 97%] Built target ElementLocalSolve3D_DGAdvective_Tet_AD_btest_OBJECT
Scanning dependencies of target ElementLocalSolve3D_DGAdvective_Tet_AD_btest_build_vera
[ 97%] Checking style of test/system/LocalSolve/ElementLocalSolve3D_DGAdvective_Tet_AD_btest.cpp
[ 97%] Built target ElementLocalSolve3D_DGAdvective_Tet_AD_btest_build_vera
Scanning dependencies of target ElementLocalSolve3D_DGAdvective_Tet_AD_btest_build
[ 97%] Linking CXX executable ElementLocalSolve3D_DGAdvective_Tet_AD_btest
[ 97%] Built target ElementLocalSolve3D_DGAdvective_Tet_AD_btest_build
Scanning dependencies of target EdgeLocalSolve1D_Dual_Galerkin_Stabilized_Line_AD_btest_build_vera
[ 97%] Checking style of test/system/LocalSolve/EdgeLocalSolve1D_Dual_Galerkin_Stabilized_Line_AD_btest.cpp
[ 97%] Built target EdgeLocalSolve1D_Dual_Galerkin_Stabilized_Line_AD_btest_build_vera
Scanning dependencies of target EdgeLocalSolve1D_Dual_Galerkin_Stabilized_Line_AD_btest_OBJECT
[ 97%] Building CXX object test/system/LocalSolve/CMakeFiles/EdgeLocalSolve1D_Dual_Galerkin_Stabilized_Line_AD_btest_OBJECT.dir/EdgeLocalSolve1D_Dual_Galerkin_Stabilized_Line_AD_btest.cpp.o
[ 97%] Built target EdgeLocalSolve1D_Dual_Galerkin_Stabilized_Line_AD_btest_OBJECT
Scanning dependencies of target EdgeLocalSolve1D_Dual_Galerkin_Stabilized_Line_AD_btest_build
[ 97%] Linking CXX executable EdgeLocalSolve1D_Dual_Galerkin_Stabilized_Line_AD_btest
[ 97%] Built target EdgeLocalSolve1D_Dual_Galerkin_Stabilized_Line_AD_btest_build
Scanning dependencies of target Block_1D_Decoupled_AD_btest_build_vera
[ 97%] Checking style of test/system/BlockSolve/Block_1D_Decoupled_AD_btest.cpp
[ 97%] Built target Block_1D_Decoupled_AD_btest_build_vera
Scanning dependencies of target Block_1D_Decoupled_AD_btest_OBJECT
[ 97%] Building CXX object test/system/BlockSolve/CMakeFiles/Block_1D_Decoupled_AD_btest_OBJECT.dir/Block_1D_Decoupled_AD_btest.cpp.o
[ 97%] Built target Block_1D_Decoupled_AD_btest_OBJECT
Scanning dependencies of target Block_1D_Decoupled_AD_btest_build
[ 97%] Linking CXX executable Block_1D_Decoupled_AD_btest
[ 97%] Built target Block_1D_Decoupled_AD_btest_build
Scanning dependencies of target Block_1D_Decoupled_Burgers_btest_OBJECT
[ 97%] Building CXX object test/system/BlockSolve/CMakeFiles/Block_1D_Decoupled_Burgers_btest_OBJECT.dir/Block_1D_Decoupled_Burgers_btest.cpp.o
[ 97%] Built target Block_1D_Decoupled_Burgers_btest_OBJECT
Scanning dependencies of target Block_1D_Decoupled_Burgers_btest_build_vera
[ 97%] Checking style of test/system/BlockSolve/Block_1D_Decoupled_Burgers_btest.cpp
[ 97%] Built target Block_1D_Decoupled_Burgers_btest_build_vera
Scanning dependencies of target Block_1D_Decoupled_Burgers_btest_build
[ 97%] Linking CXX executable Block_1D_Decoupled_Burgers_btest
[ 97%] Built target Block_1D_Decoupled_Burgers_btest_build
Scanning dependencies of target AnalyticSolve2D_DGAdvective_Triangle_Euler_UniformStream_btest_build_vera
[ 97%] Checking style of test/system/AnalyticSolve/AnalyticSolve2D_DGAdvective_Triangle_Euler_UniformStream_btest.cpp
[ 97%] Built target AnalyticSolve2D_DGAdvective_Triangle_Euler_UniformStream_btest_build_vera
[ 97%] Generating CXX unity source src/Discretization/cotire/DGBR2NSLib_CXX_unity.cxx
[ 97%] Generating CXX prefix source src/Discretization/cotire/DGBR2NSLib_CXX_prefix.cxx
[ 97%] Generating CXX prefix header src/Discretization/cotire/DGBR2NSLib_CXX_prefix.hxx
[ 97%] Building CXX precompiled header src/Discretization/cotire/DGBR2NSLib_CXX_prefix.hxx.gch
Scanning dependencies of target DGBR2NSLib
[ 97%] Building CXX object src/Discretization/CMakeFiles/DGBR2NSLib.dir/DG/DGBR2_Instantiate/AlgebraicEquationSet_DGBR2_NavierStokes2D_ConservativeConstVisc.cpp.o
[ 97%] Building CXX object src/Discretization/CMakeFiles/DGBR2NSLib.dir/DG/DGBR2_Instantiate/AlgebraicEquationSet_DGBR2_NavierStokes2D_PrimitiveConstVisc.cpp.o
[ 97%] Building CXX object src/Discretization/CMakeFiles/DGBR2NSLib.dir/DG/DGBR2_Instantiate/AlgebraicEquationSet_DGBR2_NavierStokes3D_PrimitiveConstVisc.cpp.o
[ 97%] Building CXX object src/Discretization/CMakeFiles/DGBR2NSLib.dir/DG/DGBR2_Instantiate/AlgebraicEquationSet_DGBR2_NavierStokes3D_PrimitiveSutherland.cpp.o
[ 97%] Building CXX object src/Discretization/CMakeFiles/DGBR2NSLib.dir/DG/DGBR2_Instantiate/AlgebraicEquationSet_DGBR2_NavierStokes3D_SurrogateSutherland.cpp.o
[ 97%] Linking CXX static library libDGBR2NSLib.a
[ 97%] Built target DGBR2NSLib
Scanning dependencies of target AnalyticSolve2D_DGAdvective_Triangle_Euler_UniformStream_btest_OBJECT
[ 97%] Building CXX object test/system/AnalyticSolve/CMakeFiles/AnalyticSolve2D_DGAdvective_Triangle_Euler_UniformStream_btest_OBJECT.dir/AnalyticSolve2D_DGAdvective_Triangle_Euler_UniformStream_btest.cpp.o
[ 97%] Built target AnalyticSolve2D_DGAdvective_Triangle_Euler_UniformStream_btest_OBJECT
Scanning dependencies of target AnalyticSolve2D_DGAdvective_Triangle_Euler_UniformStream_btest_build
[ 97%] Linking CXX executable AnalyticSolve2D_DGAdvective_Triangle_Euler_UniformStream_btest
[ 97%] Built target AnalyticSolve2D_DGAdvective_Triangle_Euler_UniformStream_btest_build
Scanning dependencies of target AnalyticSolve2D_DGBR2_Triangle_NavierStokes_UniformStream_btest_build_vera
[ 97%] Checking style of test/system/AnalyticSolve/AnalyticSolve2D_DGBR2_Triangle_NavierStokes_UniformStream_btest.cpp
[ 97%] Built target AnalyticSolve2D_DGBR2_Triangle_NavierStokes_UniformStream_btest_build_vera
Scanning dependencies of target AnalyticSolve2D_DGBR2_Triangle_NavierStokes_UniformStream_btest_OBJECT
[ 97%] Building CXX object test/system/AnalyticSolve/CMakeFiles/AnalyticSolve2D_DGBR2_Triangle_NavierStokes_UniformStream_btest_OBJECT.dir/AnalyticSolve2D_DGBR2_Triangle_NavierStokes_UniformStream_btest.cpp.o
[ 97%] Built target AnalyticSolve2D_DGBR2_Triangle_NavierStokes_UniformStream_btest_OBJECT
Scanning dependencies of target AnalyticSolve2D_DGBR2_Triangle_NavierStokes_UniformStream_btest_build
[ 97%] Linking CXX executable AnalyticSolve2D_DGBR2_Triangle_NavierStokes_UniformStream_btest
[ 97%] Built target AnalyticSolve2D_DGBR2_Triangle_NavierStokes_UniformStream_btest_build
Scanning dependencies of target AnalyticSolve2D_HDG_Triangle_NavierStokes_btest_build_vera
[ 97%] Checking style of test/system/AnalyticSolve/AnalyticSolve2D_HDG_Triangle_NavierStokes_btest.cpp
[ 97%] Built target AnalyticSolve2D_HDG_Triangle_NavierStokes_btest_build_vera
Scanning dependencies of target AnalyticSolve2D_HDG_Triangle_NavierStokes_btest_OBJECT
[ 97%] Building CXX object test/system/AnalyticSolve/CMakeFiles/AnalyticSolve2D_HDG_Triangle_NavierStokes_btest_OBJECT.dir/AnalyticSolve2D_HDG_Triangle_NavierStokes_btest.cpp.o
[ 97%] Built target AnalyticSolve2D_HDG_Triangle_NavierStokes_btest_OBJECT
Scanning dependencies of target AnalyticSolve2D_HDG_Triangle_NavierStokes_btest_build
[ 97%] Linking CXX executable AnalyticSolve2D_HDG_Triangle_NavierStokes_btest
[ 97%] Built target AnalyticSolve2D_HDG_Triangle_NavierStokes_btest_build
Scanning dependencies of target AnalyticSolve2D_DGAdvective_IBL_StagnationFlow_LamiBL_btest_OBJECT
[ 97%] Building CXX object test/system/AnalyticSolve/CMakeFiles/AnalyticSolve2D_DGAdvective_IBL_StagnationFlow_LamiBL_btest_OBJECT.dir/AnalyticSolve2D_DGAdvective_IBL_StagnationFlow_LamiBL_btest.cpp.o
[ 97%] Built target AnalyticSolve2D_DGAdvective_IBL_StagnationFlow_LamiBL_btest_OBJECT
Scanning dependencies of target AnalyticSolve2D_DGAdvective_IBL_StagnationFlow_LamiBL_btest_build_vera
[ 97%] Checking style of test/system/AnalyticSolve/AnalyticSolve2D_DGAdvective_IBL_StagnationFlow_LamiBL_btest.cpp
[ 97%] Built target AnalyticSolve2D_DGAdvective_IBL_StagnationFlow_LamiBL_btest_build_vera
Scanning dependencies of target AnalyticSolve2D_DGAdvective_IBL_StagnationFlow_LamiBL_btest_build
[ 97%] Linking CXX executable AnalyticSolve2D_DGAdvective_IBL_StagnationFlow_LamiBL_btest
[ 97%] Built target AnalyticSolve2D_DGAdvective_IBL_StagnationFlow_LamiBL_btest_build
Scanning dependencies of target AnalyticSolve2D_DGAdvective_IBL_StagnationFlow_SingleElem_LamiBL_btest_OBJECT
[ 97%] Building CXX object test/system/AnalyticSolve/CMakeFiles/AnalyticSolve2D_DGAdvective_IBL_StagnationFlow_SingleElem_LamiBL_btest_OBJECT.dir/AnalyticSolve2D_DGAdvective_IBL_StagnationFlow_SingleElem_LamiBL_btest.cpp.o
[ 97%] Built target AnalyticSolve2D_DGAdvective_IBL_StagnationFlow_SingleElem_LamiBL_btest_OBJECT
Scanning dependencies of target AnalyticSolve2D_DGAdvective_IBL_StagnationFlow_SingleElem_LamiBL_btest_build_vera
[ 97%] Checking style of test/system/AnalyticSolve/AnalyticSolve2D_DGAdvective_IBL_StagnationFlow_SingleElem_LamiBL_btest.cpp
[ 97%] Built target AnalyticSolve2D_DGAdvective_IBL_StagnationFlow_SingleElem_LamiBL_btest_build_vera
Scanning dependencies of target AnalyticSolve2D_DGAdvective_IBL_StagnationFlow_SingleElem_LamiBL_btest_build
[ 97%] Linking CXX executable AnalyticSolve2D_DGAdvective_IBL_StagnationFlow_SingleElem_LamiBL_btest
[ 97%] Built target AnalyticSolve2D_DGAdvective_IBL_StagnationFlow_SingleElem_LamiBL_btest_build
Scanning dependencies of target AnalyticSolve2D_HDG_Triangle_NavierStokes_UniformStream_btest_OBJECT
[ 97%] Building CXX object test/system/AnalyticSolve/CMakeFiles/AnalyticSolve2D_HDG_Triangle_NavierStokes_UniformStream_btest_OBJECT.dir/AnalyticSolve2D_HDG_Triangle_NavierStokes_UniformStream_btest.cpp.o
[ 97%] Built target AnalyticSolve2D_HDG_Triangle_NavierStokes_UniformStream_btest_OBJECT
Scanning dependencies of target AnalyticSolve2D_HDG_Triangle_NavierStokes_UniformStream_btest_build_vera
[ 97%] Checking style of test/system/AnalyticSolve/AnalyticSolve2D_HDG_Triangle_NavierStokes_UniformStream_btest.cpp
[ 97%] Built target AnalyticSolve2D_HDG_Triangle_NavierStokes_UniformStream_btest_build_vera
Scanning dependencies of target AnalyticSolve2D_HDG_Triangle_NavierStokes_UniformStream_btest_build
[ 97%] Linking CXX executable AnalyticSolve2D_HDG_Triangle_NavierStokes_UniformStream_btest
[ 97%] Built target AnalyticSolve2D_HDG_Triangle_NavierStokes_UniformStream_btest_build
Scanning dependencies of target AnalyticSolve_HDG_AD_btest_build_vera
[ 97%] Checking style of test/system/AnalyticSolve/AnalyticSolve_HDG_AD_btest.cpp
[ 97%] Built target AnalyticSolve_HDG_AD_btest_build_vera
Scanning dependencies of target AnalyticSolve_HDG_AD_btest_OBJECT
[ 97%] Building CXX object test/system/AnalyticSolve/CMakeFiles/AnalyticSolve_HDG_AD_btest_OBJECT.dir/AnalyticSolve_HDG_AD_btest.cpp.o
[ 97%] Built target AnalyticSolve_HDG_AD_btest_OBJECT
Scanning dependencies of target AnalyticSolve_HDG_AD_btest_build
[ 97%] Linking CXX executable AnalyticSolve_HDG_AD_btest
[ 97%] Built target AnalyticSolve_HDG_AD_btest_build
Scanning dependencies of target AnalyticSolve2D_DGBR2_Triangle_NavierStokes_btest_build_vera
[ 97%] Checking style of test/system/AnalyticSolve/AnalyticSolve2D_DGBR2_Triangle_NavierStokes_btest.cpp
[ 97%] Built target AnalyticSolve2D_DGBR2_Triangle_NavierStokes_btest_build_vera
Scanning dependencies of target AnalyticSolve2D_DGBR2_Triangle_NavierStokes_btest_OBJECT
[ 97%] Building CXX object test/system/AnalyticSolve/CMakeFiles/AnalyticSolve2D_DGBR2_Triangle_NavierStokes_btest_OBJECT.dir/AnalyticSolve2D_DGBR2_Triangle_NavierStokes_btest.cpp.o
[ 97%] Built target AnalyticSolve2D_DGBR2_Triangle_NavierStokes_btest_OBJECT
Scanning dependencies of target AnalyticSolve2D_DGBR2_Triangle_NavierStokes_btest_build
[ 97%] Linking CXX executable AnalyticSolve2D_DGBR2_Triangle_NavierStokes_btest
[ 97%] Built target AnalyticSolve2D_DGBR2_Triangle_NavierStokes_btest_build
Scanning dependencies of target PDEEulermitAVDiffusion2D_Consistency_btest_build_vera
[ 97%] Checking style of test/system/CodeConsistency/PDEEulermitAVDiffusion2D_Consistency_btest.cpp
[ 97%] Built target PDEEulermitAVDiffusion2D_Consistency_btest_build_vera
Scanning dependencies of target PDEEulermitAVDiffusion2D_Consistency_btest_OBJECT
[ 97%] Building CXX object test/system/CodeConsistency/CMakeFiles/PDEEulermitAVDiffusion2D_Consistency_btest_OBJECT.dir/PDEEulermitAVDiffusion2D_Consistency_btest.cpp.o
[ 97%] Built target PDEEulermitAVDiffusion2D_Consistency_btest_OBJECT
Scanning dependencies of target PDEEulermitAVDiffusion2D_Consistency_btest_build
[ 97%] Linking CXX executable PDEEulermitAVDiffusion2D_Consistency_btest
[ 97%] Built target PDEEulermitAVDiffusion2D_Consistency_btest_build
Scanning dependencies of target PDEmitAVSensor3D_Consistency_btest_build_vera
[ 97%] Checking style of test/system/CodeConsistency/PDEmitAVSensor3D_Consistency_btest.cpp
[ 97%] Built target PDEmitAVSensor3D_Consistency_btest_build_vera
Scanning dependencies of target PDEmitAVSensor3D_Consistency_btest_OBJECT
[ 97%] Building CXX object test/system/CodeConsistency/CMakeFiles/PDEmitAVSensor3D_Consistency_btest_OBJECT.dir/PDEmitAVSensor3D_Consistency_btest.cpp.o
[ 97%] Built target PDEmitAVSensor3D_Consistency_btest_OBJECT
Scanning dependencies of target PDEmitAVSensor3D_Consistency_btest_build
[ 97%] Linking CXX executable PDEmitAVSensor3D_Consistency_btest
[ 97%] Built target PDEmitAVSensor3D_Consistency_btest_build
Scanning dependencies of target Solve2D_Uncoupled_HDGAdvectiveIBL_LamiBL_btest_OBJECT
[ 97%] Building CXX object test/system/CodeConsistency/CMakeFiles/Solve2D_Uncoupled_HDGAdvectiveIBL_LamiBL_btest_OBJECT.dir/Solve2D_Uncoupled_HDGAdvectiveIBL_LamiBL_btest.cpp.o
[ 97%] Built target Solve2D_Uncoupled_HDGAdvectiveIBL_LamiBL_btest_OBJECT
Scanning dependencies of target Solve2D_Uncoupled_HDGAdvectiveIBL_LamiBL_btest_build_vera
[ 97%] Checking style of test/system/CodeConsistency/Solve2D_Uncoupled_HDGAdvectiveIBL_LamiBL_btest.cpp
[ 97%] Built target Solve2D_Uncoupled_HDGAdvectiveIBL_LamiBL_btest_build_vera
Scanning dependencies of target Solve2D_Uncoupled_HDGAdvectiveIBL_LamiBL_btest_build
[ 97%] Linking CXX executable Solve2D_Uncoupled_HDGAdvectiveIBL_LamiBL_btest
[ 97%] Built target Solve2D_Uncoupled_HDGAdvectiveIBL_LamiBL_btest_build
Scanning dependencies of target PDEEulermitAVDiffusion3D_Consistency_btest_OBJECT
[ 97%] Building CXX object test/system/CodeConsistency/CMakeFiles/PDEEulermitAVDiffusion3D_Consistency_btest_OBJECT.dir/PDEEulermitAVDiffusion3D_Consistency_btest.cpp.o
[ 97%] Built target PDEEulermitAVDiffusion3D_Consistency_btest_OBJECT
Scanning dependencies of target PDEEulermitAVDiffusion3D_Consistency_btest_build_vera
[ 97%] Checking style of test/system/CodeConsistency/PDEEulermitAVDiffusion3D_Consistency_btest.cpp
[ 97%] Built target PDEEulermitAVDiffusion3D_Consistency_btest_build_vera
Scanning dependencies of target PDEEulermitAVDiffusion3D_Consistency_btest_build
[ 97%] Linking CXX executable PDEEulermitAVDiffusion3D_Consistency_btest
[ 97%] Built target PDEEulermitAVDiffusion3D_Consistency_btest_build
Scanning dependencies of target Solve2D_Coupled4x4_IBLSplitAmpLag_CorrelationClosure_CapturedTransition_PTC_btest_OBJECT
[ 97%] Building CXX object test/system/CodeConsistency/CMakeFiles/Solve2D_Coupled4x4_IBLSplitAmpLag_CorrelationClosure_CapturedTransition_PTC_btest_OBJECT.dir/Solve2D_Coupled4x4_IBLSplitAmpLag_CorrelationClosure_CapturedTransition_PTC_btest.cpp.o
[ 97%] Built target Solve2D_Coupled4x4_IBLSplitAmpLag_CorrelationClosure_CapturedTransition_PTC_btest_OBJECT
Scanning dependencies of target Solve2D_Coupled4x4_IBLSplitAmpLag_CorrelationClosure_CapturedTransition_PTC_btest_build_vera
[ 97%] Checking style of test/system/CodeConsistency/Solve2D_Coupled4x4_IBLSplitAmpLag_CorrelationClosure_CapturedTransition_PTC_btest.cpp
[ 97%] Built target Solve2D_Coupled4x4_IBLSplitAmpLag_CorrelationClosure_CapturedTransition_PTC_btest_build_vera
Scanning dependencies of target Solve2D_Coupled4x4_IBLSplitAmpLag_CorrelationClosure_CapturedTransition_PTC_btest_build
[ 97%] Linking CXX executable Solve2D_Coupled4x4_IBLSplitAmpLag_CorrelationClosure_CapturedTransition_PTC_btest
[ 97%] Built target Solve2D_Coupled4x4_IBLSplitAmpLag_CorrelationClosure_CapturedTransition_PTC_btest_build
Scanning dependencies of target PDEEulermitAVDiffusion3D_RANSSA_Consistency_btest_OBJECT
[ 97%] Building CXX object test/system/CodeConsistency/CMakeFiles/PDEEulermitAVDiffusion3D_RANSSA_Consistency_btest_OBJECT.dir/PDEEulermitAVDiffusion3D_RANSSA_Consistency_btest.cpp.o
[ 97%] Built target PDEEulermitAVDiffusion3D_RANSSA_Consistency_btest_OBJECT
Scanning dependencies of target PDEEulermitAVDiffusion3D_RANSSA_Consistency_btest_build_vera
[ 97%] Checking style of test/system/CodeConsistency/PDEEulermitAVDiffusion3D_RANSSA_Consistency_btest.cpp
[ 97%] Built target PDEEulermitAVDiffusion3D_RANSSA_Consistency_btest_build_vera
Scanning dependencies of target PDEEulermitAVDiffusion3D_RANSSA_Consistency_btest_build
[ 97%] Linking CXX executable PDEEulermitAVDiffusion3D_RANSSA_Consistency_btest
[ 97%] Built target PDEEulermitAVDiffusion3D_RANSSA_Consistency_btest_build
Scanning dependencies of target BCEulermitAVSensor2D_Consistency_RANSSA_btest_build_vera
[ 97%] Checking style of test/system/CodeConsistency/BCEulermitAVSensor2D_Consistency_RANSSA_btest.cpp
[ 97%] Built target BCEulermitAVSensor2D_Consistency_RANSSA_btest_build_vera
Scanning dependencies of target BCEulermitAVSensor2D_Consistency_RANSSA_btest_OBJECT
[ 97%] Building CXX object test/system/CodeConsistency/CMakeFiles/BCEulermitAVSensor2D_Consistency_RANSSA_btest_OBJECT.dir/BCEulermitAVSensor2D_Consistency_RANSSA_btest.cpp.o
[ 97%] Built target BCEulermitAVSensor2D_Consistency_RANSSA_btest_OBJECT
Scanning dependencies of target BCEulermitAVSensor2D_Consistency_RANSSA_btest_build
[ 97%] Linking CXX executable BCEulermitAVSensor2D_Consistency_RANSSA_btest
[ 97%] Built target BCEulermitAVSensor2D_Consistency_RANSSA_btest_build
Scanning dependencies of target PDEmitAVSensor2D_Consistency_RANSSA_btest_build_vera
[ 97%] Checking style of test/system/CodeConsistency/PDEmitAVSensor2D_Consistency_RANSSA_btest.cpp
[ 97%] Built target PDEmitAVSensor2D_Consistency_RANSSA_btest_build_vera
Scanning dependencies of target PDEmitAVSensor2D_Consistency_RANSSA_btest_OBJECT
[ 97%] Building CXX object test/system/CodeConsistency/CMakeFiles/PDEmitAVSensor2D_Consistency_RANSSA_btest_OBJECT.dir/PDEmitAVSensor2D_Consistency_RANSSA_btest.cpp.o
[ 97%] Built target PDEmitAVSensor2D_Consistency_RANSSA_btest_OBJECT
Scanning dependencies of target PDEmitAVSensor2D_Consistency_RANSSA_btest_build
[ 97%] Linking CXX executable PDEmitAVSensor2D_Consistency_RANSSA_btest
[ 97%] Built target PDEmitAVSensor2D_Consistency_RANSSA_btest_build
Scanning dependencies of target AlgebraicEquationSet_PTC_VMSD_Triangle_SA_btest_OBJECT
[ 97%] Building CXX object test/system/CodeConsistency/CMakeFiles/AlgebraicEquationSet_PTC_VMSD_Triangle_SA_btest_OBJECT.dir/AlgebraicEquationSet_PTC_VMSD_Triangle_SA_btest.cpp.o
[ 97%] Built target AlgebraicEquationSet_PTC_VMSD_Triangle_SA_btest_OBJECT
Scanning dependencies of target AlgebraicEquationSet_PTC_VMSD_Triangle_SA_btest_build_vera
[ 97%] Checking style of test/system/CodeConsistency/AlgebraicEquationSet_PTC_VMSD_Triangle_SA_btest.cpp
[ 97%] Built target AlgebraicEquationSet_PTC_VMSD_Triangle_SA_btest_build_vera
Scanning dependencies of target AlgebraicEquationSet_PTC_VMSD_Triangle_SA_btest_build
[ 97%] Linking CXX executable AlgebraicEquationSet_PTC_VMSD_Triangle_SA_btest
[ 97%] Built target AlgebraicEquationSet_PTC_VMSD_Triangle_SA_btest_build
Scanning dependencies of target PDEmitAVSensor1D_Consistency_btest_build_vera
[ 97%] Checking style of test/system/CodeConsistency/PDEmitAVSensor1D_Consistency_btest.cpp
[ 97%] Built target PDEmitAVSensor1D_Consistency_btest_build_vera
Scanning dependencies of target PDEmitAVSensor1D_Consistency_btest_OBJECT
[ 97%] Building CXX object test/system/CodeConsistency/CMakeFiles/PDEmitAVSensor1D_Consistency_btest_OBJECT.dir/PDEmitAVSensor1D_Consistency_btest.cpp.o
[ 97%] Built target PDEmitAVSensor1D_Consistency_btest_OBJECT
Scanning dependencies of target PDEmitAVSensor1D_Consistency_btest_build
[ 97%] Linking CXX executable PDEmitAVSensor1D_Consistency_btest
[ 97%] Built target PDEmitAVSensor1D_Consistency_btest_build
Scanning dependencies of target Solve2D_Coupled4x4_IBL_Panel_NACA0004_FittedTransition_TwoLayerNewton_btest_OBJECT
[ 97%] Building CXX object test/system/CodeConsistency/CMakeFiles/Solve2D_Coupled4x4_IBL_Panel_NACA0004_FittedTransition_TwoLayerNewton_btest_OBJECT.dir/Solve2D_Coupled4x4_IBL_Panel_NACA0004_FittedTransition_TwoLayerNewton_btest.cpp.o
[ 97%] Built target Solve2D_Coupled4x4_IBL_Panel_NACA0004_FittedTransition_TwoLayerNewton_btest_OBJECT
Scanning dependencies of target Solve2D_Coupled4x4_IBL_Panel_NACA0004_FittedTransition_TwoLayerNewton_btest_build_vera
[ 97%] Checking style of test/system/CodeConsistency/Solve2D_Coupled4x4_IBL_Panel_NACA0004_FittedTransition_TwoLayerNewton_btest.cpp
[ 97%] Built target Solve2D_Coupled4x4_IBL_Panel_NACA0004_FittedTransition_TwoLayerNewton_btest_build_vera
Scanning dependencies of target Solve2D_Coupled4x4_IBL_Panel_NACA0004_FittedTransition_TwoLayerNewton_btest_build
[ 97%] Linking CXX executable Solve2D_Coupled4x4_IBL_Panel_NACA0004_FittedTransition_TwoLayerNewton_btest
[ 97%] Built target Solve2D_Coupled4x4_IBL_Panel_NACA0004_FittedTransition_TwoLayerNewton_btest_build
Scanning dependencies of target BCEulermitAVSensor3D_Consistency_btest_OBJECT
[ 97%] Building CXX object test/system/CodeConsistency/CMakeFiles/BCEulermitAVSensor3D_Consistency_btest_OBJECT.dir/BCEulermitAVSensor3D_Consistency_btest.cpp.o
[ 97%] Built target BCEulermitAVSensor3D_Consistency_btest_OBJECT
Scanning dependencies of target BCEulermitAVSensor3D_Consistency_btest_build_vera
[ 97%] Checking style of test/system/CodeConsistency/BCEulermitAVSensor3D_Consistency_btest.cpp
[ 97%] Built target BCEulermitAVSensor3D_Consistency_btest_build_vera
Scanning dependencies of target BCEulermitAVSensor3D_Consistency_btest_build
[ 97%] Linking CXX executable BCEulermitAVSensor3D_Consistency_btest
[ 97%] Built target BCEulermitAVSensor3D_Consistency_btest_build
Scanning dependencies of target PDEEulermitAVDiffusion2D_RANSSA_Consistency_btest_build_vera
[ 97%] Checking style of test/system/CodeConsistency/PDEEulermitAVDiffusion2D_RANSSA_Consistency_btest.cpp
[ 97%] Built target PDEEulermitAVDiffusion2D_RANSSA_Consistency_btest_build_vera
Scanning dependencies of target PDEEulermitAVDiffusion2D_RANSSA_Consistency_btest_OBJECT
[100%] Building CXX object test/system/CodeConsistency/CMakeFiles/PDEEulermitAVDiffusion2D_RANSSA_Consistency_btest_OBJECT.dir/PDEEulermitAVDiffusion2D_RANSSA_Consistency_btest.cpp.o
[100%] Built target PDEEulermitAVDiffusion2D_RANSSA_Consistency_btest_OBJECT
Scanning dependencies of target PDEEulermitAVDiffusion2D_RANSSA_Consistency_btest_build
[100%] Linking CXX executable PDEEulermitAVDiffusion2D_RANSSA_Consistency_btest
[100%] Built target PDEEulermitAVDiffusion2D_RANSSA_Consistency_btest_build
Scanning dependencies of target Solve2D_Uncoupled_DGAdvectiveIBL_LamiBL_PTC_btest_OBJECT
[100%] Building CXX object test/system/CodeConsistency/CMakeFiles/Solve2D_Uncoupled_DGAdvectiveIBL_LamiBL_PTC_btest_OBJECT.dir/Solve2D_Uncoupled_DGAdvectiveIBL_LamiBL_PTC_btest.cpp.o
[100%] Built target Solve2D_Uncoupled_DGAdvectiveIBL_LamiBL_PTC_btest_OBJECT
Scanning dependencies of target Solve2D_Uncoupled_DGAdvectiveIBL_LamiBL_PTC_btest_build_vera
[100%] Checking style of test/system/CodeConsistency/Solve2D_Uncoupled_DGAdvectiveIBL_LamiBL_PTC_btest.cpp
[100%] Built target Solve2D_Uncoupled_DGAdvectiveIBL_LamiBL_PTC_btest_build_vera
Scanning dependencies of target Solve2D_Uncoupled_DGAdvectiveIBL_LamiBL_PTC_btest_build
[100%] Linking CXX executable Solve2D_Uncoupled_DGAdvectiveIBL_LamiBL_PTC_btest
[100%] Built target Solve2D_Uncoupled_DGAdvectiveIBL_LamiBL_PTC_btest_build
Scanning dependencies of target BCEulermitAVSensor2D_Consistency_btest_OBJECT
[100%] Building CXX object test/system/CodeConsistency/CMakeFiles/BCEulermitAVSensor2D_Consistency_btest_OBJECT.dir/BCEulermitAVSensor2D_Consistency_btest.cpp.o
[100%] Built target BCEulermitAVSensor2D_Consistency_btest_OBJECT
Scanning dependencies of target BCEulermitAVSensor2D_Consistency_btest_build_vera
[100%] Checking style of test/system/CodeConsistency/BCEulermitAVSensor2D_Consistency_btest.cpp
[100%] Built target BCEulermitAVSensor2D_Consistency_btest_build_vera
Scanning dependencies of target BCEulermitAVSensor2D_Consistency_btest_build
[100%] Linking CXX executable BCEulermitAVSensor2D_Consistency_btest
[100%] Built target BCEulermitAVSensor2D_Consistency_btest_build
Scanning dependencies of target BCEulermitAVSensor3D_Consistency_RANSSA_btest_OBJECT
[100%] Building CXX object test/system/CodeConsistency/CMakeFiles/BCEulermitAVSensor3D_Consistency_RANSSA_btest_OBJECT.dir/BCEulermitAVSensor3D_Consistency_RANSSA_btest.cpp.o
[100%] Built target BCEulermitAVSensor3D_Consistency_RANSSA_btest_OBJECT
Scanning dependencies of target BCEulermitAVSensor3D_Consistency_RANSSA_btest_build_vera
[100%] Checking style of test/system/CodeConsistency/BCEulermitAVSensor3D_Consistency_RANSSA_btest.cpp
[100%] Built target BCEulermitAVSensor3D_Consistency_RANSSA_btest_build_vera
Scanning dependencies of target BCEulermitAVSensor3D_Consistency_RANSSA_btest_build
[100%] Linking CXX executable BCEulermitAVSensor3D_Consistency_RANSSA_btest
[100%] Built target BCEulermitAVSensor3D_Consistency_RANSSA_btest_build
Scanning dependencies of target PDEEulermitAVDiffusion1D_Consistency_btest_OBJECT
[100%] Building CXX object test/system/CodeConsistency/CMakeFiles/PDEEulermitAVDiffusion1D_Consistency_btest_OBJECT.dir/PDEEulermitAVDiffusion1D_Consistency_btest.cpp.o
[100%] Built target PDEEulermitAVDiffusion1D_Consistency_btest_OBJECT
Scanning dependencies of target PDEEulermitAVDiffusion1D_Consistency_btest_build_vera
[100%] Checking style of test/system/CodeConsistency/PDEEulermitAVDiffusion1D_Consistency_btest.cpp
[100%] Built target PDEEulermitAVDiffusion1D_Consistency_btest_build_vera
Scanning dependencies of target PDEEulermitAVDiffusion1D_Consistency_btest_build
[100%] Linking CXX executable PDEEulermitAVDiffusion1D_Consistency_btest
[100%] Built target PDEEulermitAVDiffusion1D_Consistency_btest_build
Scanning dependencies of target Solve2D_Uncoupled_DGAdvectiveIBLUniField_CorrelationClosure_LamiBL_btest_OBJECT
[100%] Building CXX object test/system/CodeConsistency/CMakeFiles/Solve2D_Uncoupled_DGAdvectiveIBLUniField_CorrelationClosure_LamiBL_btest_OBJECT.dir/Solve2D_Uncoupled_DGAdvectiveIBLUniField_CorrelationClosure_LamiBL_btest.cpp.o
[100%] Built target Solve2D_Uncoupled_DGAdvectiveIBLUniField_CorrelationClosure_LamiBL_btest_OBJECT
Scanning dependencies of target Solve2D_Uncoupled_DGAdvectiveIBLUniField_CorrelationClosure_LamiBL_btest_build_vera
[100%] Checking style of test/system/CodeConsistency/Solve2D_Uncoupled_DGAdvectiveIBLUniField_CorrelationClosure_LamiBL_btest.cpp
[100%] Built target Solve2D_Uncoupled_DGAdvectiveIBLUniField_CorrelationClosure_LamiBL_btest_build_vera
Scanning dependencies of target Solve2D_Uncoupled_DGAdvectiveIBLUniField_CorrelationClosure_LamiBL_btest_build
[100%] Linking CXX executable Solve2D_Uncoupled_DGAdvectiveIBLUniField_CorrelationClosure_LamiBL_btest
[100%] Built target Solve2D_Uncoupled_DGAdvectiveIBLUniField_CorrelationClosure_LamiBL_btest_build
Scanning dependencies of target PDEmitAVSensor2D_Consistency_btest_OBJECT
[100%] Building CXX object test/system/CodeConsistency/CMakeFiles/PDEmitAVSensor2D_Consistency_btest_OBJECT.dir/PDEmitAVSensor2D_Consistency_btest.cpp.o
[100%] Built target PDEmitAVSensor2D_Consistency_btest_OBJECT
Scanning dependencies of target PDEmitAVSensor2D_Consistency_btest_build_vera
[100%] Checking style of test/system/CodeConsistency/PDEmitAVSensor2D_Consistency_btest.cpp
[100%] Built target PDEmitAVSensor2D_Consistency_btest_build_vera
Scanning dependencies of target PDEmitAVSensor2D_Consistency_btest_build
[100%] Linking CXX executable PDEmitAVSensor2D_Consistency_btest
[100%] Built target PDEmitAVSensor2D_Consistency_btest_build
Scanning dependencies of target PDEmitAVSensor3D_Consistency_RANSSA_btest_OBJECT
[100%] Building CXX object test/system/CodeConsistency/CMakeFiles/PDEmitAVSensor3D_Consistency_RANSSA_btest_OBJECT.dir/PDEmitAVSensor3D_Consistency_RANSSA_btest.cpp.o
[100%] Built target PDEmitAVSensor3D_Consistency_RANSSA_btest_OBJECT
Scanning dependencies of target PDEmitAVSensor3D_Consistency_RANSSA_btest_build_vera
[100%] Checking style of test/system/CodeConsistency/PDEmitAVSensor3D_Consistency_RANSSA_btest.cpp
[100%] Built target PDEmitAVSensor3D_Consistency_RANSSA_btest_build_vera
Scanning dependencies of target PDEmitAVSensor3D_Consistency_RANSSA_btest_build
[100%] Linking CXX executable PDEmitAVSensor3D_Consistency_RANSSA_btest
[100%] Built target PDEmitAVSensor3D_Consistency_RANSSA_btest_build
Scanning dependencies of target check_system_build
[100%] Built target check_system_build
Scanning dependencies of target memcheck_system
   Site: reynolds
   Build name: Linux-g++
Create new tag: 20200417-0217 - Experimental
Test project /jenkins/workspace/SANS_Weekly/builddir/debug_clang/buildnode/reynolds/build/debug_clang
        Start 1698: SolverInterface_Galerkin_Stabilized_btest_memcheck
  1/103 Test #1698: SolverInterface_Galerkin_Stabilized_btest_memcheck ...........................................   Passed   40.08 sec
        Start 1700: SolverInterface_DGAdvective_btest_memcheck
  2/103 Test #1700: SolverInterface_DGAdvective_btest_memcheck ...................................................   Passed   36.21 sec
        Start 1702: SolverInterface_DGBR2_btest_memcheck
  3/103 Test #1702: SolverInterface_DGBR2_btest_memcheck .........................................................   Passed   64.66 sec
        Start 1704: ErrorOrder_2D_CG_Triangle_AD_btest_memcheck
  4/103 Test #1704: ErrorOrder_2D_CG_Triangle_AD_btest_memcheck ..................................................   Passed   11.75 sec
        Start 1706: ErrorOrder_2D_EDG_Triangle_AD_btest_memcheck
  5/103 Test #1706: ErrorOrder_2D_EDG_Triangle_AD_btest_memcheck .................................................   Passed   83.95 sec
        Start 1708: ErrorOrder_3D_DGBR2_Sphere_Triangle_AD_btest_memcheck
  6/103 Test #1708: ErrorOrder_3D_DGBR2_Sphere_Triangle_AD_btest_memcheck ........................................   Passed   28.25 sec
        Start 1710: ErrorOrder_3D_CG_Tet_AD_btest_memcheck
  7/103 Test #1710: ErrorOrder_3D_CG_Tet_AD_btest_memcheck .......................................................   Passed   16.82 sec
        Start 1712: ErrorOrder_4D_DG_Pentatope_btest_memcheck
  8/103 Test #1712: ErrorOrder_4D_DG_Pentatope_btest_memcheck ....................................................***Timeout 3600.06 sec
Running 2 test cases...
creating geometry context with EGADS v1.17 and OpenCASCADE with OpenCASCADE 7.4.1
entity 6 (3683013136) maps to 8
entity 8 (3917754896) maps to 7
entity 4 (3987166224) maps to 6
entity 2 (3989547392) maps to 5
entity 1 (4150608673) maps to 4
entity 3 (4240016946) maps to 3
entity 7 (4257982309) maps to 2
entity 5 (4274689859) maps to 1
added vertices
added cells
added boundary
creating geometry context with EGADS v1.17 and OpenCASCADE with OpenCASCADE 7.4.1
entity 6 (3683013136) maps to 8
entity 8 (3917754896) maps to 7
entity 4 (3987166224) maps to 6
entity 2 (3989547392) maps to 5
entity 1 (4150608673) maps to 4
entity 3 (4240016946) maps to 3
entity 7 (4257982309) maps to 2
entity 5 (4274689859) maps to 1
no candidiates for vertex 85
no candidiates for vertex 86
no candidiates for vertex 89
no candidiates for vertex 90
no candidiates for vertex 101
no candidiates for vertex 102
no candidiates for vertex 105
no candidiates for vertex 106
no candidiates for vertex 149
no candidiates for vertex 150
no candidiates for vertex 153
no candidiates for vertex 154
no candidiates for vertex 165
no candidiates for vertex 166
no candidiates for vertex 169
no candidiates for vertex 170
added vertices
added cells
added boundary
creating geometry context with EGADS v1.17 and OpenCASCADE with OpenCASCADE 7.4.1
entity 6 (3683013136) maps to 8
entity 8 (3917754896) maps to 7
entity 4 (3987166224) maps to 6
entity 2 (3989547392) maps to 5
entity 1 (4150608673) maps to 4
entity 3 (4240016946) maps to 3
entity 7 (4257982309) maps to 2
entity 5 (4274689859) maps to 1
no candidiates for vertex 259
no candidiates for vertex 260
no candidiates for vertex 261
no candidiates for vertex 262
no candidiates for vertex 265
no candidiates for vertex 266
no candidiates for vertex 267
no candidiates for vertex 268
no candidiates for vertex 271
no candidiates for vertex 272
no candidiates for vertex 273
no candidiates for vertex 274
no candidiates for vertex 277
no candidiates for vertex 278
no candidiates for vertex 279
no candidiates for vertex 280
no candidiates for vertex 295
no candidiates for vertex 296
no candidiates for vertex 297
no candidiates for vertex 298
no candidiates for vertex 301
no candidiates for vertex 302
no candidiates for vertex 303
no candidiates for vertex 304
no candidiates for vertex 307
no candidiates for vertex 308
no candidiates for vertex 309
no candidiates for vertex 310
no candidiates for vertex 313
no candidiates for vertex 314
no candidiates for vertex 315
no candidiates for vertex 316
no candidiates for vertex 331
no candidiates for vertex 332
no candidiates for vertex 333
no candidiates for vertex 334
no candidiates for vertex 337
no candidiates for vertex 338
no candidiates for vertex 339
no candidiates for vertex 340
no candidiates for vertex 343
no candidiates for vertex 344
no candidiates for vertex 345
no candidiates for vertex 346
no candidiates for vertex 349
no candidiates for vertex 350
no candidiates for vertex 351
no candidiates for vertex 352
no candidiates for vertex 367
no candidiates for vertex 368
no candidiates for vertex 369
no candidiates for vertex 370
no candidiates for vertex 373
no candidiates for vertex 374
no candidiates for vertex 375
no candidiates for vertex 376
no candidiates for vertex 379
no candidiates for vertex 380
no candidiates for vertex 381
no candidiates for vertex 382
no candidiates for vertex 385
no candidiates for vertex 386
no candidiates for vertex 387
no candidiates for vertex 388
no candidiates for vertex 475
no candidiates for vertex 476
no candidiates for vertex 477
no candidiates for vertex 478
no candidiates for vertex 481
no candidiates for vertex 482
no candidiates for vertex 483
no candidiates for vertex 484
no candidiates for vertex 487
no candidiates for vertex 488
no candidiates for vertex 489
no candidiates for vertex 490
no candidiates for vertex 493
no candidiates for vertex 494
no candidiates for vertex 495
no candidiates for vertex 496
no candidiates for vertex 511
no candidiates for vertex 512
no candidiates for vertex 513
no candidiates for vertex 514
no candidiates for vertex 517
no candidiates for vertex 518
no candidiates for vertex 519
no candidiates for vertex 520
no candidiates for vertex 523
no candidiates for vertex 524
no candidiates for vertex 525
no candidiates for vertex 526
no candidiates for vertex 529
no candidiates for vertex 530
no candidiates for vertex 531
no candidiates for vertex 532
no candidiates for vertex 547
no candidiates for vertex 548
no candidiates for vertex 549
no candidiates for vertex 550
no candidiates for vertex 553
no candidiates for vertex 554
no candidiates for vertex 555
no candidiates for vertex 556
no candidiates for vertex 559
no candidiates for vertex 560
no candidiates for vertex 561
no candidiates for vertex 562
no candidiates for vertex 565
no candidiates for vertex 566
no candidiates for vertex 567
no candidiates for vertex 568
no candidiates for vertex 583
no candidiates for vertex 584
no candidiates for vertex 585
no candidiates for vertex 586
no candidiates for vertex 589
no candidiates for vertex 590
no candidiates for vertex 591
no candidiates for vertex 592
no candidiates for vertex 595
no candidiates for vertex 596
no candidiates for vertex 597
no candidiates for vertex 598
no candidiates for vertex 601
no candidiates for vertex 602
no candidiates for vertex 603
no candidiates for vertex 604
no candidiates for vertex 691
no candidiates for vertex 692
no candidiates for vertex 693
no candidiates for vertex 694
no candidiates for vertex 697
no candidiates for vertex 698
no candidiates for vertex 699
no candidiates for vertex 700
no candidiates for vertex 703
no candidiates for vertex 704
no candidiates for vertex 705
no candidiates for vertex 706
no candidiates for vertex 709
no candidiates for vertex 710
no candidiates for vertex 711
no candidiates for vertex 712
no candidiates for vertex 727
no candidiates for vertex 728
no candidiates for vertex 729
no candidiates for vertex 730
no candidiates for vertex 733
no candidiates for vertex 734
no candidiates for vertex 735
no candidiates for vertex 736
no candidiates for vertex 739
no candidiates for vertex 740
no candidiates for vertex 741
no candidiates for vertex 742
no candidiates for vertex 745
no candidiates for vertex 746
no candidiates for vertex 747
no candidiates for vertex 748
no candidiates for vertex 763
no candidiates for vertex 764
no candidiates for vertex 765
no candidiates for vertex 766
no candidiates for vertex 769
no candidiates for vertex 770
no candidiates for vertex 771
no candidiates for vertex 772
no candidiates for vertex 775
no candidiates for vertex 776
no candidiates for vertex 777
no candidiates for vertex 778
no candidiates for vertex 781
no candidiates for vertex 782
no candidiates for vertex 783
no candidiates for vertex 784
no candidiates for vertex 799
no candidiates for vertex 800
no candidiates for vertex 801
no candidiates for vertex 802
no candidiates for vertex 805
no candidiates for vertex 806
no candidiates for vertex 807
no candidiates for vertex 808
no candidiates for vertex 811
no candidiates for vertex 812
no candidiates for vertex 813
no candidiates for vertex 814
no candidiates for vertex 817
no candidiates for vertex 818
no candidiates for vertex 819
no candidiates for vertex 820
no candidiates for vertex 907
no candidiates for vertex 908
no candidiates for vertex 909
no candidiates for vertex 910
no candidiates for vertex 913
no candidiates for vertex 914
no candidiates for vertex 915
no candidiates for vertex 916
no candidiates for vertex 919
no candidiates for vertex 920
no candidiates for vertex 921
no candidiates for vertex 922
no candidiates for vertex 925
no candidiates for vertex 926
no candidiates for vertex 927
no candidiates for vertex 928
no candidiates for vertex 943
no candidiates for vertex 944
no candidiates for vertex 945
no candidiates for vertex 946
no candidiates for vertex 949
no candidiates for vertex 950
no candidiates for vertex 951
no candidiates for vertex 952
no candidiates for vertex 955
no candidiates for vertex 956
no candidiates for vertex 957
no candidiates for verte

        Start 1714: ErrorEstimateOrder_2D_HDG_Triangle_AD_btest_memcheck
  9/103 Test #1714: ErrorEstimateOrder_2D_HDG_Triangle_AD_btest_memcheck .........................................   Passed  950.30 sec
        Start 1716: ErrorOrder_1D_DGBR2_BuckleyLeverett_ST_btest_memcheck
 10/103 Test #1716: ErrorOrder_1D_DGBR2_BuckleyLeverett_ST_btest_memcheck ........................................   Passed  589.65 sec
        Start 1718: ErrorOrder_1D_HDG_AD_btest_memcheck
 11/103 Test #1718: ErrorOrder_1D_HDG_AD_btest_memcheck ..........................................................   Passed   18.19 sec
        Start 1720: ErrorOrder_1D_HDG_AD_BDF_btest_memcheck
 12/103 Test #1720: ErrorOrder_1D_HDG_AD_BDF_btest_memcheck ......................................................   Passed  355.72 sec
        Start 1722: ErrorOrder_1D_DGBR2_AD_BDF_btest_memcheck
 13/103 Test #1722: ErrorOrder_1D_DGBR2_AD_BDF_btest_memcheck ....................................................   Passed  201.96 sec
        Start 1724: ErrorEstimateOrder_2D_DGAdvective_Triangle_AD_btest_memcheck
 14/103 Test #1724: ErrorEstimateOrder_2D_DGAdvective_Triangle_AD_btest_memcheck .................................   Passed  673.56 sec
        Start 1726: ErrorEstimateOrder_1D_CG_Line_AD_btest_memcheck
 15/103 Test #1726: ErrorEstimateOrder_1D_CG_Line_AD_btest_memcheck ..............................................   Passed    8.84 sec
        Start 1728: Adjoint2D_HDG_Triangle_AD_sansLG_btest_memcheck
 16/103 Test #1728: Adjoint2D_HDG_Triangle_AD_sansLG_btest_memcheck ..............................................   Passed  291.90 sec
        Start 1730: Adjoint1D_DGBR2_BuckleyLeverett_ST_btest_memcheck
 17/103 Test #1730: Adjoint1D_DGBR2_BuckleyLeverett_ST_btest_memcheck ............................................   Passed  154.62 sec
        Start 1732: ErrorOrder_1D_CG_AD_btest_memcheck
 18/103 Test #1732: ErrorOrder_1D_CG_AD_btest_memcheck ...........................................................   Passed    8.30 sec
        Start 1734: ErrorEstimateOrder_3D_CG_Tet_AD_btest_memcheck
 19/103 Test #1734: ErrorEstimateOrder_3D_CG_Tet_AD_btest_memcheck ...............................................   Passed    1.21 sec
        Start 1736: ErrorOrder_1D_DGBR2_TwoPhase_ST_btest_memcheck
 20/103 Test #1736: ErrorOrder_1D_DGBR2_TwoPhase_ST_btest_memcheck ...............................................   Passed  189.57 sec
        Start 1738: Adjoint2D_DGAdvective_Triangle_AD_btest_memcheck
 21/103 Test #1738: Adjoint2D_DGAdvective_Triangle_AD_btest_memcheck .............................................   Passed   19.27 sec
        Start 1740: Solve2D_DGAdvective_LinearRobin_mitLG_sansLG_Consistency_AD_btest_memcheck
 22/103 Test #1740: Solve2D_DGAdvective_LinearRobin_mitLG_sansLG_Consistency_AD_btest_memcheck ...................   Passed   23.62 sec
        Start 1742: ErrorOrder_2D_HDG_Triangle_AD_btest_memcheck
 23/103 Test #1742: ErrorOrder_2D_HDG_Triangle_AD_btest_memcheck .................................................   Passed  132.48 sec
        Start 1744: ErrorOrder_1D_HDGAdvective_Advection_btest_memcheck
 24/103 Test #1744: ErrorOrder_1D_HDGAdvective_Advection_btest_memcheck ..........................................   Passed   10.01 sec
        Start 1746: ErrorOrder_1D_CG_AD_BDF_btest_memcheck
 25/103 Test #1746: ErrorOrder_1D_CG_AD_BDF_btest_memcheck .......................................................   Passed  602.11 sec
        Start 1748: ErrorOrder_3D_CG_Sphere_Triangle_AD_btest_memcheck
 26/103 Test #1748: ErrorOrder_3D_CG_Sphere_Triangle_AD_btest_memcheck ...........................................   Passed   40.22 sec
        Start 1750: ErrorEstimateOrder_1D_DGBR2_Line_AD_btest_memcheck
 27/103 Test #1750: ErrorEstimateOrder_1D_DGBR2_Line_AD_btest_memcheck ...........................................   Passed   14.84 sec
        Start 1752: ErrorOrder_3D_CG_Hex_AD_btest_memcheck
 28/103 Test #1752: ErrorOrder_3D_CG_Hex_AD_btest_memcheck .......................................................   Passed   15.98 sec
        Start 1754: ErrorOrder_1D_HDG_Burgers_btest_memcheck
 29/103 Test #1754: ErrorOrder_1D_HDG_Burgers_btest_memcheck .....................................................   Passed  1070.79 sec
        Start 1756: ErrorEstimateOrder_2D_CG_Nodal_Triangle_AD_btest_memcheck
 30/103 Test #1756: ErrorEstimateOrder_2D_CG_Nodal_Triangle_AD_btest_memcheck ....................................   Passed  671.52 sec
        Start 1758: ErrorOrder_1D_DGBR2_Burgers_btest_memcheck
 31/103 Test #1758: ErrorOrder_1D_DGBR2_Burgers_btest_memcheck ...................................................   Passed  171.00 sec
        Start 1760: ErrorOrder_2D_DGAdvective_Flat_Line_AD_btest_memcheck
 32/103 Test #1760: ErrorOrder_2D_DGAdvective_Flat_Line_AD_btest_memcheck ........................................   Passed   11.48 sec
        Start 1762: ErrorOrder_3D_DGBR2_Tet_AD_btest_memcheck
 33/103 Test #1762: ErrorOrder_3D_DGBR2_Tet_AD_btest_memcheck ....................................................   Passed   19.93 sec
        Start 1764: ErrorOrder_1D_DGBR2_AD_btest_memcheck
 34/103 Test #1764: ErrorOrder_1D_DGBR2_AD_btest_memcheck ........................................................   Passed   15.49 sec
        Start 1766: ErrorOrder_2D_DGAdvective_Annulus_Triangle_btest_memcheck
 35/103 Test #1766: ErrorOrder_2D_DGAdvective_Annulus_Triangle_btest_memcheck ....................................   Passed   12.40 sec
        Start 1768: ErrorEstimateOrder_2D_CG_Triangle_RD_btest_memcheck
 36/103 Test #1768: ErrorEstimateOrder_2D_CG_Triangle_RD_btest_memcheck ..........................................   Passed  237.91 sec
        Start 1770: ErrorOrder_2D_DGAdvective_Circle_Line_AD_btest_memcheck
 37/103 Test #1770: ErrorOrder_2D_DGAdvective_Circle_Line_AD_btest_memcheck ......................................   Passed   12.11 sec
        Start 1772: ErrorOrder_2D_CG_Quad_AD_btest_memcheck
 38/103 Test #1772: ErrorOrder_2D_CG_Quad_AD_btest_memcheck ......................................................   Passed   10.95 sec
        Start 1774: ErrorEstimateOrder_2D_DGBR2_Triangle_AD_btest_memcheck
 39/103 Test #1774: ErrorEstimateOrder_2D_DGBR2_Triangle_AD_btest_memcheck .......................................   Passed  259.41 sec
        Start 1776: ErrorOrder_2D_DGAdvective_Circle_Line_ShallowWater_btest_memcheck
 40/103 Test #1776: ErrorOrder_2D_DGAdvective_Circle_Line_ShallowWater_btest_memcheck ............................   Passed   11.84 sec
        Start 1778: ErrorEstimateOrder_2D_CG_Triangle_AD_btest_memcheck
 41/103 Test #1778: ErrorEstimateOrder_2D_CG_Triangle_AD_btest_memcheck ..........................................   Passed  601.65 sec
        Start 1780: ErrorOrder_2D_DGBR2_Triangle_AD_btest_memcheck
 42/103 Test #1780: ErrorOrder_2D_DGBR2_Triangle_AD_btest_memcheck ...............................................   Passed   30.48 sec
        Start 1782: ErrorOrder_1D_DGAdvective_ShallowWater_btest_memcheck
 43/103 Test #1782: ErrorOrder_1D_DGAdvective_ShallowWater_btest_memcheck ........................................   Passed   12.48 sec
        Start 1784: ErrorOrder_3D_DGBR2_Periodic_Hex_AD_btest_memcheck
 44/103 Test #1784: ErrorOrder_3D_DGBR2_Periodic_Hex_AD_btest_memcheck ...........................................   Passed   15.04 sec
        Start 1786: ErrorOrder_1D_DGBR2_AD_HB_btest_memcheck
 45/103 Test #1786: ErrorOrder_1D_DGBR2_AD_HB_btest_memcheck .....................................................   Passed   32.34 sec
        Start 1788: ErrorOrder_2D_DGAdvective_Annulus_Quad_btest_memcheck
 46/103 Test #1788: ErrorOrder_2D_DGAdvective_Annulus_Quad_btest_memcheck ........................................   Passed   14.74 sec
        Start 1790: ErrorOrder_2D_CGStabilized_RANS_MMS_btest_memcheck
 47/103 Test #1790: ErrorOrder_2D_CGStabilized_RANS_MMS_btest_memcheck ...........................................   Passed   69.93 sec
        Start 1792: Adjoint2D_HDG_Triangle_AD_mitState_btest_memcheck
 48/103 Test #1792: Adjoint2D_HDG_Triangle_AD_mitState_btest_memcheck ............................................   Passed  263.14 sec
        Start 1794: ErrorOrder_2D_DGBR2_RANS_MMS_btest_memcheck
 49/103 Test #1794: ErrorOrder_2D_DGBR2_RANS_MMS_btest_memcheck ..................................................   Passed   71.43 sec
        Start 1796: Adjoint2D_DGBR2_Triangle_AD_btest_memcheck
 50/103 Test #1796: Adjoint2D_DGBR2_Triangle_AD_btest_memcheck ...................................................   Passed   36.07 sec
        Start 1798: Adjoint2D_CG_Triangle_AD_btest_memcheck
 51/103 Test #1798: Adjoint2D_CG_Triangle_AD_btest_memcheck ......................................................   Passed   11.17 sec
        Start 1800: ElementLocalSolve3D_DGBR2_Tet_AD_btest_memcheck
 52/103 Test #1800: ElementLocalSolve3D_DGBR2_Tet_AD_btest_memcheck ..............................................   Passed  378.70 sec
        Start 1802: AlgebraicEquationSet_Local_VMSD_Triangle_AD_btest_memcheck
 53/103 Test #1802: AlgebraicEquationSet_Local_VMSD_Triangle_AD_btest_memcheck ...................................   Passed   14.75 sec
        Start 1804: LocalSolve3D_HDG_Tet_AD_btest_memcheck
 54/103 Test #1804: LocalSolve3D_HDG_Tet_AD_btest_memcheck .......................................................   Passed  851.98 sec
        Start 1806: LocalSolve3D_Split_HDG_Tet_AD_btest_memcheck
 55/103 Test #1806: LocalSolve3D_Split_HDG_Tet_AD_btest_memcheck .................................................   Passed  660.81 sec
        Start 1808: EdgeLocalSolve3D_Dual_Galerkin_Stabilized_AD_btest_memcheck
 56/103 Test #1808: EdgeLocalSolve3D_Dual_Galerkin_Stabilized_AD_btest_memcheck ..................................   Passed  131.27 sec
        Start 1810: EdgeLocalSolve2D_Dual_Galerkin_Stabilized_AR_btest_memcheck
 57/103 Test #1810: EdgeLocalSolve2D_Dual_Galerkin_Stabilized_AR_btest_memcheck ..................................   Passed  190.00 sec
        Start 1812: EdgeLocalSolve2D_Dual_Galerkin_Stabilized_Euler_btest_memcheck
 58/103 Test #1812: EdgeLocalSolve2D_Dual_Galerkin_Stabilized_Euler_btest_memcheck ...............................   Passed   18.90 sec
        Start 1814: LocalSolve2D_Split_HDG_Triangle_AD_btest_memcheck
 59/103 Test #1814: LocalSolve2D_Split_HDG_Triangle_AD_btest_memcheck ............................................   Passed   82.04 sec
        Start 1816: LocalSolve1D_Split_DGBR2_AD_btest_memcheck
 60/103 Test #1816: LocalSolve1D_Split_DGBR2_AD_btest_memcheck ...................................................   Passed   12.39 sec
        Start 1818: LocalSolve1D_HDG_AD_btest_memcheck
 61/103 Test #1818: LocalSolve1D_HDG_AD_btest_memcheck ...........................................................   Passed   13.26 sec
        Start 1820: AlgebraicEquationSet_Local_VMSDBR2_Triangle_AD_btest_memcheck
 62/103 Test #1820: AlgebraicEquationSet_Local_VMSDBR2_Triangle_AD_btest_memcheck ................................   Passed   13.25 sec
        Start 1822: LocalSolve2D_HDG_Triangle_AD_btest_memcheck
 63/103 Test #1822: LocalSolve2D_HDG_Triangle_AD_btest_memcheck ..................................................   Passed   67.54 sec
        Start 1824: ElementLocalSolve1D_DGBR2_Triangle_AD_btest_memcheck
 64/103 Test #1824: ElementLocalSolve1D_DGBR2_Triangle_AD_btest_memcheck .........................................   Passed   14.49 sec
        Start 1826: LocalSolve1D_Split_HDG_AD_btest_memcheck
 65/103 Test #1826: LocalSolve1D_Split_HDG_AD_btest_memcheck .....................................................   Passed   13.24 sec
        Start 1828: LocalSolve2D_Split_DGBR2_Triangle_AD_AV_btest_memcheck
 66/103 Test #1828: LocalSolve2D_Split_DGBR2_Triangle_AD_AV_btest_memcheck .......................................   Passed  360.17 sec
        Start 1830: ElementLocalSolve3D_DGAdvective_Tet_AD_btest_memcheck
 67/103 Test #1830: ElementLocalSolve3D_DGAdvective_Tet_AD_btest_memcheck ........................................   Passed  123.02 sec
        Start 1832: EdgeLocalSolve1D_Dual_Galerkin_Stabilized_Line_AD_btest_memcheck
 68/103 Test #1832: EdgeLocalSolve1D_Dual_Galerkin_Stabilized_Line_AD_btest_memcheck .............................   Passed   15.24 sec
        Start 1834: ElementDualLocalSolve3D_Galerkin_Stabilized_Triangle_AD_btest_memcheck
 69/103 Test #1834: ElementDualLocalSolve3D_Galerkin_Stabilized_Triangle_AD_btest_memcheck .......................   Passed  485.84 sec
        Start 1836: EdgeLocalSolve2D_Dual_Galerkin_Stabilized_AD_btest_memcheck
 70/103 Test #1836: EdgeLocalSolve2D_Dual_Galerkin_Stabilized_AD_btest_memcheck ..................................   Passed  253.92 sec
        Start 1838: ElementLocalSolve2D_DGBR2_Triangle_AD_btest_memcheck
 71/103 Test #1838: ElementLocalSolve2D_DGBR2_Triangle_AD_btest_memcheck .........................................   Passed  293.15 sec
        Start 1840: ElementDualLocalSolve2D_Galerkin_Stabilized_Triangle_AD_btest_memcheck
 72/103 Test #1840: ElementDualLocalSolve2D_Galerkin_Stabilized_Triangle_AD_btest_memcheck .......................   Passed  170.44 sec
        Start 1842: Block_1D_Decoupled_Burgers_btest_memcheck
 73/103 Test #1842: Block_1D_Decoupled_Burgers_btest_memcheck ....................................................   Passed  798.56 sec
        Start 1844: Block_1D_Decoupled_AD_btest_memcheck
 74/103 Test #1844: Block_1D_Decoupled_AD_btest_memcheck .........................................................   Passed    7.83 sec
        Start 1846: AnalyticSolve2D_HDG_Triangle_NavierStokes_UniformStream_btest_memcheck
 75/103 Test #1846: AnalyticSolve2D_HDG_Triangle_NavierStokes_UniformStream_btest_memcheck .......................   Passed   21.01 sec
        Start 1848: AnalyticSolve2D_DGAdvective_IBL_StagnationFlow_SingleElem_LamiBL_btest_memcheck
 76/103 Test #1848: AnalyticSolve2D_DGAdvective_IBL_StagnationFlow_SingleElem_LamiBL_btest_memcheck ..............   Passed   25.10 sec
        Start 1850: AnalyticSolve2D_HDG_Triangle_NavierStokes_btest_memcheck
 77/103 Test #1850: AnalyticSolve2D_HDG_Triangle_NavierStokes_btest_memcheck .....................................   Passed  880.48 sec
        Start 1852: AnalyticSolve2D_DGBR2_Triangle_NavierStokes_UniformStream_btest_memcheck
 78/103 Test #1852: AnalyticSolve2D_DGBR2_Triangle_NavierStokes_UniformStream_btest_memcheck .....................   Passed   71.03 sec
        Start 1854: AnalyticSolve2D_DGAdvective_Triangle_Euler_UniformStream_btest_memcheck
 79/103 Test #1854: AnalyticSolve2D_DGAdvective_Triangle_Euler_UniformStream_btest_memcheck ......................   Passed   86.30 sec
        Start 1856: AnalyticSolve2D_DGAdvective_IBL_StagnationFlow_LamiBL_btest_memcheck
 80/103 Test #1856: AnalyticSolve2D_DGAdvective_IBL_StagnationFlow_LamiBL_btest_memcheck .........................   Passed   40.66 sec
        Start 1858: AnalyticSolve_HDG_AD_btest_memcheck
 81/103 Test #1858: AnalyticSolve_HDG_AD_btest_memcheck ..........................................................   Passed   17.31 sec
        Start 1860: AnalyticSolve2D_DGBR2_Triangle_NavierStokes_btest_memcheck
 82/103 Test #1860: AnalyticSolve2D_DGBR2_Triangle_NavierStokes_btest_memcheck ...................................   Passed   92.49 sec
        Start 1862: PDEmitAVSensor2D_Consistency_RANSSA_btest_memcheck
 83/103 Test #1862: PDEmitAVSensor2D_Consistency_RANSSA_btest_memcheck ...........................................   Passed    3.50 sec
        Start 1864: Solve2D_Uncoupled_HDGAdvectiveIBL_LamiBL_btest_memcheck
 84/103 Test #1864: Solve2D_Uncoupled_HDGAdvectiveIBL_LamiBL_btest_memcheck ......................................   Passed  210.60 sec
        Start 1866: AlgebraicEquationSet_PTC_VMSD_Triangle_SA_btest_memcheck
 85/103 Test #1866: AlgebraicEquationSet_PTC_VMSD_Triangle_SA_btest_memcheck .....................................   Passed    1.37 sec
        Start 1868: PDEmitAVSensor1D_Consistency_btest_memcheck
 86/103 Test #1868: PDEmitAVSensor1D_Consistency_btest_memcheck ..................................................   Passed    3.59 sec
        Start 1870: PDEEulermitAVDiffusion3D_RANSSA_Consistency_btest_memcheck
 87/103 Test #1870: PDEEulermitAVDiffusion3D_RANSSA_Consistency_btest_memcheck ...................................   Passed    3.15 sec
        Start 1872: Solve2D_Coupled4x4_IBLSplitAmpLag_CorrelationClosure_CapturedTransition_PTC_btest_memcheck
 88/103 Test #1872: Solve2D_Coupled4x4_IBLSplitAmpLag_CorrelationClosure_CapturedTransition_PTC_btest_memcheck ...   Passed  544.34 sec
        Start 1874: PDEEulermitAVDiffusion3D_Consistency_btest_memcheck
 89/103 Test #1874: PDEEulermitAVDiffusion3D_Consistency_btest_memcheck ..........................................   Passed    3.46 sec
        Start 1876: Solve2D_Coupled4x4_IBL_Panel_NACA0004_FittedTransition_TwoLayerNewton_btest_memcheck
 90/103 Test #1876: Solve2D_Coupled4x4_IBL_Panel_NACA0004_FittedTransition_TwoLayerNewton_btest_memcheck .........   Passed  1558.09 sec
        Start 1878: PDEEulermitAVDiffusion1D_Consistency_btest_memcheck
 91/103 Test #1878: PDEEulermitAVDiffusion1D_Consistency_btest_memcheck ..........................................   Passed    1.97 sec
        Start 1880: PDEEulermitAVDiffusion2D_RANSSA_Consistency_btest_memcheck
 92/103 Test #1880: PDEEulermitAVDiffusion2D_RANSSA_Consistency_btest_memcheck ...................................   Passed    1.79 sec
        Start 1882: BCEulermitAVSensor2D_Consistency_RANSSA_btest_memcheck
 93/103 Test #1882: BCEulermitAVSensor2D_Consistency_RANSSA_btest_memcheck .......................................   Passed    3.41 sec
        Start 1884: BCEulermitAVSensor3D_Consistency_btest_memcheck
 94/103 Test #1884: BCEulermitAVSensor3D_Consistency_btest_memcheck ..............................................   Passed    3.11 sec
        Start 1886: BCEulermitAVSensor3D_Consistency_RANSSA_btest_memcheck
 95/103 Test #1886: BCEulermitAVSensor3D_Consistency_RANSSA_btest_memcheck .......................................   Passed    3.02 sec
        Start 1888: Solve2D_Uncoupled_DGAdvectiveIBLUniField_CorrelationClosure_LamiBL_btest_memcheck
 96/103 Test #1888: Solve2D_Uncoupled_DGAdvectiveIBLUniField_CorrelationClosure_LamiBL_btest_memcheck ............   Passed   51.65 sec
        Start 1890: PDEmitAVSensor2D_Consistency_btest_memcheck
 97/103 Test #1890: PDEmitAVSensor2D_Consistency_btest_memcheck ..................................................   Passed    6.16 sec
        Start 1892: PDEmitAVSensor3D_Consistency_RANSSA_btest_memcheck
 98/103 Test #1892: PDEmitAVSensor3D_Consistency_RANSSA_btest_memcheck ...........................................   Passed    3.38 sec
        Start 1894: Solve2D_XfoilLikePanelMethod_btest_memcheck
 99/103 Test #1894: Solve2D_XfoilLikePanelMethod_btest_memcheck ..................................................   Passed  666.45 sec
        Start 1896: PDEmitAVSensor3D_Consistency_btest_memcheck
100/103 Test #1896: PDEmitAVSensor3D_Consistency_btest_memcheck ..................................................   Passed    6.39 sec
        Start 1898: Solve2D_Uncoupled_DGAdvectiveIBL_LamiBL_PTC_btest_memcheck
101/103 Test #1898: Solve2D_Uncoupled_DGAdvectiveIBL_LamiBL_PTC_btest_memcheck ...................................   Passed  792.92 sec
        Start 1900: BCEulermitAVSensor2D_Consistency_btest_memcheck
102/103 Test #1900: BCEulermitAVSensor2D_Consistency_btest_memcheck ..............................................   Passed    5.89 sec
        Start 1902: PDEEulermitAVDiffusion2D_Consistency_btest_memcheck
103/103 Test #1902: PDEEulermitAVDiffusion2D_Consistency_btest_memcheck ..........................................   Passed    3.90 sec

99% tests passed, 1 tests failed out of 103

Label Time Summary:
SANSMemCheck_system    = 21930.73 sec (103 tests)

Total Test time (real) = 21930.96 sec

The following tests FAILED:
	1712 - ErrorOrder_4D_DG_Pentatope_btest_memcheck (Timeout)
Errors while running CTest
test/system/CMakeFiles/memcheck_system.dir/build.make:57: recipe for target 'test/system/CMakeFiles/memcheck_system' failed
make[3]: *** [test/system/CMakeFiles/memcheck_system] Error 8
CMakeFiles/Makefile2:177155: recipe for target 'test/system/CMakeFiles/memcheck_system.dir/all' failed
make[2]: *** [test/system/CMakeFiles/memcheck_system.dir/all] Error 2
CMakeFiles/Makefile2:177162: recipe for target 'test/system/CMakeFiles/memcheck_system.dir/rule' failed
make[1]: *** [test/system/CMakeFiles/memcheck_system.dir/rule] Error 2
Makefile:62001: recipe for target 'memcheck_system' failed
make: *** [memcheck_system] Error 2

real	445m23.794s
user	421m12.208s
sys	8m30.828s
+ status=1
++ find /jenkins/workspace/SANS_Weekly/builddir/debug_clang/buildnode/reynolds/build/debug_clang -name Test.xml
+ mv /jenkins/workspace/SANS_Weekly/builddir/debug_clang/buildnode/reynolds/build/debug_clang/Testing/20200417-0217/Test.xml /jenkins/workspace/SANS_Weekly/builddir/debug_clang/buildnode/reynolds/build/Test_system_memcheck.xml
+ '[' 1 -eq 1 ']'
+ exit 1
Build step 'Execute shell' marked build as failure
[GNU C Compiler (gcc)Clang (LLVM based)Intel Compiler (C, Fortran)Vera++] Skipping execution of recorder since overall result is 'FAILURE'
[Valgrind] Files to copy:
[Valgrind] build/debug_clang/test/valgrind.10364.memcheck.xml
[Valgrind] build/debug_clang/test/valgrind.10716.memcheck.xml
[Valgrind] build/debug_clang/test/valgrind.1188.memcheck.xml
[Valgrind] build/debug_clang/test/valgrind.12931.memcheck.xml
[Valgrind] build/debug_clang/test/valgrind.13456.memcheck.xml
[Valgrind] build/debug_clang/test/valgrind.14549.memcheck.xml
[Valgrind] build/debug_clang/test/valgrind.14740.memcheck.xml
[Valgrind] build/debug_clang/test/valgrind.15319.memcheck.xml
[Valgrind] build/debug_clang/test/valgrind.15348.memcheck.xml
[Valgrind] build/debug_clang/test/valgrind.15899.memcheck.xml
[Valgrind] build/debug_clang/test/valgrind.16005.memcheck.xml
[Valgrind] build/debug_clang/test/valgrind.16325.memcheck.xml
[Valgrind] build/debug_clang/test/valgrind.16332.memcheck.xml
[Valgrind] build/debug_clang/test/valgrind.16900.memcheck.xml
[Valgrind] build/debug_clang/test/valgrind.17127.memcheck.xml
[Valgrind] build/debug_clang/test/valgrind.17444.memcheck.xml
[Valgrind] build/debug_clang/test/valgrind.17603.memcheck.xml
[Valgrind] build/debug_clang/test/valgrind.18561.memcheck.xml
[Valgrind] build/debug_clang/test/valgrind.18895.memcheck.xml
[Valgrind] build/debug_clang/test/valgrind.19532.memcheck.xml
[Valgrind] build/debug_clang/test/valgrind.20351.memcheck.xml
[Valgrind] build/debug_clang/test/valgrind.20565.memcheck.xml
[Valgrind] build/debug_clang/test/valgrind.21001.memcheck.xml
[Valgrind] build/debug_clang/test/valgrind.2123.memcheck.xml
[Valgrind] build/debug_clang/test/valgrind.21421.memcheck.xml
[Valgrind] build/debug_clang/test/valgrind.21894.memcheck.xml
[Valgrind] build/debug_clang/test/valgrind.21903.memcheck.xml
[Valgrind] build/debug_clang/test/valgrind.21946.memcheck.xml
[Valgrind] build/debug_clang/test/valgrind.22236.memcheck.xml
[Valgrind] build/debug_clang/test/valgrind.23192.memcheck.xml
[Valgrind] build/debug_clang/test/valgrind.24142.memcheck.xml
[Valgrind] build/debug_clang/test/valgrind.24157.memcheck.xml
[Valgrind] build/debug_clang/test/valgrind.24544.memcheck.xml
[Valgrind] build/debug_clang/test/valgrind.24725.memcheck.xml
[Valgrind] build/debug_clang/test/valgrind.25109.memcheck.xml
[Valgrind] build/debug_clang/test/valgrind.25152.memcheck.xml
[Valgrind] build/debug_clang/test/valgrind.25311.memcheck.xml
[Valgrind] build/debug_clang/test/valgrind.25336.memcheck.xml
[Valgrind] build/debug_clang/test/valgrind.25681.memcheck.xml
[Valgrind] build/debug_clang/test/valgrind.26594.memcheck.xml
[Valgrind] build/debug_clang/test/valgrind.26602.memcheck.xml
[Valgrind] build/debug_clang/test/valgrind.26603.memcheck.xml
[Valgrind] build/debug_clang/test/valgrind.27154.memcheck.xml
[Valgrind] build/debug_clang/test/valgrind.2866.memcheck.xml
[Valgrind] build/debug_clang/test/valgrind.28698.memcheck.xml
[Valgrind] build/debug_clang/test/valgrind.29258.memcheck.xml
[Valgrind] build/debug_clang/test/valgrind.30148.memcheck.xml
[Valgrind] build/debug_clang/test/valgrind.30222.memcheck.xml
[Valgrind] build/debug_clang/test/valgrind.30649.memcheck.xml
[Valgrind] build/debug_clang/test/valgrind.31005.memcheck.xml
[Valgrind] build/debug_clang/test/valgrind.31206.memcheck.xml
[Valgrind] build/debug_clang/test/valgrind.31605.memcheck.xml
[Valgrind] build/debug_clang/test/valgrind.31640.memcheck.xml
[Valgrind] build/debug_clang/test/valgrind.31839.memcheck.xml
[Valgrind] build/debug_clang/test/valgrind.32141.memcheck.xml
[Valgrind] build/debug_clang/test/valgrind.32242.memcheck.xml
[Valgrind] build/debug_clang/test/valgrind.32328.memcheck.xml
[Valgrind] build/debug_clang/test/valgrind.32365.memcheck.xml
[Valgrind] build/debug_clang/test/valgrind.32523.memcheck.xml
[Valgrind] build/debug_clang/test/valgrind.32555.memcheck.xml
[Valgrind] build/debug_clang/test/valgrind.32648.memcheck.xml
[Valgrind] build/debug_clang/test/valgrind.32664.memcheck.xml
[Valgrind] build/debug_clang/test/valgrind.32880.memcheck.xml
[Valgrind] build/debug_clang/test/valgrind.32894.memcheck.xml
[Valgrind] build/debug_clang/test/valgrind.32904.memcheck.xml
[Valgrind] build/debug_clang/test/valgrind.3417.memcheck.xml
[Valgrind] build/debug_clang/test/valgrind.35653.memcheck.xml
[Valgrind] build/debug_clang/test/valgrind.35798.memcheck.xml
[Valgrind] build/debug_clang/test/valgrind.36432.memcheck.xml
[Valgrind] build/debug_clang/test/valgrind.36447.memcheck.xml
[Valgrind] build/debug_clang/test/valgrind.36587.memcheck.xml
[Valgrind] build/debug_clang/test/valgrind.36597.memcheck.xml
[Valgrind] build/debug_clang/test/valgrind.36606.memcheck.xml
[Valgrind] build/debug_clang/test/valgrind.36626.memcheck.xml
[Valgrind] build/debug_clang/test/valgrind.38209.memcheck.xml
[Valgrind] build/debug_clang/test/valgrind.38210.memcheck.xml
[Valgrind] build/debug_clang/test/valgrind.38211.memcheck.xml
[Valgrind] build/debug_clang/test/valgrind.38212.memcheck.xml
[Valgrind] build/debug_clang/test/valgrind.38213.memcheck.xml
[Valgrind] build/debug_clang/test/valgrind.38214.memcheck.xml
[Valgrind] build/debug_clang/test/valgrind.38216.memcheck.xml
[Valgrind] build/debug_clang/test/valgrind.38223.memcheck.xml
[Valgrind] build/debug_clang/test/valgrind.38224.memcheck.xml
[Valgrind] build/debug_clang/test/valgrind.38667.memcheck.xml
[Valgrind] build/debug_clang/test/valgrind.38678.memcheck.xml
[Valgrind] build/debug_clang/test/valgrind.39743.memcheck.xml
[Valgrind] build/debug_clang/test/valgrind.40044.memcheck.xml
[Valgrind] build/debug_clang/test/valgrind.4017.memcheck.xml
[Valgrind] build/debug_clang/test/valgrind.40191.memcheck.xml
[Valgrind] build/debug_clang/test/valgrind.40259.memcheck.xml
[Valgrind] build/debug_clang/test/valgrind.40279.memcheck.xml
[Valgrind] build/debug_clang/test/valgrind.5508.memcheck.xml
[Valgrind] build/debug_clang/test/valgrind.5684.memcheck.xml
[Valgrind] build/debug_clang/test/valgrind.6052.memcheck.xml
[Valgrind] build/debug_clang/test/valgrind.6581.memcheck.xml
[Valgrind] build/debug_clang/test/valgrind.6849.memcheck.xml
[Valgrind] build/debug_clang/test/valgrind.7245.memcheck.xml
[Valgrind] build/debug_clang/test/valgrind.7367.memcheck.xml
[Valgrind] build/debug_clang/test/valgrind.7575.memcheck.xml
[Valgrind] build/debug_clang/test/valgrind.7832.memcheck.xml
[Valgrind] build/debug_clang/test/valgrind.7905.memcheck.xml
[Valgrind] build/debug_clang/test/valgrind.7925.memcheck.xml
[Valgrind] build/debug_clang/test/valgrind.8877.memcheck.xml
[Valgrind] Copying build/debug_clang/test/valgrind.10364.memcheck.xml to /var/lib/jenkins/jobs/SANS_Weekly/configurations/axis-builddir/debug_clang/axis-buildnode/reynolds/builds/260/valgrind-plugin/valgrind-results/build/debug_clang/test/valgrind.10364.memcheck.xml
[Valgrind] Copying build/debug_clang/test/valgrind.10716.memcheck.xml to /var/lib/jenkins/jobs/SANS_Weekly/configurations/axis-builddir/debug_clang/axis-buildnode/reynolds/builds/260/valgrind-plugin/valgrind-results/build/debug_clang/test/valgrind.10716.memcheck.xml
[Valgrind] Copying build/debug_clang/test/valgrind.1188.memcheck.xml to /var/lib/jenkins/jobs/SANS_Weekly/configurations/axis-builddir/debug_clang/axis-buildnode/reynolds/builds/260/valgrind-plugin/valgrind-results/build/debug_clang/test/valgrind.1188.memcheck.xml
[Valgrind] Copying build/debug_clang/test/valgrind.12931.memcheck.xml to /var/lib/jenkins/jobs/SANS_Weekly/configurations/axis-builddir/debug_clang/axis-buildnode/reynolds/builds/260/valgrind-plugin/valgrind-results/build/debug_clang/test/valgrind.12931.memcheck.xml
[Valgrind] Copying build/debug_clang/test/valgrind.13456.memcheck.xml to /var/lib/jenkins/jobs/SANS_Weekly/configurations/axis-builddir/debug_clang/axis-buildnode/reynolds/builds/260/valgrind-plugin/valgrind-results/build/debug_clang/test/valgrind.13456.memcheck.xml
[Valgrind] Copying build/debug_clang/test/valgrind.14549.memcheck.xml to /var/lib/jenkins/jobs/SANS_Weekly/configurations/axis-builddir/debug_clang/axis-buildnode/reynolds/builds/260/valgrind-plugin/valgrind-results/build/debug_clang/test/valgrind.14549.memcheck.xml
[Valgrind] Copying build/debug_clang/test/valgrind.14740.memcheck.xml to /var/lib/jenkins/jobs/SANS_Weekly/configurations/axis-builddir/debug_clang/axis-buildnode/reynolds/builds/260/valgrind-plugin/valgrind-results/build/debug_clang/test/valgrind.14740.memcheck.xml
[Valgrind] Copying build/debug_clang/test/valgrind.15319.memcheck.xml to /var/lib/jenkins/jobs/SANS_Weekly/configurations/axis-builddir/debug_clang/axis-buildnode/reynolds/builds/260/valgrind-plugin/valgrind-results/build/debug_clang/test/valgrind.15319.memcheck.xml
[Valgrind] Copying build/debug_clang/test/valgrind.15348.memcheck.xml to /var/lib/jenkins/jobs/SANS_Weekly/configurations/axis-builddir/debug_clang/axis-buildnode/reynolds/builds/260/valgrind-plugin/valgrind-results/build/debug_clang/test/valgrind.15348.memcheck.xml
[Valgrind] Copying build/debug_clang/test/valgrind.15899.memcheck.xml to /var/lib/jenkins/jobs/SANS_Weekly/configurations/axis-builddir/debug_clang/axis-buildnode/reynolds/builds/260/valgrind-plugin/valgrind-results/build/debug_clang/test/valgrind.15899.memcheck.xml
[Valgrind] Copying build/debug_clang/test/valgrind.16005.memcheck.xml to /var/lib/jenkins/jobs/SANS_Weekly/configurations/axis-builddir/debug_clang/axis-buildnode/reynolds/builds/260/valgrind-plugin/valgrind-results/build/debug_clang/test/valgrind.16005.memcheck.xml
[Valgrind] Copying build/debug_clang/test/valgrind.16325.memcheck.xml to /var/lib/jenkins/jobs/SANS_Weekly/configurations/axis-builddir/debug_clang/axis-buildnode/reynolds/builds/260/valgrind-plugin/valgrind-results/build/debug_clang/test/valgrind.16325.memcheck.xml
[Valgrind] Copying build/debug_clang/test/valgrind.16332.memcheck.xml to /var/lib/jenkins/jobs/SANS_Weekly/configurations/axis-builddir/debug_clang/axis-buildnode/reynolds/builds/260/valgrind-plugin/valgrind-results/build/debug_clang/test/valgrind.16332.memcheck.xml
[Valgrind] Copying build/debug_clang/test/valgrind.16900.memcheck.xml to /var/lib/jenkins/jobs/SANS_Weekly/configurations/axis-builddir/debug_clang/axis-buildnode/reynolds/builds/260/valgrind-plugin/valgrind-results/build/debug_clang/test/valgrind.16900.memcheck.xml
[Valgrind] Copying build/debug_clang/test/valgrind.17127.memcheck.xml to /var/lib/jenkins/jobs/SANS_Weekly/configurations/axis-builddir/debug_clang/axis-buildnode/reynolds/builds/260/valgrind-plugin/valgrind-results/build/debug_clang/test/valgrind.17127.memcheck.xml
[Valgrind] Copying build/debug_clang/test/valgrind.17444.memcheck.xml to /var/lib/jenkins/jobs/SANS_Weekly/configurations/axis-builddir/debug_clang/axis-buildnode/reynolds/builds/260/valgrind-plugin/valgrind-results/build/debug_clang/test/valgrind.17444.memcheck.xml
[Valgrind] Copying build/debug_clang/test/valgrind.17603.memcheck.xml to /var/lib/jenkins/jobs/SANS_Weekly/configurations/axis-builddir/debug_clang/axis-buildnode/reynolds/builds/260/valgrind-plugin/valgrind-results/build/debug_clang/test/valgrind.17603.memcheck.xml
[Valgrind] Copying build/debug_clang/test/valgrind.18561.memcheck.xml to /var/lib/jenkins/jobs/SANS_Weekly/configurations/axis-builddir/debug_clang/axis-buildnode/reynolds/builds/260/valgrind-plugin/valgrind-results/build/debug_clang/test/valgrind.18561.memcheck.xml
[Valgrind] Copying build/debug_clang/test/valgrind.18895.memcheck.xml to /var/lib/jenkins/jobs/SANS_Weekly/configurations/axis-builddir/debug_clang/axis-buildnode/reynolds/builds/260/valgrind-plugin/valgrind-results/build/debug_clang/test/valgrind.18895.memcheck.xml
[Valgrind] Copying build/debug_clang/test/valgrind.19532.memcheck.xml to /var/lib/jenkins/jobs/SANS_Weekly/configurations/axis-builddir/debug_clang/axis-buildnode/reynolds/builds/260/valgrind-plugin/valgrind-results/build/debug_clang/test/valgrind.19532.memcheck.xml
[Valgrind] Copying build/debug_clang/test/valgrind.20351.memcheck.xml to /var/lib/jenkins/jobs/SANS_Weekly/configurations/axis-builddir/debug_clang/axis-buildnode/reynolds/builds/260/valgrind-plugin/valgrind-results/build/debug_clang/test/valgrind.20351.memcheck.xml
[Valgrind] Copying build/debug_clang/test/valgrind.20565.memcheck.xml to /var/lib/jenkins/jobs/SANS_Weekly/configurations/axis-builddir/debug_clang/axis-buildnode/reynolds/builds/260/valgrind-plugin/valgrind-results/build/debug_clang/test/valgrind.20565.memcheck.xml
[Valgrind] Copying build/debug_clang/test/valgrind.21001.memcheck.xml to /var/lib/jenkins/jobs/SANS_Weekly/configurations/axis-builddir/debug_clang/axis-buildnode/reynolds/builds/260/valgrind-plugin/valgrind-results/build/debug_clang/test/valgrind.21001.memcheck.xml
[Valgrind] Copying build/debug_clang/test/valgrind.2123.memcheck.xml to /var/lib/jenkins/jobs/SANS_Weekly/configurations/axis-builddir/debug_clang/axis-buildnode/reynolds/builds/260/valgrind-plugin/valgrind-results/build/debug_clang/test/valgrind.2123.memcheck.xml
[Valgrind] Copying build/debug_clang/test/valgrind.21421.memcheck.xml to /var/lib/jenkins/jobs/SANS_Weekly/configurations/axis-builddir/debug_clang/axis-buildnode/reynolds/builds/260/valgrind-plugin/valgrind-results/build/debug_clang/test/valgrind.21421.memcheck.xml
[Valgrind] Copying build/debug_clang/test/valgrind.21894.memcheck.xml to /var/lib/jenkins/jobs/SANS_Weekly/configurations/axis-builddir/debug_clang/axis-buildnode/reynolds/builds/260/valgrind-plugin/valgrind-results/build/debug_clang/test/valgrind.21894.memcheck.xml
[Valgrind] Copying build/debug_clang/test/valgrind.21903.memcheck.xml to /var/lib/jenkins/jobs/SANS_Weekly/configurations/axis-builddir/debug_clang/axis-buildnode/reynolds/builds/260/valgrind-plugin/valgrind-results/build/debug_clang/test/valgrind.21903.memcheck.xml
[Valgrind] Copying build/debug_clang/test/valgrind.21946.memcheck.xml to /var/lib/jenkins/jobs/SANS_Weekly/configurations/axis-builddir/debug_clang/axis-buildnode/reynolds/builds/260/valgrind-plugin/valgrind-results/build/debug_clang/test/valgrind.21946.memcheck.xml
[Valgrind] Copying build/debug_clang/test/valgrind.22236.memcheck.xml to /var/lib/jenkins/jobs/SANS_Weekly/configurations/axis-builddir/debug_clang/axis-buildnode/reynolds/builds/260/valgrind-plugin/valgrind-results/build/debug_clang/test/valgrind.22236.memcheck.xml
[Valgrind] Copying build/debug_clang/test/valgrind.23192.memcheck.xml to /var/lib/jenkins/jobs/SANS_Weekly/configurations/axis-builddir/debug_clang/axis-buildnode/reynolds/builds/260/valgrind-plugin/valgrind-results/build/debug_clang/test/valgrind.23192.memcheck.xml
[Valgrind] Copying build/debug_clang/test/valgrind.24142.memcheck.xml to /var/lib/jenkins/jobs/SANS_Weekly/configurations/axis-builddir/debug_clang/axis-buildnode/reynolds/builds/260/valgrind-plugin/valgrind-results/build/debug_clang/test/valgrind.24142.memcheck.xml
[Valgrind] Copying build/debug_clang/test/valgrind.24157.memcheck.xml to /var/lib/jenkins/jobs/SANS_Weekly/configurations/axis-builddir/debug_clang/axis-buildnode/reynolds/builds/260/valgrind-plugin/valgrind-results/build/debug_clang/test/valgrind.24157.memcheck.xml
[Valgrind] Copying build/debug_clang/test/valgrind.24544.memcheck.xml to /var/lib/jenkins/jobs/SANS_Weekly/configurations/axis-builddir/debug_clang/axis-buildnode/reynolds/builds/260/valgrind-plugin/valgrind-results/build/debug_clang/test/valgrind.24544.memcheck.xml
[Valgrind] Copying build/debug_clang/test/valgrind.24725.memcheck.xml to /var/lib/jenkins/jobs/SANS_Weekly/configurations/axis-builddir/debug_clang/axis-buildnode/reynolds/builds/260/valgrind-plugin/valgrind-results/build/debug_clang/test/valgrind.24725.memcheck.xml
[Valgrind] Copying build/debug_clang/test/valgrind.25109.memcheck.xml to /var/lib/jenkins/jobs/SANS_Weekly/configurations/axis-builddir/debug_clang/axis-buildnode/reynolds/builds/260/valgrind-plugin/valgrind-results/build/debug_clang/test/valgrind.25109.memcheck.xml
[Valgrind] Copying build/debug_clang/test/valgrind.25152.memcheck.xml to /var/lib/jenkins/jobs/SANS_Weekly/configurations/axis-builddir/debug_clang/axis-buildnode/reynolds/builds/260/valgrind-plugin/valgrind-results/build/debug_clang/test/valgrind.25152.memcheck.xml
[Valgrind] Copying build/debug_clang/test/valgrind.25311.memcheck.xml to /var/lib/jenkins/jobs/SANS_Weekly/configurations/axis-builddir/debug_clang/axis-buildnode/reynolds/builds/260/valgrind-plugin/valgrind-results/build/debug_clang/test/valgrind.25311.memcheck.xml
[Valgrind] Copying build/debug_clang/test/valgrind.25336.memcheck.xml to /var/lib/jenkins/jobs/SANS_Weekly/configurations/axis-builddir/debug_clang/axis-buildnode/reynolds/builds/260/valgrind-plugin/valgrind-results/build/debug_clang/test/valgrind.25336.memcheck.xml
[Valgrind] Copying build/debug_clang/test/valgrind.25681.memcheck.xml to /var/lib/jenkins/jobs/SANS_Weekly/configurations/axis-builddir/debug_clang/axis-buildnode/reynolds/builds/260/valgrind-plugin/valgrind-results/build/debug_clang/test/valgrind.25681.memcheck.xml
[Valgrind] Copying build/debug_clang/test/valgrind.26594.memcheck.xml to /var/lib/jenkins/jobs/SANS_Weekly/configurations/axis-builddir/debug_clang/axis-buildnode/reynolds/builds/260/valgrind-plugin/valgrind-results/build/debug_clang/test/valgrind.26594.memcheck.xml
[Valgrind] Copying build/debug_clang/test/valgrind.26602.memcheck.xml to /var/lib/jenkins/jobs/SANS_Weekly/configurations/axis-builddir/debug_clang/axis-buildnode/reynolds/builds/260/valgrind-plugin/valgrind-results/build/debug_clang/test/valgrind.26602.memcheck.xml
[Valgrind] Copying build/debug_clang/test/valgrind.26603.memcheck.xml to /var/lib/jenkins/jobs/SANS_Weekly/configurations/axis-builddir/debug_clang/axis-buildnode/reynolds/builds/260/valgrind-plugin/valgrind-results/build/debug_clang/test/valgrind.26603.memcheck.xml
[Valgrind] Copying build/debug_clang/test/valgrind.27154.memcheck.xml to /var/lib/jenkins/jobs/SANS_Weekly/configurations/axis-builddir/debug_clang/axis-buildnode/reynolds/builds/260/valgrind-plugin/valgrind-results/build/debug_clang/test/valgrind.27154.memcheck.xml
[Valgrind] Copying build/debug_clang/test/valgrind.2866.memcheck.xml to /var/lib/jenkins/jobs/SANS_Weekly/configurations/axis-builddir/debug_clang/axis-buildnode/reynolds/builds/260/valgrind-plugin/valgrind-results/build/debug_clang/test/valgrind.2866.memcheck.xml
[Valgrind] Copying build/debug_clang/test/valgrind.28698.memcheck.xml to /var/lib/jenkins/jobs/SANS_Weekly/configurations/axis-builddir/debug_clang/axis-buildnode/reynolds/builds/260/valgrind-plugin/valgrind-results/build/debug_clang/test/valgrind.28698.memcheck.xml
[Valgrind] Copying build/debug_clang/test/valgrind.29258.memcheck.xml to /var/lib/jenkins/jobs/SANS_Weekly/configurations/axis-builddir/debug_clang/axis-buildnode/reynolds/builds/260/valgrind-plugin/valgrind-results/build/debug_clang/test/valgrind.29258.memcheck.xml
[Valgrind] Copying build/debug_clang/test/valgrind.30148.memcheck.xml to /var/lib/jenkins/jobs/SANS_Weekly/configurations/axis-builddir/debug_clang/axis-buildnode/reynolds/builds/260/valgrind-plugin/valgrind-results/build/debug_clang/test/valgrind.30148.memcheck.xml
[Valgrind] Copying build/debug_clang/test/valgrind.30222.memcheck.xml to /var/lib/jenkins/jobs/SANS_Weekly/configurations/axis-builddir/debug_clang/axis-buildnode/reynolds/builds/260/valgrind-plugin/valgrind-results/build/debug_clang/test/valgrind.30222.memcheck.xml
[Valgrind] Copying build/debug_clang/test/valgrind.30649.memcheck.xml to /var/lib/jenkins/jobs/SANS_Weekly/configurations/axis-builddir/debug_clang/axis-buildnode/reynolds/builds/260/valgrind-plugin/valgrind-results/build/debug_clang/test/valgrind.30649.memcheck.xml
[Valgrind] Copying build/debug_clang/test/valgrind.31005.memcheck.xml to /var/lib/jenkins/jobs/SANS_Weekly/configurations/axis-builddir/debug_clang/axis-buildnode/reynolds/builds/260/valgrind-plugin/valgrind-results/build/debug_clang/test/valgrind.31005.memcheck.xml
[Valgrind] Copying build/debug_clang/test/valgrind.31206.memcheck.xml to /var/lib/jenkins/jobs/SANS_Weekly/configurations/axis-builddir/debug_clang/axis-buildnode/reynolds/builds/260/valgrind-plugin/valgrind-results/build/debug_clang/test/valgrind.31206.memcheck.xml
[Valgrind] Copying build/debug_clang/test/valgrind.31605.memcheck.xml to /var/lib/jenkins/jobs/SANS_Weekly/configurations/axis-builddir/debug_clang/axis-buildnode/reynolds/builds/260/valgrind-plugin/valgrind-results/build/debug_clang/test/valgrind.31605.memcheck.xml
[Valgrind] Copying build/debug_clang/test/valgrind.31640.memcheck.xml to /var/lib/jenkins/jobs/SANS_Weekly/configurations/axis-builddir/debug_clang/axis-buildnode/reynolds/builds/260/valgrind-plugin/valgrind-results/build/debug_clang/test/valgrind.31640.memcheck.xml
[Valgrind] Copying build/debug_clang/test/valgrind.31839.memcheck.xml to /var/lib/jenkins/jobs/SANS_Weekly/configurations/axis-builddir/debug_clang/axis-buildnode/reynolds/builds/260/valgrind-plugin/valgrind-results/build/debug_clang/test/valgrind.31839.memcheck.xml
[Valgrind] Copying build/debug_clang/test/valgrind.32141.memcheck.xml to /var/lib/jenkins/jobs/SANS_Weekly/configurations/axis-builddir/debug_clang/axis-buildnode/reynolds/builds/260/valgrind-plugin/valgrind-results/build/debug_clang/test/valgrind.32141.memcheck.xml
[Valgrind] Copying build/debug_clang/test/valgrind.32242.memcheck.xml to /var/lib/jenkins/jobs/SANS_Weekly/configurations/axis-builddir/debug_clang/axis-buildnode/reynolds/builds/260/valgrind-plugin/valgrind-results/build/debug_clang/test/valgrind.32242.memcheck.xml
[Valgrind] Copying build/debug_clang/test/valgrind.32328.memcheck.xml to /var/lib/jenkins/jobs/SANS_Weekly/configurations/axis-builddir/debug_clang/axis-buildnode/reynolds/builds/260/valgrind-plugin/valgrind-results/build/debug_clang/test/valgrind.32328.memcheck.xml
[Valgrind] Copying build/debug_clang/test/valgrind.32365.memcheck.xml to /var/lib/jenkins/jobs/SANS_Weekly/configurations/axis-builddir/debug_clang/axis-buildnode/reynolds/builds/260/valgrind-plugin/valgrind-results/build/debug_clang/test/valgrind.32365.memcheck.xml
[Valgrind] Copying build/debug_clang/test/valgrind.32523.memcheck.xml to /var/lib/jenkins/jobs/SANS_Weekly/configurations/axis-builddir/debug_clang/axis-buildnode/reynolds/builds/260/valgrind-plugin/valgrind-results/build/debug_clang/test/valgrind.32523.memcheck.xml
[Valgrind] Copying build/debug_clang/test/valgrind.32555.memcheck.xml to /var/lib/jenkins/jobs/SANS_Weekly/configurations/axis-builddir/debug_clang/axis-buildnode/reynolds/builds/260/valgrind-plugin/valgrind-results/build/debug_clang/test/valgrind.32555.memcheck.xml
[Valgrind] Copying build/debug_clang/test/valgrind.32648.memcheck.xml to /var/lib/jenkins/jobs/SANS_Weekly/configurations/axis-builddir/debug_clang/axis-buildnode/reynolds/builds/260/valgrind-plugin/valgrind-results/build/debug_clang/test/valgrind.32648.memcheck.xml
[Valgrind] Copying build/debug_clang/test/valgrind.32664.memcheck.xml to /var/lib/jenkins/jobs/SANS_Weekly/configurations/axis-builddir/debug_clang/axis-buildnode/reynolds/builds/260/valgrind-plugin/valgrind-results/build/debug_clang/test/valgrind.32664.memcheck.xml
[Valgrind] Copying build/debug_clang/test/valgrind.32880.memcheck.xml to /var/lib/jenkins/jobs/SANS_Weekly/configurations/axis-builddir/debug_clang/axis-buildnode/reynolds/builds/260/valgrind-plugin/valgrind-results/build/debug_clang/test/valgrind.32880.memcheck.xml
[Valgrind] Copying build/debug_clang/test/valgrind.32894.memcheck.xml to /var/lib/jenkins/jobs/SANS_Weekly/configurations/axis-builddir/debug_clang/axis-buildnode/reynolds/builds/260/valgrind-plugin/valgrind-results/build/debug_clang/test/valgrind.32894.memcheck.xml
[Valgrind] Copying build/debug_clang/test/valgrind.32904.memcheck.xml to /var/lib/jenkins/jobs/SANS_Weekly/configurations/axis-builddir/debug_clang/axis-buildnode/reynolds/builds/260/valgrind-plugin/valgrind-results/build/debug_clang/test/valgrind.32904.memcheck.xml
[Valgrind] Copying build/debug_clang/test/valgrind.3417.memcheck.xml to /var/lib/jenkins/jobs/SANS_Weekly/configurations/axis-builddir/debug_clang/axis-buildnode/reynolds/builds/260/valgrind-plugin/valgrind-results/build/debug_clang/test/valgrind.3417.memcheck.xml
[Valgrind] Copying build/debug_clang/test/valgrind.35653.memcheck.xml to /var/lib/jenkins/jobs/SANS_Weekly/configurations/axis-builddir/debug_clang/axis-buildnode/reynolds/builds/260/valgrind-plugin/valgrind-results/build/debug_clang/test/valgrind.35653.memcheck.xml
[Valgrind] Copying build/debug_clang/test/valgrind.35798.memcheck.xml to /var/lib/jenkins/jobs/SANS_Weekly/configurations/axis-builddir/debug_clang/axis-buildnode/reynolds/builds/260/valgrind-plugin/valgrind-results/build/debug_clang/test/valgrind.35798.memcheck.xml
[Valgrind] Copying build/debug_clang/test/valgrind.36432.memcheck.xml to /var/lib/jenkins/jobs/SANS_Weekly/configurations/axis-builddir/debug_clang/axis-buildnode/reynolds/builds/260/valgrind-plugin/valgrind-results/build/debug_clang/test/valgrind.36432.memcheck.xml
[Valgrind] Copying build/debug_clang/test/valgrind.36447.memcheck.xml to /var/lib/jenkins/jobs/SANS_Weekly/configurations/axis-builddir/debug_clang/axis-buildnode/reynolds/builds/260/valgrind-plugin/valgrind-results/build/debug_clang/test/valgrind.36447.memcheck.xml
[Valgrind] Copying build/debug_clang/test/valgrind.36587.memcheck.xml to /var/lib/jenkins/jobs/SANS_Weekly/configurations/axis-builddir/debug_clang/axis-buildnode/reynolds/builds/260/valgrind-plugin/valgrind-results/build/debug_clang/test/valgrind.36587.memcheck.xml
[Valgrind] Copying build/debug_clang/test/valgrind.36597.memcheck.xml to /var/lib/jenkins/jobs/SANS_Weekly/configurations/axis-builddir/debug_clang/axis-buildnode/reynolds/builds/260/valgrind-plugin/valgrind-results/build/debug_clang/test/valgrind.36597.memcheck.xml
[Valgrind] Copying build/debug_clang/test/valgrind.36606.memcheck.xml to /var/lib/jenkins/jobs/SANS_Weekly/configurations/axis-builddir/debug_clang/axis-buildnode/reynolds/builds/260/valgrind-plugin/valgrind-results/build/debug_clang/test/valgrind.36606.memcheck.xml
[Valgrind] Copying build/debug_clang/test/valgrind.36626.memcheck.xml to /var/lib/jenkins/jobs/SANS_Weekly/configurations/axis-builddir/debug_clang/axis-buildnode/reynolds/builds/260/valgrind-plugin/valgrind-results/build/debug_clang/test/valgrind.36626.memcheck.xml
[Valgrind] Copying build/debug_clang/test/valgrind.38209.memcheck.xml to /var/lib/jenkins/jobs/SANS_Weekly/configurations/axis-builddir/debug_clang/axis-buildnode/reynolds/builds/260/valgrind-plugin/valgrind-results/build/debug_clang/test/valgrind.38209.memcheck.xml
[Valgrind] Copying build/debug_clang/test/valgrind.38210.memcheck.xml to /var/lib/jenkins/jobs/SANS_Weekly/configurations/axis-builddir/debug_clang/axis-buildnode/reynolds/builds/260/valgrind-plugin/valgrind-results/build/debug_clang/test/valgrind.38210.memcheck.xml
[Valgrind] Copying build/debug_clang/test/valgrind.38211.memcheck.xml to /var/lib/jenkins/jobs/SANS_Weekly/configurations/axis-builddir/debug_clang/axis-buildnode/reynolds/builds/260/valgrind-plugin/valgrind-results/build/debug_clang/test/valgrind.38211.memcheck.xml
[Valgrind] Copying build/debug_clang/test/valgrind.38212.memcheck.xml to /var/lib/jenkins/jobs/SANS_Weekly/configurations/axis-builddir/debug_clang/axis-buildnode/reynolds/builds/260/valgrind-plugin/valgrind-results/build/debug_clang/test/valgrind.38212.memcheck.xml
[Valgrind] Copying build/debug_clang/test/valgrind.38213.memcheck.xml to /var/lib/jenkins/jobs/SANS_Weekly/configurations/axis-builddir/debug_clang/axis-buildnode/reynolds/builds/260/valgrind-plugin/valgrind-results/build/debug_clang/test/valgrind.38213.memcheck.xml
[Valgrind] Copying build/debug_clang/test/valgrind.38214.memcheck.xml to /var/lib/jenkins/jobs/SANS_Weekly/configurations/axis-builddir/debug_clang/axis-buildnode/reynolds/builds/260/valgrind-plugin/valgrind-results/build/debug_clang/test/valgrind.38214.memcheck.xml
[Valgrind] Copying build/debug_clang/test/valgrind.38216.memcheck.xml to /var/lib/jenkins/jobs/SANS_Weekly/configurations/axis-builddir/debug_clang/axis-buildnode/reynolds/builds/260/valgrind-plugin/valgrind-results/build/debug_clang/test/valgrind.38216.memcheck.xml
[Valgrind] Copying build/debug_clang/test/valgrind.38223.memcheck.xml to /var/lib/jenkins/jobs/SANS_Weekly/configurations/axis-builddir/debug_clang/axis-buildnode/reynolds/builds/260/valgrind-plugin/valgrind-results/build/debug_clang/test/valgrind.38223.memcheck.xml
[Valgrind] Copying build/debug_clang/test/valgrind.38224.memcheck.xml to /var/lib/jenkins/jobs/SANS_Weekly/configurations/axis-builddir/debug_clang/axis-buildnode/reynolds/builds/260/valgrind-plugin/valgrind-results/build/debug_clang/test/valgrind.38224.memcheck.xml
[Valgrind] Copying build/debug_clang/test/valgrind.38667.memcheck.xml to /var/lib/jenkins/jobs/SANS_Weekly/configurations/axis-builddir/debug_clang/axis-buildnode/reynolds/builds/260/valgrind-plugin/valgrind-results/build/debug_clang/test/valgrind.38667.memcheck.xml
[Valgrind] Copying build/debug_clang/test/valgrind.38678.memcheck.xml to /var/lib/jenkins/jobs/SANS_Weekly/configurations/axis-builddir/debug_clang/axis-buildnode/reynolds/builds/260/valgrind-plugin/valgrind-results/build/debug_clang/test/valgrind.38678.memcheck.xml
[Valgrind] Copying build/debug_clang/test/valgrind.39743.memcheck.xml to /var/lib/jenkins/jobs/SANS_Weekly/configurations/axis-builddir/debug_clang/axis-buildnode/reynolds/builds/260/valgrind-plugin/valgrind-results/build/debug_clang/test/valgrind.39743.memcheck.xml
[Valgrind] Copying build/debug_clang/test/valgrind.40044.memcheck.xml to /var/lib/jenkins/jobs/SANS_Weekly/configurations/axis-builddir/debug_clang/axis-buildnode/reynolds/builds/260/valgrind-plugin/valgrind-results/build/debug_clang/test/valgrind.40044.memcheck.xml
[Valgrind] Copying build/debug_clang/test/valgrind.4017.memcheck.xml to /var/lib/jenkins/jobs/SANS_Weekly/configurations/axis-builddir/debug_clang/axis-buildnode/reynolds/builds/260/valgrind-plugin/valgrind-results/build/debug_clang/test/valgrind.4017.memcheck.xml
[Valgrind] Copying build/debug_clang/test/valgrind.40191.memcheck.xml to /var/lib/jenkins/jobs/SANS_Weekly/configurations/axis-builddir/debug_clang/axis-buildnode/reynolds/builds/260/valgrind-plugin/valgrind-results/build/debug_clang/test/valgrind.40191.memcheck.xml
[Valgrind] Copying build/debug_clang/test/valgrind.40259.memcheck.xml to /var/lib/jenkins/jobs/SANS_Weekly/configurations/axis-builddir/debug_clang/axis-buildnode/reynolds/builds/260/valgrind-plugin/valgrind-results/build/debug_clang/test/valgrind.40259.memcheck.xml
[Valgrind] Copying build/debug_clang/test/valgrind.40279.memcheck.xml to /var/lib/jenkins/jobs/SANS_Weekly/configurations/axis-builddir/debug_clang/axis-buildnode/reynolds/builds/260/valgrind-plugin/valgrind-results/build/debug_clang/test/valgrind.40279.memcheck.xml
[Valgrind] Copying build/debug_clang/test/valgrind.5508.memcheck.xml to /var/lib/jenkins/jobs/SANS_Weekly/configurations/axis-builddir/debug_clang/axis-buildnode/reynolds/builds/260/valgrind-plugin/valgrind-results/build/debug_clang/test/valgrind.5508.memcheck.xml
[Valgrind] Copying build/debug_clang/test/valgrind.5684.memcheck.xml to /var/lib/jenkins/jobs/SANS_Weekly/configurations/axis-builddir/debug_clang/axis-buildnode/reynolds/builds/260/valgrind-plugin/valgrind-results/build/debug_clang/test/valgrind.5684.memcheck.xml
[Valgrind] Copying build/debug_clang/test/valgrind.6052.memcheck.xml to /var/lib/jenkins/jobs/SANS_Weekly/configurations/axis-builddir/debug_clang/axis-buildnode/reynolds/builds/260/valgrind-plugin/valgrind-results/build/debug_clang/test/valgrind.6052.memcheck.xml
[Valgrind] Copying build/debug_clang/test/valgrind.6581.memcheck.xml to /var/lib/jenkins/jobs/SANS_Weekly/configurations/axis-builddir/debug_clang/axis-buildnode/reynolds/builds/260/valgrind-plugin/valgrind-results/build/debug_clang/test/valgrind.6581.memcheck.xml
[Valgrind] Copying build/debug_clang/test/valgrind.6849.memcheck.xml to /var/lib/jenkins/jobs/SANS_Weekly/configurations/axis-builddir/debug_clang/axis-buildnode/reynolds/builds/260/valgrind-plugin/valgrind-results/build/debug_clang/test/valgrind.6849.memcheck.xml
[Valgrind] Copying build/debug_clang/test/valgrind.7245.memcheck.xml to /var/lib/jenkins/jobs/SANS_Weekly/configurations/axis-builddir/debug_clang/axis-buildnode/reynolds/builds/260/valgrind-plugin/valgrind-results/build/debug_clang/test/valgrind.7245.memcheck.xml
[Valgrind] Copying build/debug_clang/test/valgrind.7367.memcheck.xml to /var/lib/jenkins/jobs/SANS_Weekly/configurations/axis-builddir/debug_clang/axis-buildnode/reynolds/builds/260/valgrind-plugin/valgrind-results/build/debug_clang/test/valgrind.7367.memcheck.xml
[Valgrind] Copying build/debug_clang/test/valgrind.7575.memcheck.xml to /var/lib/jenkins/jobs/SANS_Weekly/configurations/axis-builddir/debug_clang/axis-buildnode/reynolds/builds/260/valgrind-plugin/valgrind-results/build/debug_clang/test/valgrind.7575.memcheck.xml
[Valgrind] Copying build/debug_clang/test/valgrind.7832.memcheck.xml to /var/lib/jenkins/jobs/SANS_Weekly/configurations/axis-builddir/debug_clang/axis-buildnode/reynolds/builds/260/valgrind-plugin/valgrind-results/build/debug_clang/test/valgrind.7832.memcheck.xml
[Valgrind] Copying build/debug_clang/test/valgrind.7905.memcheck.xml to /var/lib/jenkins/jobs/SANS_Weekly/configurations/axis-builddir/debug_clang/axis-buildnode/reynolds/builds/260/valgrind-plugin/valgrind-results/build/debug_clang/test/valgrind.7905.memcheck.xml
[Valgrind] Copying build/debug_clang/test/valgrind.7925.memcheck.xml to /var/lib/jenkins/jobs/SANS_Weekly/configurations/axis-builddir/debug_clang/axis-buildnode/reynolds/builds/260/valgrind-plugin/valgrind-results/build/debug_clang/test/valgrind.7925.memcheck.xml
[Valgrind] Copying build/debug_clang/test/valgrind.8877.memcheck.xml to /var/lib/jenkins/jobs/SANS_Weekly/configurations/axis-builddir/debug_clang/axis-buildnode/reynolds/builds/260/valgrind-plugin/valgrind-results/build/debug_clang/test/valgrind.8877.memcheck.xml
[Valgrind] Analysing valgrind results
[Valgrind] workspacePath: /jenkins/workspace/SANS_Weekly/builddir/debug_clang/buildnode/reynolds/
[Valgrind] Ending the valgrind analysis.
INFO: Starting to record.
INFO: Processing CTest-Version 3.x (default)
INFO: [CTest-Version 3.x (default)] - 1 test report file(s) were found with the pattern 'build/Test*.xml' relative to '/jenkins/workspace/SANS_Weekly/builddir/debug_clang/buildnode/reynolds' for the testing framework 'CTest-Version 3.x (default)'.
INFO: Check 'Failed Tests' threshold.
INFO: The total number of tests for the threshold 'Failed Tests' exceeds the specified "failure threshold" value.
INFO: Setting the build status to FAILURE
INFO: Stopping recording.
[PostBuildScript] - [INFO] Executing post build scripts.
[PostBuildScript] - [INFO] Build does not have any of the results []. Did not execute build step #0.
[WS-CLEANUP] Deleting project workspace...
[WS-CLEANUP] Deferred wipeout is used...
[WS-CLEANUP] done
Finished: FAILURE