Console Output

Skipping 246 KB.. Full Log
[ 62%] Checking style of src/Discretization/DG/JacobianBoundaryTrace_mitLG_DGBR2.h
[ 62%] Checking style of src/Discretization/DG/JacobianBoundaryTrace_DGBR2.h
[ 62%] Checking style of src/Discretization/DG/FieldBundle_DGAdvective.h
[ 62%] Checking style of src/Discretization/DG/SetFieldInteriorTrace_DGBR2_LiftingOperator.h
[ 62%] Checking style of src/Discretization/DG/IntegrateBoundaryTrace_Dispatch_DGBR2.h
[ 62%] Checking style of src/Discretization/DG/SetFieldBoundaryTrace_DGBR2_AdjointLO.h
[ 62%] Checking style of src/Discretization/DG/FunctionalBoundaryTrace_DGBR2.h
[ 62%] Checking style of src/Discretization/DG/IntegrandCell_DGBR2_manifold.h
[ 62%] Checking style of src/Discretization/DG/SolutionData_DGAdvective.h
[ 62%] Checking style of src/Discretization/DG/SetFieldBoundaryTrace_Dispatch_AdjointLO.h
[ 62%] Checking style of src/Discretization/DG/FunctionalCell_DGBR2.h
[ 62%] Checking style of src/Discretization/DG/JacobianCell_DGBR2_Element.h
[ 62%] Checking style of src/Discretization/DG/ResidualBoundaryTrace_FieldTrace_DGBR2.h
[ 62%] Checking style of src/Discretization/DG/JacobianFunctionalBoundaryTrace_DGBR2.h
[ 62%] Checking style of src/Discretization/DG/AlgebraicEquationSet_TransitionIBL.h
[ 62%] Checking style of src/Discretization/DG/IntegrandBoundaryTrace_Flux_mitState_DGBR2_manifold.h
[ 65%] Checking style of src/Discretization/DG/ResidualBoundaryTrace_Dispatch_DGBR2.h
[ 65%] Checking style of src/Discretization/DG/IntegrandBoundaryTrace_LinearScalar_sansLG_DGBR2.h
[ 65%] Checking style of src/Discretization/DG/SetFieldInteriorTrace_DGBR2_AdjointLO.h
[ 65%] Checking style of src/Discretization/DG/ResidualCell_DGBR2.h
[ 65%] Checking style of src/Discretization/DG/SetFieldBoundaryTrace_Dispatch_LiftingOperator.h
[ 65%] Checking style of src/Discretization/DG/AlgebraicEquationSet_DGBR2.h
[ 65%] Checking style of src/Discretization/DG/SolutionData_DGBR2_Block2.h
[ 65%] Checking style of src/Discretization/DG/FieldBundle_DGBR2.h
[ 65%] Checking style of src/Discretization/DG/JacobianFunctionalCell_DGBR2.h
[ 65%] Checking style of src/Discretization/DG/SolutionData_DGBR2.h
[ 65%] Checking style of src/Discretization/DG/AlgebraicEquationSet_DGAdvective_impl.h
[ 65%] Checking style of src/Discretization/DG/JacobianInteriorTrace_DGBR2_Param.h
[ 65%] Checking style of src/Discretization/DG/AlgebraicEquationSet_Local_DG_impl.h
[ 65%] Checking style of src/Discretization/DG/IntegrandCell_DGBR2_Output.h
[ 65%] Checking style of src/Discretization/DG/IntegrandCell_DGBR2.h
[ 65%] Checking style of src/Discretization/DG/JacobianInteriorTrace_DGBR2_LiftedQuantity.h
[ 65%] Checking style of src/Discretization/DG/FunctionalBoundaryTrace_Dispatch_DGBR2.h
[ 65%] Checking style of src/Discretization/DG/JacobianBoundaryTrace_DGBR2_Param.h
[ 65%] Checking style of src/Discretization/DG/SetFieldBoundaryTrace_DGBR2_LiftingOperator.h
[ 65%] Checking style of src/Discretization/DG/JacobianCell_DGBR2_Param.h
[ 65%] Checking style of src/Discretization/DG/IntegrandBoundaryTrace_Flux_mitState_DGBR2.h
[ 65%] Checking style of src/Discretization/DG/JacobianCell_DGBR2_LiftingOperator.h
[ 65%] Checking style of src/Discretization/DG/IntegrandInteriorTrace_DGBR2_manifold.h
[ 65%] Checking style of src/Discretization/DG/AlgebraicEquationSet_DGBR2_impl.h
[ 65%] Checking style of src/Discretization/DG/JacobianCell_DGBR2.h
[ 65%] Checking style of src/Discretization/DG/JacobianFunctionalBoundaryTrace_Dispatch_DGBR2.h
[ 65%] Checking style of src/Discretization/DG/JacobianInteriorTrace_DGBR2.h
[ 65%] Checking style of src/Discretization/DG/MassMatInvResidualNorm.h
[ 65%] Checking style of src/Discretization/DG/SetFieldInteriorTrace_DGBR2_LiftedQuantity.h
[ 65%] Checking style of src/Discretization/DG/JacobianDetInvResidualNorm.h
[ 65%] Checking style of src/Discretization/DG/AlgebraicEquationSet_DGAdvective.h
[ 65%] Checking style of src/Discretization/DG/IntegrandBoundaryTrace_Output_DGBR2.h
[ 65%] Checking style of src/Discretization/DG/ResidualBoundaryTrace_DGBR2.h
[ 65%] Checking style of src/Discretization/DG/JacobianBoundaryTrace_Dispatch_DGBR2.h
[ 65%] Checking style of src/Discretization/DG/Integrand_DGBR2_fwd.h
[ 65%] Checking style of src/Discretization/DG/AlgebraicEquationSet_Local_DG.h
[ 65%] Checking style of src/Discretization/DG/JacobianBoundaryTrace_Dispatch_DGBR2_Param.h
[ 65%] Checking style of src/Discretization/DG/IntegrandInteriorTrace_DGBR2.h
[ 65%] Checking style of src/Discretization/DG/FunctionalCellwise_DGBR2.h
[ 65%] Checking style of src/Discretization/DG/DiscretizationDGBR2.h
[ 65%] Checking style of src/Discretization/VMSDBR2/SetAdjointLO_InteriorTrace_onBoundary_VMSD_BR2.h
[ 65%] Checking style of src/Discretization/VMSDBR2/SetAdjointLO_Dispatch_VMSD.h
[ 65%] Checking style of src/Discretization/VMSDBR2/AlgebraicEquationSet_VMSD_BR2.h
[ 65%] Checking style of src/Discretization/VMSDBR2/JacobianFunctionalBoundaryTrace_VMSD_BR2.h
[ 65%] Checking style of src/Discretization/VMSDBR2/JacobianCell_VMSD_BR2.h
[ 65%] Checking style of src/Discretization/VMSDBR2/JacobianInteriorTrace_VMSD_BR2.h
[ 65%] Checking style of src/Discretization/VMSDBR2/JacobianCell_VMSD_BR2_Element.h
[ 65%] Checking style of src/Discretization/VMSDBR2/SetLO_InteriorTrace_onBoundary_VMSD_BR2.h
[ 65%] Checking style of src/Discretization/VMSDBR2/JacobianCell_VMSD_BR2_Uncondensed.h
[ 65%] Checking style of src/Discretization/VMSDBR2/AlgebraicEquationSet_Local_VMSD_BR2.h
[ 65%] Checking style of src/Discretization/VMSDBR2/SolutionData_VMSD_BR2.h
[ 65%] Checking style of src/Discretization/VMSDBR2/ResidualInteriorTrace_onBoundary_VMSD_BR2.h
[ 65%] Checking style of src/Discretization/VMSDBR2/FieldBundle_VMSD_BR2.h
[ 65%] Checking style of src/Discretization/VMSDBR2/IntegrandBoundaryTrace_LinearScalar_sansLG_VMSD_BR2.h
[ 65%] Checking style of src/Discretization/VMSDBR2/ResidualBoundaryTrace_Dispatch_VMSD_BR2.h
[ 65%] Checking style of src/Discretization/VMSDBR2/SetLiftingOperator_VMSD_BR2.h
[ 65%] Checking style of src/Discretization/VMSDBR2/FunctionalBoundaryTrace_VMSD_BR2.h
[ 65%] Checking style of src/Discretization/VMSDBR2/JacobianBoundaryTrace_VMSD_BR2.h
[ 65%] Checking style of src/Discretization/VMSDBR2/IntegrandTrace_VMSD_BR2.h
[ 65%] Checking style of src/Discretization/VMSDBR2/JacobianBoundaryTrace_Dispatch_VMSD_BR2.h
[ 65%] Checking style of src/Discretization/VMSDBR2/SetLiftingOperator_Dispatch_VMSD.h
[ 65%] Checking style of src/Discretization/VMSDBR2/SetAdjointLO_InteriorTrace_VMSD_BR2.h
[ 65%] Checking style of src/Discretization/VMSDBR2/IntegrandBoundaryTrace_LinearScalar_mitLG_VMSD_BR2.h
[ 65%] Checking style of src/Discretization/VMSDBR2/FunctionalBoundaryTrace_Dispatch_VMSD_BR2.h
[ 65%] Checking style of src/Discretization/VMSDBR2/IntegrandBoundaryTrace_OutputWeightRsd_VMSD_BR2.h
[ 65%] Checking style of src/Discretization/VMSDBR2/JacobianInteriorTrace_onBoundary_VMSD_BR2.h
[ 65%] Checking style of src/Discretization/VMSDBR2/IntegrandBoundaryTrace_Output_VMSD_BR2.h
[ 65%] Checking style of src/Discretization/VMSDBR2/IntegrateBoundaryTrace_Dispatch_VMSD_BR2.h
[ 65%] Checking style of src/Discretization/VMSDBR2/JacobianFunctionalBoundaryTrace_Dispatch_VMSD_BR2.h
[ 65%] Checking style of src/Discretization/VMSDBR2/ResidualInteriorTrace_VMSD_BR2.h
[ 65%] Checking style of src/Discretization/VMSDBR2/SetFieldBoundaryTrace_VMSD_LiftingOperator.h
[ 65%] Checking style of src/Discretization/VMSDBR2/IntegrandBoundaryTrace_Dirichlet_sansLG_VMSD_BR2.h
[ 65%] Checking style of src/Discretization/VMSDBR2/IntegrandCell_VMSD_BR2.h
[ 65%] Checking style of src/Discretization/VMSDBR2/ResidualBoundaryTrace_VMSD_BR2.h
[ 65%] Checking style of src/Discretization/VMSDBR2/JacobianInteriorTrace_VMSD_BR2_Element.h
[ 65%] Checking style of src/Discretization/VMSDBR2/SetAdjointLO_VMSD_BR2.h
[ 65%] Checking style of src/Discretization/VMSDBR2/JacobianCell_VMSD_BR2_withPTC.h
[ 65%] Checking style of src/Discretization/VMSDBR2/IntegrandBoundaryTrace_None_VMSD_BR2.h
[ 65%] Checking style of src/Discretization/VMSDBR2/Integrand_VMSDBR2_fwd.h
[ 65%] Checking style of src/Discretization/VMSDBR2/SetFieldBoundaryTrace_VMSD_AdjointLO.h
[ 65%] Checking style of src/Discretization/VMSDBR2/ResidualCell_VMSD_BR2.h
[ 65%] Checking style of src/Discretization/VMSDBR2/IntegrandBoundaryTrace_Dirichlet_mitLG_VMSD_BR2.h
[ 65%] Checking style of src/Discretization/VMSDBR2/IntegrandBoundaryTrace_Flux_mitState_VMSD_BR2.h
[ 65%] Checking style of src/Discretization/VMSDBR2/SetLO_InteriorTrace_VMSD_BR2.h
[ 65%] Checking style of src/Discretization/IntegrateCellTraceGroups_FieldTrace.h
[ 65%] Checking style of src/Discretization/Potential_Adjoint/JacobianBoundaryFrame_CG_Potential_Adjoint.h
[ 65%] Checking style of src/Discretization/Potential_Adjoint/AlgebraicEquationSet_CG_Potential_Adjoint.h
[ 65%] Checking style of src/Discretization/Potential_Adjoint/IntegrandBoundaryTrace_WakeCut_CG_LIP_Adjoint.h
[ 65%] Checking style of src/Discretization/Potential_Adjoint/JacobianBoundaryTrace_WakeCut_CG_Potential_Adjoint.h
[ 65%] Checking style of src/Discretization/Potential_Adjoint/ResidualBoundaryFrame_CG_Potential_Adjoint.h
[ 65%] Checking style of src/Discretization/Potential_Adjoint/BC_WakeCut_Potential_Adjoint.h
[ 65%] Checking style of src/Discretization/Potential_Adjoint/ResidualBoundaryTrace_WakeCut_CG_Potential_Adjoint.h
[ 65%] Checking style of src/Discretization/Potential_Adjoint/IntegrandBoundaryFrame_CG_LIP_Adjoint.h
[ 65%] Checking style of src/Discretization/AlgebraicEquationSet_Debug.h
[ 65%] Checking style of src/Discretization/IntegrateInteriorTraceGroups.h
[ 65%] Checking style of src/Discretization/JacobianParam_impl.h
[ 65%] Checking style of src/Discretization/LIP_HACK/ResidualBoundaryTrace_Galerkin_WakeCut_LIP.h
[ 65%] Checking style of src/Discretization/LIP_HACK/IntegrandCell_Galerkin_Darmofal.h
[ 68%] Checking style of src/Discretization/LIP_HACK/ResidualInteriorTrace_Galerkin_IPTF.h
[ 68%] Checking style of src/Discretization/LIP_HACK/ResidualBoundaryFrameTrace_Galerkin.h
[ 68%] Checking style of src/Discretization/LIP_HACK/JacobianInteriorTrace_Galerkin_IPTF.h
[ 68%] Checking style of src/Discretization/LIP_HACK/JacobianBoundaryTrace_Galerkin_Element_IPTF.h
[ 68%] Checking style of src/Discretization/LIP_HACK/IntegrandFunctorCell_Galerkin_Kutta_LIP.h
[ 68%] Checking style of src/Discretization/LIP_HACK/IntegrandBoundaryTrace_Galerkin_Wall_IPTF.h
[ 68%] Checking style of src/Discretization/LIP_HACK/IntegrandBoundaryTrace_LinearScalar_sansLG_FP_HACK.h
[ 68%] Checking style of src/Discretization/LIP_HACK/IntegrandBoundaryFrame_Galerkin_Circ.h
[ 68%] Checking style of src/Discretization/LIP_HACK/JacobianBoundaryTrace_sansLG_Galerkin_IPTF.h
[ 68%] Checking style of src/Discretization/LIP_HACK/JacobianBoundaryFrameTrace_Galerkin.h
[ 68%] Checking style of src/Discretization/LIP_HACK/IntegrandBoundaryTrace_Galerkin_WakeCut_LIP_SRA.h
[ 68%] Checking style of src/Discretization/LIP_HACK/JacobianBoundaryTrace_Dispatch_Galerkin_IPTF.h
[ 68%] Checking style of src/Discretization/LIP_HACK/ResidualBoundaryFrame_Galerkin.h
[ 68%] Checking style of src/Discretization/LIP_HACK/ResidualBoundaryTrace_sansLG_Galerkin_IPTF.h
[ 68%] Checking style of src/Discretization/LIP_HACK/IntegrandBoundaryFrame_Galerkin.h
[ 68%] Checking style of src/Discretization/LIP_HACK/IntegrandBoundaryTrace_Galerkin_Farfield_IPTF.h
[ 68%] Checking style of src/Discretization/LIP_HACK/ResidualBoundaryTrace_Dispatch_Galerkin_IPTF.h
[ 68%] Checking style of src/Discretization/LIP_HACK/ResidualBoundaryFrame_Galerkin_Darmofal.h
[ 68%] Checking style of src/Discretization/LIP_HACK/JacobianBoundaryFrame_Galerkin_Darmofal.h
[ 68%] Checking style of src/Discretization/LIP_HACK/JacobianBoundaryFrame_Galerkin_Circ.h
[ 68%] Checking style of src/Discretization/LIP_HACK/IntegrandBoundaryFrameTrace_Galerkin.h
[ 68%] Checking style of src/Discretization/LIP_HACK/IntegrandFunctor_Galerkin_WakeCut_sansLG.h
[ 68%] Checking style of src/Discretization/LIP_HACK/IntegrandFunctor_Galerkin_WakeCut_LIP.h
[ 68%] Checking style of src/Discretization/LIP_HACK/JacobianCell_Galerkin_Kutta.h
[ 68%] Checking style of src/Discretization/LIP_HACK/IntegrandInteriorTrace_Galerkin_WakeCut_IPTF.h
[ 68%] Checking style of src/Discretization/LIP_HACK/ResidualBoundaryFrame_Galerkin_Circ.h
[ 68%] Checking style of src/Discretization/LIP_HACK/JacobianBoundaryFrame_Galerkin.h
[ 68%] Checking style of src/Discretization/LIP_HACK/IntegrandInteriorTrace_Galerkin_WakeCut_LIP_SRA.h
[ 68%] Checking style of src/Discretization/LIP_HACK/ResidualCell_Galerkin_Kutta.h
[ 68%] Checking style of src/Discretization/LIP_HACK/JacobianBoundaryTrace_Galerkin_WakeCut_LIP.h
[ 68%] Checking style of src/Discretization/LIP_HACK/JacobianInteriorTrace_Galerkin_Element_IPTF.h
[ 68%] Checking style of src/Discretization/JacobianElementMatrix.h
[ 68%] Checking style of src/Discretization/IntegrateBoundaryTraceGroups_BoundaryCell.h
[ 68%] Checking style of src/Discretization/IntegratePeriodicTraceGroups_FieldTrace.h
[ 68%] Checking style of src/Discretization/IntegrateBoundaryTraceGroups.h
[ 68%] Checking style of src/Discretization/JacobianParam_Local.h
[ 68%] Checking style of src/Discretization/Integrand_Type.h
[ 68%] Checking style of src/Discretization/UpdateFraction/UpdateFractionBoundaryTrace_Dispatch.h
[ 68%] Checking style of src/Discretization/UpdateFraction/UpdateFractionBoundaryTrace_mitLG.h
[ 68%] Checking style of src/Discretization/UpdateFraction/UpdateFractionCell.h
[ 68%] Checking style of src/Discretization/UpdateFraction/UpdateFractionBoundaryTrace_sansLG.h
[ 68%] Checking style of src/Discretization/UpdateFraction/UpdateFractionInteriorTrace.h
[ 68%] Checking style of src/Discretization/GroupIntegral_Type.h
[ 68%] Checking style of src/Discretization/IntegrateGhostBoundaryTraceGroups.h
[ 68%] Checking style of src/Discretization/IntegrateCellGroups.h
[ 68%] Checking style of src/Discretization/CG/ResidualParamSensitivity_CG.h
[ 68%] Checking style of src/Discretization/HDG/Instantiate/AlgebraicEquationSet_HDG_AdvectionDiffusion1D_ALaxDUSU.cpp
[ 68%] Checking style of src/Discretization/HDG/Instantiate/AlgebraicEquationSet_HDG_NavierStokes2D_Conservative_ConstantViscosity.cpp
[ 68%] Checking style of src/Discretization/HDG/Instantiate/AlgebraicEquationSet_HDG_Euler1D_Conservative.cpp
[ 68%] Checking style of src/Discretization/HDG/Instantiate/AlgebraicEquationSet_HDG_BuckleyLeverett1D.cpp
[ 68%] Checking style of src/Discretization/HDG/Instantiate/AlgebraicEquationSet_HDGAdvective_Advection1D_AUSU.cpp
[ 68%] Checking style of src/Discretization/HDG/Instantiate/AlgebraicEquationSet_HDG_Euler1D_Entropy.cpp
[ 68%] Checking style of src/Discretization/HDG/Instantiate/AlgebraicEquationSet_HDG_Euler2D_PrimitiveRhoPressure.cpp
[ 68%] Checking style of src/Discretization/HDG/Instantiate/AlgebraicEquationSet_HDG_NavierStokes2D_Primitive_ConstantViscosity.cpp
[ 68%] Checking style of src/Discretization/HDG/Instantiate/AlgebraicEquationSet_HDG_AdvectionDiffusion3D_AUDUSUG.cpp
[ 68%] Checking style of src/Discretization/HDG/Instantiate/AlgebraicEquationSet_HDG_Burgers1D_Conservative_DUSU.cpp
[ 68%] Checking style of src/Discretization/HDG/Instantiate/AlgebraicEquationSet_HDG_Euler1D_PrimitiveRhoPressure.cpp
[ 68%] Checking style of src/Discretization/HDG/Instantiate/AlgebraicEquationSet_HDG_AdvectionDiffusion1D_AUDUSUG.cpp
[ 68%] Checking style of src/Discretization/HDG/Instantiate/AlgebraicEquationSet_HDG_RANSSA2D_Primitive_ConstantViscosity.cpp
[ 68%] Checking style of src/Discretization/HDG/Instantiate/AlgebraicEquationSet_HDG_AdvectionDiffusion2D_AUDUSUG.cpp
[ 68%] Checking style of src/Discretization/HDG/Instantiate/AlgebraicEquationSet_HDG_Stokes2D.cpp
[ 68%] Checking style of src/Discretization/Galerkin/ExtractCGLocalBoundaries/ExtractCGLocalBoundaries4D.cpp
[ 68%] Checking style of src/Discretization/Galerkin/ExtractCGLocalBoundaries/ExtractCGLocalBoundaries2D.cpp
[ 68%] Checking style of src/Discretization/Galerkin/ExtractCGLocalBoundaries/ExtractCGLocalBoundaries3D.cpp
[ 68%] Checking style of src/Discretization/Galerkin/ExtractCGLocalBoundaries/ExtractCGLocalBoundaries1D.cpp
[ 68%] Checking style of src/Discretization/Block/AlgebraicEquationSet_Block2x2_Real_Real.cpp
[ 68%] Checking style of src/Discretization/Block/AlgebraicEquationSet_Block2x2_VecS3_Real.cpp
[ 68%] Checking style of src/Discretization/Block/AlgebraicEquationSet_Block2x2_VecS4_Real.cpp
[ 68%] Checking style of src/Discretization/DG/DGBR2_Instantiate/AlgebraicEquationSet_DGBR2_AdvectionDiffusion2D_AUDUSN.cpp
[ 68%] Checking style of src/Discretization/DG/DGBR2_Instantiate/AlgebraicEquationSet_DGBR2_TwoPhase2D_Surrogate_pnSw.cpp
[ 68%] Checking style of src/Discretization/DG/DGBR2_Instantiate/AlgebraicEquationSet_DGBR2_Sensor2D_AUSJump_Euler2D_Conservative.cpp
[ 68%] Checking style of src/Discretization/DG/DGBR2_Instantiate/AlgebraicEquationSet_DGBR2_Euler1D_AV1D_Conservative.cpp
[ 68%] Checking style of src/Discretization/DG/DGBR2_Instantiate/AlgebraicEquationSet_DGBR2_NavierStokesBrenner2D_PrimitiveConstVisc.cpp
[ 68%] Checking style of src/Discretization/DG/DGBR2_Instantiate/AlgebraicEquationSet_DGBR2_Sensor1D_AUSJump_Euler1D_Conservative.cpp
[ 68%] Checking style of src/Discretization/DG/DGBR2_Instantiate/AlgebraicEquationSet_DGBR2_ArtificialViscosity_TwoPhase2D.cpp
[ 68%] Checking style of src/Discretization/DG/DGBR2_Instantiate/AlgebraicEquationSet_DGBR2_Lorenz.cpp
[ 68%] Checking style of src/Discretization/DG/DGBR2_Instantiate/AlgebraicEquationSet_DGBR2_NavierStokes2D_ConservativeConstVisc.cpp
[ 68%] Checking style of src/Discretization/DG/DGBR2_Instantiate/AlgebraicEquationSet_DGBR2_Burgers2D_Conservative_DUSN.cpp
[ 68%] Checking style of src/Discretization/DG/DGBR2_Instantiate/AlgebraicEquationSet_DGBR2_BuckleyLeverett_AV1D.cpp
[ 68%] Checking style of src/Discretization/DG/DGBR2_Instantiate/AlgebraicEquationSet_DGBR2_Sensor1D_AUSJump_BuckleyLeverett1D.cpp
[ 68%] Checking style of src/Discretization/DG/DGBR2_Instantiate/AlgebraicEquationSet_DGBR2_Sensor2D_AUSJump_AD.cpp
[ 68%] Checking style of src/Discretization/DG/DGBR2_Instantiate/AlgebraicEquationSet_DGBR2_Burgers1D_Conservative_DUSN.cpp
[ 68%] Checking style of src/Discretization/DG/DGBR2_Instantiate/AlgebraicEquationSet_DGBR2_NavierStokes3D_PrimitiveSutherland.cpp
[ 68%] Checking style of src/Discretization/DG/DGBR2_Instantiate/AlgebraicEquationSet_DGBR2_Burgers1D_Conservative_DUSU.cpp
[ 68%] Checking style of src/Discretization/DG/DGBR2_Instantiate/AlgebraicEquationSet_DGBR2_ArtificialViscosity_RANSSA3D_PrimitiveSutherland.cpp
[ 68%] Checking style of src/Discretization/DG/DGBR2_Instantiate/AlgebraicEquationSet_DGBR2_RANSSA3D_PrimitiveConstVisc.cpp
[ 68%] Checking style of src/Discretization/DG/DGBR2_Instantiate/AlgebraicEquationSet_DGBR2_NavierStokes3D_SurrogateSutherland.cpp
[ 68%] Checking style of src/Discretization/DG/DGBR2_Instantiate/AlgebraicEquationSet_DGBR2_ArtificialViscosity_TwoPhase1D.cpp
[ 68%] Checking style of src/Discretization/DG/DGBR2_Instantiate/AlgebraicEquationSet_DGBR2_AdvectionDiffusion1D_AUDUSUG.cpp
[ 68%] Checking style of src/Discretization/DG/DGBR2_Instantiate/AlgebraicEquationSet_DGBR2_TwoPhase2D_LogpnSw.cpp
[ 68%] Checking style of src/Discretization/DG/DGBR2_Instantiate/AlgebraicEquationSet_DGBR2_AdvectionDiffusion3D_AUDUSUG.cpp
[ 68%] Checking style of src/Discretization/DG/DGBR2_Instantiate/AlgebraicEquationSet_DGBR2_ArtificialViscosity_BuckleyLeverett1D.cpp
[ 68%] Checking style of src/Discretization/DG/DGBR2_Instantiate/AlgebraicEquationSet_DGBR2_RANSSA2D_PrimitiveConstVisc.cpp
[ 68%] Checking style of src/Discretization/DG/DGBR2_Instantiate/AlgebraicEquationSet_DGBR2_NavierStokes2D_PrimitiveConstVisc.cpp
[ 68%] Checking style of src/Discretization/DG/DGBR2_Instantiate/AlgebraicEquationSet_DGBR2_RANSSA_Source2D_PrimitiveConstVisc.cpp
[ 68%] Checking style of src/Discretization/DG/DGBR2_Instantiate/AlgebraicEquationSet_DGBR2_RANSSA3D_PrimitiveSutherland.cpp
[ 68%] Checking style of src/Discretization/DG/DGBR2_Instantiate/AlgebraicEquationSet_DGBR2_Sensor2D_AUSJump_Euler1D_Conservative.cpp
[ 68%] Checking style of src/Discretization/DG/DGBR2_Instantiate/AlgebraicEquationSet_DGBR2_Euler2D_AV2D_Conservative.cpp
[ 71%] Checking style of src/Discretization/DG/DGBR2_Instantiate/AlgebraicEquationSet_DGBR2_Euler2D_AV2D_Primitive.cpp
[ 71%] Checking style of src/Discretization/DG/DGBR2_Instantiate/AlgebraicEquationSet_DGBR2_ArtificialViscosity_Euler1D_Surrogate.cpp
[ 71%] Checking style of src/Discretization/DG/DGBR2_Instantiate/AlgebraicEquationSet_DGBR2_NavierStokes3D_PrimitiveConstVisc.cpp
[ 71%] Checking style of src/Discretization/DG/DGBR2_Instantiate/AlgebraicEquationSet_DGBR2_AdvectionDiffusion2D_AUDUSUG.cpp
[ 71%] Checking style of src/Discretization/DG/DGBR2_Instantiate/AlgebraicEquationSet_DGBR2_AdvectionDiffusion2D_AUDPLSUG.cpp
[ 71%] Checking style of src/Discretization/DG/DGBR2_Instantiate/AlgebraicEquationSet_DGBR2_BuckleyLeverett1D_SurrogateSw.cpp
[ 71%] Checking style of src/Discretization/DG/DGBR2_Instantiate/AlgebraicEquationSet_DGBR2_TwoPhase2D.cpp
[ 71%] Checking style of src/Discretization/DG/DGBR2_Instantiate/AlgebraicEquationSet_DGBR2_RANSSA2D_PrimitiveSutherland.cpp
[ 71%] Checking style of src/Discretization/DG/DGBR2_Instantiate/AlgebraicEquationSet_DGBR2_ArtificialViscosity_Euler1D_Primitive.cpp
[ 71%] Checking style of src/Discretization/DG/DGBR2_Instantiate/AlgebraicEquationSet_DGBR2_AD_AV2D_AUDUSUG.cpp
[ 71%] Checking style of src/Discretization/DG/DGBR2_Instantiate/AlgebraicEquationSet_DGBR2_NavierStokes2D_PrimitiveSutherland.cpp
[ 71%] Checking style of src/Discretization/DG/DGBR2_Instantiate/AlgebraicEquationSet_DGBR2_Sensor2D_AUSJump_Euler2D_Primitive.cpp
[ 71%] Checking style of src/Discretization/DG/DGBR2_Instantiate/AlgebraicEquationSet_DGBR2_Euler1D_AV1D_Primitive.cpp
[ 71%] Checking style of src/Discretization/DG/DGBR2_Instantiate/AlgebraicEquationSet_DGBR2_RANSSA_Source3D_PrimitiveConstVisc.cpp
[ 71%] Checking style of src/Discretization/DG/DGBR2_Instantiate/AlgebraicEquationSet_DGBR2_ArtificialViscosity_Euler1D_Conservative.cpp
[ 71%] Checking style of src/Discretization/DG/DGBR2_Instantiate/AlgebraicEquationSet_DGBR2_BuckleyLeverett1D.cpp
[ 71%] Checking style of src/Discretization/DG/DGBR2_Instantiate/AlgebraicEquationSet_DGBR2_ArtificialViscositySource_EulerQ1D_Surrogate.cpp
[ 71%] Checking style of src/Discretization/DG/DGBR2_Instantiate/AlgebraicEquationSet_DGBR2_AdvectionDiffusion2D_AUDHJSUG.cpp
[ 71%] Checking style of src/Discretization/DG/DGBR2_Instantiate/AlgebraicEquationSet_DGBR2_RANSSA3D_SurrogateSutherland.cpp
[ 71%] Checking style of src/Discretization/DG/DGBR2_Instantiate/AlgebraicEquationSet_DGBR2_TwoPhaseLinearized1D.cpp
[ 71%] Checking style of src/Discretization/DG/DGBR2_Instantiate/AlgebraicEquationSet_DGBR2_AdvectionDiffusion1D_ALaxDUSU.cpp
[ 71%] Checking style of src/Discretization/DG/DGBR2_Instantiate/AlgebraicEquationSet_DGBR2_AdvectionDiffusion1D_AUDUSN.cpp
[ 71%] Checking style of src/Discretization/DG/DGBR2_Instantiate/AlgebraicEquationSet_DGBR2_Burgers_AV1D_DUSUG.cpp
[ 71%] Checking style of src/Discretization/DG/DGBR2_Instantiate/AlgebraicEquationSet_DGBR2_TwoPhase1D.cpp
[ 71%] Checking style of src/Discretization/DG/DGBR2_Instantiate/AlgebraicEquationSet_DGBR2_ArtificialViscosity_Euler2D_Conservative.cpp
[ 71%] Checking style of src/Discretization/DG/DGBR2_Instantiate/AlgebraicEquationSet_DGBR2_AdvectionDiffusion3D_manifold_AUDUSN.cpp
[ 71%] Checking style of src/Discretization/DG/DGBR2_Instantiate/AlgebraicEquationSet_DGBR2_Sensor1D_AUSJump_AD.cpp
[ 71%] Checking style of src/Discretization/DG/DiscretizationDGBR2.cpp
[ 71%] Checking style of src/Discretization/DG/DGAdvective_Instantiate/AlgebraicEquationSet_DGAdvective_Euler2D_PrimitiveSurrogate.cpp
[ 71%] Checking style of src/Discretization/DG/DGAdvective_Instantiate/AlgebraicEquationSet_DGAdvective_AdvectionDiffusion2D_manifold_AUDNSN.cpp
[ 71%] Checking style of src/Discretization/DG/DGAdvective_Instantiate/AlgebraicEquationSet_DGAdvective_Euler3D_PrimitiveSurrogate.cpp
[ 71%] Checking style of src/Discretization/DG/DGAdvective_Instantiate/AlgebraicEquationSet_DGAdvective_ShallowWater1D.cpp
[ 71%] Checking style of src/Discretization/DG/DGAdvective_Instantiate/AlgebraicEquationSet_DGAdvective_Euler2D_Conservative.cpp
[ 71%] Checking style of src/Discretization/DG/DGAdvective_Instantiate/AlgebraicEquationSet_DGAdvective_AdvectionDiffusion2D_Annulus_DNSN.cpp
[ 71%] Checking style of src/Discretization/DG/DGAdvective_Instantiate/AlgebraicEquationSet_DGAdvective_AdvectionDiffusion3D_AUDNSU.cpp
[ 71%] Checking style of src/Discretization/DG/DGAdvective_Instantiate/AlgebraicEquationSet_DGAdvective_Lorenz.cpp
[ 71%] Checking style of src/Discretization/DG/DGAdvective_Instantiate/AlgebraicEquationSet_DGAdvective_AdvectionDiffusion1D_AUDNSN.cpp
[ 71%] Checking style of src/Discretization/DG/DGAdvective_Instantiate/AlgebraicEquationSet_DGAdvective_Euler1D_PrimitiveRhoPressure.cpp
[ 71%] Checking style of src/Discretization/DG/DGAdvective_Instantiate/AlgebraicEquationSet_DGAdvective_Burgers1D_Conservative_DNSN.cpp
[ 71%] Checking style of src/Discretization/DG/DGAdvective_Instantiate/AlgebraicEquationSet_DGAdvective_Euler2D_Entropy.cpp
[ 71%] Checking style of src/Discretization/DG/DGAdvective_Instantiate/AlgebraicEquationSet_DGAdvective_AdvectionDiffusion2D_manifold_Circle_AUDNSN.cpp
[ 71%] Checking style of src/Discretization/DG/DGAdvective_Instantiate/AlgebraicEquationSet_DGAdvective_AdvectionDiffusion1D_AUDNSUG.cpp
[ 71%] Checking style of src/Discretization/DG/DGAdvective_Instantiate/AlgebraicEquationSet_DGAdvective_Euler1D_Entropy.cpp
[ 71%] Checking style of src/Discretization/DG/DGAdvective_Instantiate/AlgebraicEquationSet_DGAdvective_BuckleyLeverett1D.cpp
[ 71%] Checking style of src/Discretization/DG/DGAdvective_Instantiate/AlgebraicEquationSet_DGAdvective_ShallowWater2D_manifold_Circle.cpp
[ 71%] Checking style of src/Discretization/DG/DGAdvective_Instantiate/AlgebraicEquationSet_DGAdvective_Euler3D_PrimitiveRhoPressure.cpp
[ 71%] Checking style of src/Discretization/DG/DGAdvective_Instantiate/AlgebraicEquationSet_DGAdvective_AdvectionDiffusion2D_AUDNSN.cpp
[ 71%] Checking style of src/Discretization/DG/DGAdvective_Instantiate/AlgebraicEquationSet_DGAdvective_Euler2D_PrimitiveRhoPressure.cpp
[ 71%] Checking style of src/Discretization/DG/DGAdvective_Instantiate/AlgebraicEquationSet_DGAdvective_Euler1D_Conservative.cpp
[ 71%] Built target Discretization_vera
Scanning dependencies of target Discretization
[ 71%] Built target Discretization
Scanning dependencies of target HDGLib
[ 71%] Building CXX object src/Discretization/CMakeFiles/HDGLib.dir/HDG/Instantiate/AlgebraicEquationSet_HDG_AdvectionDiffusion1D_ALaxDUSU.cpp.o
[ 71%] Building CXX object src/Discretization/CMakeFiles/HDGLib.dir/HDG/Instantiate/AlgebraicEquationSet_HDG_AdvectionDiffusion1D_AUDUSUG.cpp.o
[ 71%] Building CXX object src/Discretization/CMakeFiles/HDGLib.dir/HDG/Instantiate/AlgebraicEquationSet_HDG_AdvectionDiffusion2D_AUDUSUG.cpp.o
[ 71%] Building CXX object src/Discretization/CMakeFiles/HDGLib.dir/HDG/Instantiate/AlgebraicEquationSet_HDG_AdvectionDiffusion3D_AUDUSUG.cpp.o
[ 71%] Building CXX object src/Discretization/CMakeFiles/HDGLib.dir/HDG/Instantiate/AlgebraicEquationSet_HDG_BuckleyLeverett1D.cpp.o
[ 71%] Building CXX object src/Discretization/CMakeFiles/HDGLib.dir/HDG/Instantiate/AlgebraicEquationSet_HDG_Burgers1D_Conservative_DUSU.cpp.o
[ 71%] Building CXX object src/Discretization/CMakeFiles/HDGLib.dir/HDG/Instantiate/AlgebraicEquationSet_HDG_Euler1D_Conservative.cpp.o
[ 71%] Building CXX object src/Discretization/CMakeFiles/HDGLib.dir/HDG/Instantiate/AlgebraicEquationSet_HDG_Euler1D_Entropy.cpp.o
[ 71%] Building CXX object src/Discretization/CMakeFiles/HDGLib.dir/HDG/Instantiate/AlgebraicEquationSet_HDG_Euler1D_PrimitiveRhoPressure.cpp.o
[ 71%] Building CXX object src/Discretization/CMakeFiles/HDGLib.dir/HDG/Instantiate/AlgebraicEquationSet_HDG_Euler2D_PrimitiveRhoPressure.cpp.o
[ 71%] Building CXX object src/Discretization/CMakeFiles/HDGLib.dir/HDG/Instantiate/AlgebraicEquationSet_HDG_NavierStokes2D_Conservative_ConstantViscosity.cpp.o
[ 71%] Building CXX object src/Discretization/CMakeFiles/HDGLib.dir/HDG/Instantiate/AlgebraicEquationSet_HDG_NavierStokes2D_Primitive_ConstantViscosity.cpp.o
[ 71%] Building CXX object src/Discretization/CMakeFiles/HDGLib.dir/HDG/Instantiate/AlgebraicEquationSet_HDG_RANSSA2D_Primitive_ConstantViscosity.cpp.o
[ 71%] Building CXX object src/Discretization/CMakeFiles/HDGLib.dir/HDG/Instantiate/AlgebraicEquationSet_HDG_Stokes2D.cpp.o
[ 71%] Building CXX object src/Discretization/CMakeFiles/HDGLib.dir/HDG/Instantiate/AlgebraicEquationSet_HDGAdvective_Advection1D_AUSU.cpp.o
[ 71%] Linking CXX static library libHDGLib.a
[ 71%] Built target HDGLib
Scanning dependencies of target DGAdvectiveLib
[ 71%] Building CXX object src/Discretization/CMakeFiles/DGAdvectiveLib.dir/DG/DGAdvective_Instantiate/AlgebraicEquationSet_DGAdvective_AdvectionDiffusion1D_AUDNSN.cpp.o
[ 71%] Building CXX object src/Discretization/CMakeFiles/DGAdvectiveLib.dir/DG/DGAdvective_Instantiate/AlgebraicEquationSet_DGAdvective_AdvectionDiffusion1D_AUDNSUG.cpp.o
[ 71%] Building CXX object src/Discretization/CMakeFiles/DGAdvectiveLib.dir/DG/DGAdvective_Instantiate/AlgebraicEquationSet_DGAdvective_AdvectionDiffusion2D_AUDNSN.cpp.o
[ 71%] Building CXX object src/Discretization/CMakeFiles/DGAdvectiveLib.dir/DG/DGAdvective_Instantiate/AlgebraicEquationSet_DGAdvective_AdvectionDiffusion3D_AUDNSU.cpp.o
[ 71%] Building CXX object src/Discretization/CMakeFiles/DGAdvectiveLib.dir/DG/DGAdvective_Instantiate/AlgebraicEquationSet_DGAdvective_AdvectionDiffusion2D_manifold_AUDNSN.cpp.o
[ 71%] Building CXX object src/Discretization/CMakeFiles/DGAdvectiveLib.dir/DG/DGAdvective_Instantiate/AlgebraicEquationSet_DGAdvective_AdvectionDiffusion2D_manifold_Circle_AUDNSN.cpp.o
[ 71%] Building CXX object src/Discretization/CMakeFiles/DGAdvectiveLib.dir/DG/DGAdvective_Instantiate/AlgebraicEquationSet_DGAdvective_AdvectionDiffusion2D_Annulus_DNSN.cpp.o
[ 71%] Building CXX object src/Discretization/CMakeFiles/DGAdvectiveLib.dir/DG/DGAdvective_Instantiate/AlgebraicEquationSet_DGAdvective_BuckleyLeverett1D.cpp.o
[ 71%] Building CXX object src/Discretization/CMakeFiles/DGAdvectiveLib.dir/DG/DGAdvective_Instantiate/AlgebraicEquationSet_DGAdvective_Burgers1D_Conservative_DNSN.cpp.o
[ 71%] Building CXX object src/Discretization/CMakeFiles/DGAdvectiveLib.dir/DG/DGAdvective_Instantiate/AlgebraicEquationSet_DGAdvective_ShallowWater1D.cpp.o
[ 71%] Building CXX object src/Discretization/CMakeFiles/DGAdvectiveLib.dir/DG/DGAdvective_Instantiate/AlgebraicEquationSet_DGAdvective_ShallowWater2D_manifold_Circle.cpp.o
[ 71%] Building CXX object src/Discretization/CMakeFiles/DGAdvectiveLib.dir/DG/DGAdvective_Instantiate/AlgebraicEquationSet_DGAdvective_Euler1D_Conservative.cpp.o
[ 71%] Building CXX object src/Discretization/CMakeFiles/DGAdvectiveLib.dir/DG/DGAdvective_Instantiate/AlgebraicEquationSet_DGAdvective_Euler1D_PrimitiveRhoPressure.cpp.o
[ 71%] Building CXX object src/Discretization/CMakeFiles/DGAdvectiveLib.dir/DG/DGAdvective_Instantiate/AlgebraicEquationSet_DGAdvective_Euler1D_Entropy.cpp.o
[ 71%] Building CXX object src/Discretization/CMakeFiles/DGAdvectiveLib.dir/DG/DGAdvective_Instantiate/AlgebraicEquationSet_DGAdvective_Euler2D_Conservative.cpp.o
[ 71%] Building CXX object src/Discretization/CMakeFiles/DGAdvectiveLib.dir/DG/DGAdvective_Instantiate/AlgebraicEquationSet_DGAdvective_Euler2D_PrimitiveRhoPressure.cpp.o
[ 71%] Building CXX object src/Discretization/CMakeFiles/DGAdvectiveLib.dir/DG/DGAdvective_Instantiate/AlgebraicEquationSet_DGAdvective_Euler2D_PrimitiveSurrogate.cpp.o
[ 71%] Building CXX object src/Discretization/CMakeFiles/DGAdvectiveLib.dir/DG/DGAdvective_Instantiate/AlgebraicEquationSet_DGAdvective_Euler2D_Entropy.cpp.o
[ 71%] Building CXX object src/Discretization/CMakeFiles/DGAdvectiveLib.dir/DG/DGAdvective_Instantiate/AlgebraicEquationSet_DGAdvective_Euler3D_PrimitiveRhoPressure.cpp.o
[ 71%] Building CXX object src/Discretization/CMakeFiles/DGAdvectiveLib.dir/DG/DGAdvective_Instantiate/AlgebraicEquationSet_DGAdvective_Euler3D_PrimitiveSurrogate.cpp.o
[ 71%] Building CXX object src/Discretization/CMakeFiles/DGAdvectiveLib.dir/DG/DGAdvective_Instantiate/AlgebraicEquationSet_DGAdvective_Lorenz.cpp.o
[ 71%] Linking CXX static library libDGAdvectiveLib.a
[ 71%] Built target DGAdvectiveLib
Scanning dependencies of target GalerkinLib
[ 71%] Building CXX object src/Discretization/CMakeFiles/GalerkinLib.dir/Galerkin/ExtractCGLocalBoundaries/ExtractCGLocalBoundaries1D.cpp.o
[ 71%] Building CXX object src/Discretization/CMakeFiles/GalerkinLib.dir/Galerkin/ExtractCGLocalBoundaries/ExtractCGLocalBoundaries2D.cpp.o
[ 71%] Building CXX object src/Discretization/CMakeFiles/GalerkinLib.dir/Galerkin/ExtractCGLocalBoundaries/ExtractCGLocalBoundaries3D.cpp.o
[ 71%] Building CXX object src/Discretization/CMakeFiles/GalerkinLib.dir/Galerkin/ExtractCGLocalBoundaries/ExtractCGLocalBoundaries4D.cpp.o
[ 71%] Linking CXX static library libGalerkinLib.a
[ 71%] Built target GalerkinLib
Scanning dependencies of target DGBR2ADLib
[ 71%] Building CXX object src/Discretization/CMakeFiles/DGBR2ADLib.dir/DG/DGBR2_Instantiate/AlgebraicEquationSet_DGBR2_AdvectionDiffusion1D_ALaxDUSU.cpp.o
[ 71%] Building CXX object src/Discretization/CMakeFiles/DGBR2ADLib.dir/DG/DGBR2_Instantiate/AlgebraicEquationSet_DGBR2_AdvectionDiffusion1D_AUDUSUG.cpp.o
[ 71%] Building CXX object src/Discretization/CMakeFiles/DGBR2ADLib.dir/DG/DGBR2_Instantiate/AlgebraicEquationSet_DGBR2_AdvectionDiffusion1D_AUDUSN.cpp.o
[ 71%] Building CXX object src/Discretization/CMakeFiles/DGBR2ADLib.dir/DG/DGBR2_Instantiate/AlgebraicEquationSet_DGBR2_AdvectionDiffusion2D_AUDUSN.cpp.o
[ 71%] Building CXX object src/Discretization/CMakeFiles/DGBR2ADLib.dir/DG/DGBR2_Instantiate/AlgebraicEquationSet_DGBR2_AdvectionDiffusion2D_AUDUSUG.cpp.o
[ 71%] Building CXX object src/Discretization/CMakeFiles/DGBR2ADLib.dir/DG/DGBR2_Instantiate/AlgebraicEquationSet_DGBR2_AdvectionDiffusion3D_AUDUSUG.cpp.o
[ 71%] Building CXX object src/Discretization/CMakeFiles/DGBR2ADLib.dir/DG/DGBR2_Instantiate/AlgebraicEquationSet_DGBR2_AdvectionDiffusion3D_manifold_AUDUSN.cpp.o
[ 71%] Building CXX object src/Discretization/CMakeFiles/DGBR2ADLib.dir/DG/DGBR2_Instantiate/AlgebraicEquationSet_DGBR2_AD_AV2D_AUDUSUG.cpp.o
[ 71%] Building CXX object src/Discretization/CMakeFiles/DGBR2ADLib.dir/DG/DGBR2_Instantiate/AlgebraicEquationSet_DGBR2_Sensor1D_AUSJump_AD.cpp.o
[ 71%] Building CXX object src/Discretization/CMakeFiles/DGBR2ADLib.dir/DG/DGBR2_Instantiate/AlgebraicEquationSet_DGBR2_Sensor2D_AUSJump_AD.cpp.o
[ 71%] Linking CXX static library libDGBR2ADLib.a
[ 71%] Built target DGBR2ADLib
Scanning dependencies of target DGBR2Lib
[ 71%] Building CXX object src/Discretization/CMakeFiles/DGBR2Lib.dir/DG/DiscretizationDGBR2.cpp.o
[ 71%] Linking CXX static library libDGBR2Lib.a
[ 71%] Built target DGBR2Lib
Scanning dependencies of target ErrorEstimateLib_vera
[ 71%] Checking style of src/ErrorEstimate/HDG/ErrorEstimate_HDG.h
[ 71%] Checking style of src/ErrorEstimate/HDG/ErrorEstimateInteriorTrace_HDG.h
[ 71%] Checking style of src/ErrorEstimate/HDG/ErrorEstimateBoundaryTrace_FieldTrace_HDG.h
[ 71%] Checking style of src/ErrorEstimate/HDG/ErrorEstimateCell_HDG.h
[ 71%] Checking style of src/ErrorEstimate/HDG/ErrorEstimateBoundaryTrace_Dispatch_HDG.h
[ 71%] Checking style of src/ErrorEstimate/HDG/ErrorEstimateBoundaryTrace_HDG.h
[ 71%] Checking style of src/ErrorEstimate/Galerkin/ErrorEstimateInteriorTrace_PrimalStrongForm_Galerkin.h
[ 71%] Checking style of src/ErrorEstimate/Galerkin/OutputCorrection_Galerkin_Stabilized.h
[ 71%] Checking style of src/ErrorEstimate/Galerkin/ErrorEstimateBoundaryTrace_Galerkin_LiftedBoundary.h
[ 71%] Checking style of src/ErrorEstimate/Galerkin/ErrorEstimateBase_Galerkin.h
[ 71%] Checking style of src/ErrorEstimate/Galerkin/ErrorEstimateBoundaryTrace_FieldTrace_Galerkin.h
[ 71%] Checking style of src/ErrorEstimate/Galerkin/ErrorEstimateCell_Galerkin.h
[ 71%] Checking style of src/ErrorEstimate/Galerkin/ErrorEstimateCell_LO.h
[ 71%] Checking style of src/ErrorEstimate/Galerkin/ErrorEstimateInteriorTrace_Galerkin.h
[ 71%] Checking style of src/ErrorEstimate/Galerkin/ErrorEstimateBoundaryTrace_Dispatch_Galerkin.h
[ 71%] Checking style of src/ErrorEstimate/Galerkin/ErrorEstimateNodal_Galerkin.h
[ 71%] Checking style of src/ErrorEstimate/Galerkin/ErrorEstimateNodalBase_Galerkin.h
[ 71%] Checking style of src/ErrorEstimate/Galerkin/ErrorEstimateInteriorTrace_SIP_Galerkin.h
[ 71%] Checking style of src/ErrorEstimate/Galerkin/ErrorEstimateBoundaryTrace_Galerkin.h
[ 71%] Checking style of src/ErrorEstimate/Galerkin/ErrorEstimateCell_PrimalStrongForm_Galerkin.h
[ 74%] Checking style of src/ErrorEstimate/Galerkin/ErrorEstimateBoundaryTrace_Dirichlet_mitLG_Galerkin.h
[ 74%] Checking style of src/ErrorEstimate/Galerkin/ErrorEstimate_Galerkin_Stabilized.h
[ 74%] Checking style of src/ErrorEstimate/Galerkin/ErrorEstimate_StrongForm_Galerkin.h
[ 74%] Checking style of src/ErrorEstimate/Galerkin/ErrorEstimateNodal_Galerkin_LiftedBoundary.h
[ 74%] Checking style of src/ErrorEstimate/VMSD/ErrorEstimateBoundaryTrace_VMSD.h
[ 74%] Checking style of src/ErrorEstimate/VMSD/ErrorEstimateInteriorTrace_VMSD.h
[ 74%] Checking style of src/ErrorEstimate/VMSD/ErrorEstimateInteriorTrace_VMSD_BR2.h
[ 74%] Checking style of src/ErrorEstimate/VMSD/ErrorEstimateCell_VMSD_BR2.h
[ 74%] Checking style of src/ErrorEstimate/VMSD/ErrorEstimateBase_VMSD_BR2.h
[ 74%] Checking style of src/ErrorEstimate/VMSD/ErrorEstimate_VMSD.h
[ 74%] Checking style of src/ErrorEstimate/VMSD/ErrorEstimateBase_VMSD.h
[ 74%] Checking style of src/ErrorEstimate/VMSD/ErrorEstimateInteriorTrace_onBoundary_VMSD_BR2.h
[ 74%] Checking style of src/ErrorEstimate/VMSD/ErrorEstimate_VMSD_BR2.h
[ 74%] Checking style of src/ErrorEstimate/VMSD/ErrorEstimateBoundaryTrace_Dispatch_VMSD.h
[ 74%] Checking style of src/ErrorEstimate/VMSD/ErrorEstimateCell_VMSD.h
[ 74%] Checking style of src/ErrorEstimate/VMSD/ErrorEstimate_InnerBoundaryTrace_VMSD.h
[ 74%] Checking style of src/ErrorEstimate/VMSD/ErrorEstimate_VMSD_Linear.h
[ 74%] Checking style of src/ErrorEstimate/VMSD/ErrorEstimateBoundaryTrace_VMSD_BR2.h
[ 74%] Checking style of src/ErrorEstimate/ErrorEstimate_Common.h
[ 74%] Checking style of src/ErrorEstimate/DG/ErrorEstimateBoundaryTrace_DGBR2.h
[ 74%] Checking style of src/ErrorEstimate/DG/ErrorEstimate_DGBR2.h
[ 74%] Checking style of src/ErrorEstimate/DG/ErrorEstimate_DGBR2_impl.h
[ 74%] Checking style of src/ErrorEstimate/DG/ErrorEstimateCell_DGBR2.h
[ 74%] Checking style of src/ErrorEstimate/DG/ErrorEstimate_DGAdvective.h
[ 74%] Checking style of src/ErrorEstimate/DG/ErrorEstimateInteriorTrace_DGBR2.h
[ 74%] Checking style of src/ErrorEstimate/DG/ErrorEstimateBoundaryTrace_Dispatch_DGBR2.h
[ 74%] Checking style of src/ErrorEstimate/ErrorEstimate_L2.h
[ 74%] Checking style of src/ErrorEstimate/ErrorEstimate_fwd.h
[ 74%] Checking style of src/ErrorEstimate/DistributeBoundaryTraceGroups.h
[ 74%] Checking style of src/ErrorEstimate/Galerkin/ErrorEstimateNodalBase_Galerkin.cpp
[ 74%] Checking style of src/ErrorEstimate/VMSD/ErrorEstimateBase_VMSD.cpp
[ 74%] Checking style of src/ErrorEstimate/VMSD/ErrorEstimateBase_VMSD_BR2.cpp
[ 74%] Checking style of src/ErrorEstimate/DG/Instantiate/ErrorEstimate_DGBR2_RANSSA2D_PrimitiveConstVisc.cpp
[ 74%] Checking style of src/ErrorEstimate/DG/Instantiate/ErrorEstimate_DGBR2_NavierStokes3D_PrimitiveConstVisc.cpp
[ 74%] Checking style of src/ErrorEstimate/DG/Instantiate/ErrorEstimate_DGBR2_TwoPhase2D_LogpnSw.cpp
[ 74%] Checking style of src/ErrorEstimate/DG/Instantiate/ErrorEstimate_DGBR2_TwoPhase2D_Surrogate_pnSw.cpp
[ 74%] Checking style of src/ErrorEstimate/DG/Instantiate/ErrorEstimate_DGBR2_NavierStokes3D_PrimitiveSutherland.cpp
[ 74%] Checking style of src/ErrorEstimate/DG/Instantiate/ErrorEstimate_DGBR2_ArtificialViscosity_RANSSA3D_PrimitiveSutherland.cpp
[ 74%] Checking style of src/ErrorEstimate/DG/Instantiate/ErrorEstimate_DGBR2_Burgers2D_Conservative_DUSN.cpp
[ 74%] Checking style of src/ErrorEstimate/DG/Instantiate/ErrorEstimate_DGBR2_AdvectionDiffusion1D_AUDUSUG.cpp
[ 74%] Checking style of src/ErrorEstimate/DG/Instantiate/ErrorEstimate_DGBR2_AdvectionDiffusion2D_AUDUSUG.cpp
[ 74%] Checking style of src/ErrorEstimate/DG/Instantiate/ErrorEstimate_DGBR2_Sensor2D_AUSJump_AD.cpp
[ 74%] Checking style of src/ErrorEstimate/DG/Instantiate/ErrorEstimate_DGBR2_AD_AV2D_AUDUSUG.cpp
[ 74%] Checking style of src/ErrorEstimate/DG/Instantiate/ErrorEstimate_DGBR2_Burgers_AV2D_DUSN.cpp
[ 74%] Checking style of src/ErrorEstimate/DG/Instantiate/ErrorEstimate_DGBR2_TwoPhase1D.cpp
[ 74%] Checking style of src/ErrorEstimate/DG/Instantiate/ErrorEstimate_DGBR2_Sensor2D_AUSJump_Euler1D_Conservative.cpp
[ 74%] Checking style of src/ErrorEstimate/DG/Instantiate/ErrorEstimate_DGBR2_BuckleyLeverett_AV1D_Sensor_AUSJump.cpp
[ 74%] Checking style of src/ErrorEstimate/DG/Instantiate/ErrorEstimate_DGBR2_Euler1D_AV1D_Conservative.cpp
[ 74%] Checking style of src/ErrorEstimate/DG/Instantiate/ErrorEstimate_DGBR2_NavierStokes2D_PrimitiveSutherland.cpp
[ 74%] Checking style of src/ErrorEstimate/DG/Instantiate/ErrorEstimate_DGBR2_NavierStokes2D_PrimitiveConstVisc.cpp
[ 74%] Checking style of src/ErrorEstimate/DG/Instantiate/ErrorEstimate_DGBR2_Sensor1D_AUSJump_AD.cpp
[ 74%] Checking style of src/ErrorEstimate/DG/Instantiate/ErrorEstimate_DGBR2_ArtificialViscosity_BuckleyLeverett1D.cpp
[ 74%] Checking style of src/ErrorEstimate/DG/Instantiate/ErrorEstimate_DGBR2_Lorenz.cpp
[ 74%] Checking style of src/ErrorEstimate/DG/Instantiate/ErrorEstimate_DGBR2_RANSSA3D_PrimitiveConstVisc.cpp
[ 74%] Checking style of src/ErrorEstimate/DG/Instantiate/ErrorEstimate_DGBR2_Burgers1D_Conservative_DUSN.cpp
[ 74%] Checking style of src/ErrorEstimate/DG/Instantiate/ErrorEstimate_DGBR2_RANSSA3D_PrimitiveSutherland.cpp
[ 74%] Checking style of src/ErrorEstimate/DG/Instantiate/ErrorEstimate_DGBR2_NavierStokes3D_SurrogateSutherland.cpp
[ 74%] Checking style of src/ErrorEstimate/DG/Instantiate/ErrorEstimate_DGBR2_Burgers_AV1D_DUSUG.cpp
[ 74%] Checking style of src/ErrorEstimate/DG/Instantiate/ErrorEstimate_DGBR2_RANSSA3D_SurrogateSutherland.cpp
[ 74%] Checking style of src/ErrorEstimate/DG/Instantiate/ErrorEstimate_DGBR2_BuckleyLeverett1D.cpp
[ 74%] Checking style of src/ErrorEstimate/DG/Instantiate/ErrorEstimate_DGBR2_TwoPhase2D.cpp
[ 74%] Checking style of src/ErrorEstimate/DG/Instantiate/ErrorEstimate_DGBR2_AdvectionDiffusion3D_AUDUSUG.cpp
[ 74%] Checking style of src/ErrorEstimate/DG/Instantiate/ErrorEstimate_DGBR2_RANSSA2D_PrimitiveSutherland.cpp
[ 74%] Checking style of src/ErrorEstimate/DG/Instantiate/ErrorEstimate_DGBR2_ArtificialViscosity_TwoPhase2D.cpp
[ 74%] Checking style of src/ErrorEstimate/DG/Instantiate/ErrorEstimate_DGBR2_ArtificialViscosity_TwoPhase1D.cpp
[ 74%] Built target ErrorEstimateLib_vera
Scanning dependencies of target ErrorEstimateLib
[ 74%] Building CXX object src/ErrorEstimate/CMakeFiles/ErrorEstimateLib.dir/DG/Instantiate/ErrorEstimate_DGBR2_AdvectionDiffusion1D_AUDUSUG.cpp.o
[ 74%] Building CXX object src/ErrorEstimate/CMakeFiles/ErrorEstimateLib.dir/DG/Instantiate/ErrorEstimate_DGBR2_AdvectionDiffusion2D_AUDUSUG.cpp.o
[ 74%] Building CXX object src/ErrorEstimate/CMakeFiles/ErrorEstimateLib.dir/DG/Instantiate/ErrorEstimate_DGBR2_AdvectionDiffusion3D_AUDUSUG.cpp.o
[ 74%] Building CXX object src/ErrorEstimate/CMakeFiles/ErrorEstimateLib.dir/DG/Instantiate/ErrorEstimate_DGBR2_Sensor1D_AUSJump_AD.cpp.o
[ 74%] Building CXX object src/ErrorEstimate/CMakeFiles/ErrorEstimateLib.dir/DG/Instantiate/ErrorEstimate_DGBR2_Sensor2D_AUSJump_AD.cpp.o
[ 74%] Building CXX object src/ErrorEstimate/CMakeFiles/ErrorEstimateLib.dir/DG/Instantiate/ErrorEstimate_DGBR2_Sensor2D_AUSJump_Euler1D_Conservative.cpp.o
[ 74%] Building CXX object src/ErrorEstimate/CMakeFiles/ErrorEstimateLib.dir/DG/Instantiate/ErrorEstimate_DGBR2_AD_AV2D_AUDUSUG.cpp.o
[ 74%] Building CXX object src/ErrorEstimate/CMakeFiles/ErrorEstimateLib.dir/DG/Instantiate/ErrorEstimate_DGBR2_Burgers_AV1D_DUSUG.cpp.o
[ 74%] Building CXX object src/ErrorEstimate/CMakeFiles/ErrorEstimateLib.dir/DG/Instantiate/ErrorEstimate_DGBR2_Burgers_AV2D_DUSN.cpp.o
[ 74%] Building CXX object src/ErrorEstimate/CMakeFiles/ErrorEstimateLib.dir/DG/Instantiate/ErrorEstimate_DGBR2_BuckleyLeverett1D.cpp.o
[ 74%] Building CXX object src/ErrorEstimate/CMakeFiles/ErrorEstimateLib.dir/DG/Instantiate/ErrorEstimate_DGBR2_BuckleyLeverett_AV1D_Sensor_AUSJump.cpp.o
[ 74%] Building CXX object src/ErrorEstimate/CMakeFiles/ErrorEstimateLib.dir/DG/Instantiate/ErrorEstimate_DGBR2_TwoPhase1D.cpp.o
[ 74%] Building CXX object src/ErrorEstimate/CMakeFiles/ErrorEstimateLib.dir/DG/Instantiate/ErrorEstimate_DGBR2_TwoPhase2D.cpp.o
[ 74%] Building CXX object src/ErrorEstimate/CMakeFiles/ErrorEstimateLib.dir/DG/Instantiate/ErrorEstimate_DGBR2_TwoPhase2D_LogpnSw.cpp.o
[ 74%] Building CXX object src/ErrorEstimate/CMakeFiles/ErrorEstimateLib.dir/DG/Instantiate/ErrorEstimate_DGBR2_TwoPhase2D_Surrogate_pnSw.cpp.o
[ 74%] Building CXX object src/ErrorEstimate/CMakeFiles/ErrorEstimateLib.dir/DG/Instantiate/ErrorEstimate_DGBR2_Burgers1D_Conservative_DUSN.cpp.o
[ 74%] Building CXX object src/ErrorEstimate/CMakeFiles/ErrorEstimateLib.dir/DG/Instantiate/ErrorEstimate_DGBR2_Burgers2D_Conservative_DUSN.cpp.o
[ 74%] Building CXX object src/ErrorEstimate/CMakeFiles/ErrorEstimateLib.dir/DG/Instantiate/ErrorEstimate_DGBR2_Euler1D_AV1D_Conservative.cpp.o
[ 74%] Building CXX object src/ErrorEstimate/CMakeFiles/ErrorEstimateLib.dir/DG/Instantiate/ErrorEstimate_DGBR2_NavierStokes2D_PrimitiveConstVisc.cpp.o
[ 74%] Building CXX object src/ErrorEstimate/CMakeFiles/ErrorEstimateLib.dir/DG/Instantiate/ErrorEstimate_DGBR2_NavierStokes2D_PrimitiveSutherland.cpp.o
[ 74%] Building CXX object src/ErrorEstimate/CMakeFiles/ErrorEstimateLib.dir/DG/Instantiate/ErrorEstimate_DGBR2_NavierStokes3D_PrimitiveConstVisc.cpp.o
[ 74%] Building CXX object src/ErrorEstimate/CMakeFiles/ErrorEstimateLib.dir/DG/Instantiate/ErrorEstimate_DGBR2_NavierStokes3D_PrimitiveSutherland.cpp.o
[ 74%] Building CXX object src/ErrorEstimate/CMakeFiles/ErrorEstimateLib.dir/DG/Instantiate/ErrorEstimate_DGBR2_NavierStokes3D_SurrogateSutherland.cpp.o
[ 74%] Building CXX object src/ErrorEstimate/CMakeFiles/ErrorEstimateLib.dir/DG/Instantiate/ErrorEstimate_DGBR2_RANSSA2D_PrimitiveConstVisc.cpp.o
[ 74%] Building CXX object src/ErrorEstimate/CMakeFiles/ErrorEstimateLib.dir/DG/Instantiate/ErrorEstimate_DGBR2_RANSSA2D_PrimitiveSutherland.cpp.o
[ 74%] Building CXX object src/ErrorEstimate/CMakeFiles/ErrorEstimateLib.dir/DG/Instantiate/ErrorEstimate_DGBR2_RANSSA3D_PrimitiveConstVisc.cpp.o
[ 74%] Building CXX object src/ErrorEstimate/CMakeFiles/ErrorEstimateLib.dir/DG/Instantiate/ErrorEstimate_DGBR2_RANSSA3D_PrimitiveSutherland.cpp.o
[ 74%] Building CXX object src/ErrorEstimate/CMakeFiles/ErrorEstimateLib.dir/DG/Instantiate/ErrorEstimate_DGBR2_RANSSA3D_SurrogateSutherland.cpp.o
[ 74%] Building CXX object src/ErrorEstimate/CMakeFiles/ErrorEstimateLib.dir/DG/Instantiate/ErrorEstimate_DGBR2_ArtificialViscosity_BuckleyLeverett1D.cpp.o
[ 74%] Building CXX object src/ErrorEstimate/CMakeFiles/ErrorEstimateLib.dir/DG/Instantiate/ErrorEstimate_DGBR2_ArtificialViscosity_TwoPhase1D.cpp.o
[ 74%] Building CXX object src/ErrorEstimate/CMakeFiles/ErrorEstimateLib.dir/DG/Instantiate/ErrorEstimate_DGBR2_ArtificialViscosity_TwoPhase2D.cpp.o
[ 74%] Building CXX object src/ErrorEstimate/CMakeFiles/ErrorEstimateLib.dir/DG/Instantiate/ErrorEstimate_DGBR2_ArtificialViscosity_RANSSA3D_PrimitiveSutherland.cpp.o
[ 74%] Building CXX object src/ErrorEstimate/CMakeFiles/ErrorEstimateLib.dir/DG/Instantiate/ErrorEstimate_DGBR2_Lorenz.cpp.o
[ 74%] Building CXX object src/ErrorEstimate/CMakeFiles/ErrorEstimateLib.dir/Galerkin/ErrorEstimateNodalBase_Galerkin.cpp.o
[ 74%] Building CXX object src/ErrorEstimate/CMakeFiles/ErrorEstimateLib.dir/VMSD/ErrorEstimateBase_VMSD.cpp.o
[ 74%] Building CXX object src/ErrorEstimate/CMakeFiles/ErrorEstimateLib.dir/VMSD/ErrorEstimateBase_VMSD_BR2.cpp.o
[ 74%] Linking CXX static library libErrorEstimateLib.a
[ 74%] Built target ErrorEstimateLib
Scanning dependencies of target AFLRLib_vera
[ 74%] Checking style of src/Meshing/AFLR/AFLR3.h
[ 74%] Checking style of src/Meshing/AFLR/AFLR2.h
[ 74%] Checking style of src/Meshing/AFLR/AFLR2.cpp
[ 74%] Checking style of src/Meshing/AFLR/AFLR3.cpp
[ 74%] Built target AFLRLib_vera
Scanning dependencies of target AFLRLib
[ 74%] Building CXX object src/Meshing/AFLR/CMakeFiles/AFLRLib.dir/AFLR2.cpp.o
[ 74%] Building CXX object src/Meshing/AFLR/CMakeFiles/AFLRLib.dir/AFLR3.cpp.o
[ 74%] Linking CXX static library libAFLRLib.a
[ 74%] Built target AFLRLib
Scanning dependencies of target avroLib_vera
[ 74%] Checking style of src/Meshing/avro/MesherInterface_Wake_avro.h
[ 74%] Checking style of src/Meshing/avro/XField3D_Wake_avro.h
[ 74%] Checking style of src/Meshing/avro/XField_avro.h
[ 74%] Checking style of src/Meshing/avro/MesherInterface_avro.h
[ 74%] Checking style of src/Meshing/avro/XField_avro_impl.h
[ 74%] Checking style of src/Meshing/avro/XField3D_Wake_avro.cpp
[ 74%] Checking style of src/Meshing/avro/MesherInterface_avro.cpp
[ 74%] Checking style of src/Meshing/avro/XField_avro_3D.cpp
[ 74%] Checking style of src/Meshing/avro/XField_avro_2D.cpp
[ 74%] Checking style of src/Meshing/avro/XField_avro_4D.cpp
[ 74%] Checking style of src/Meshing/avro/MesherInterface_Wake_avro.cpp
[ 74%] Built target avroLib_vera
Scanning dependencies of target avroLib
[ 74%] Building CXX object src/Meshing/avro/CMakeFiles/avroLib.dir/MesherInterface_avro.cpp.o
[ 74%] Building CXX object src/Meshing/avro/CMakeFiles/avroLib.dir/MesherInterface_Wake_avro.cpp.o
[ 74%] Building CXX object src/Meshing/avro/CMakeFiles/avroLib.dir/XField_avro_2D.cpp.o
[ 74%] Building CXX object src/Meshing/avro/CMakeFiles/avroLib.dir/XField_avro_3D.cpp.o
[ 74%] Building CXX object src/Meshing/avro/CMakeFiles/avroLib.dir/XField_avro_4D.cpp.o
[ 74%] Building CXX object src/Meshing/avro/CMakeFiles/avroLib.dir/XField3D_Wake_avro.cpp.o
[ 74%] Linking CXX static library libavroLib.a
[ 74%] Built target avroLib
Scanning dependencies of target EGADSLib_vera
[ 74%] Checking style of src/Meshing/EGADS/EGModel.h
[ 74%] Checking style of src/Meshing/EGADS/EGContext.h
[ 74%] Checking style of src/Meshing/EGADS/EGApproximate.h
[ 74%] Checking style of src/Meshing/EGADS/EGGeometryBase.h
[ 74%] Checking style of src/Meshing/EGADS/EGNode.h
[ 74%] Checking style of src/Meshing/EGADS/EGTopologyBase.h
[ 74%] Checking style of src/Meshing/EGADS/isEquivalent.h
[ 74%] Checking style of src/Meshing/EGADS/EGStatus.h
[ 74%] Checking style of src/Meshing/EGADS/EGLoop.h
[ 74%] Checking style of src/Meshing/EGADS/Airfoils/NACA4.h
[ 74%] Checking style of src/Meshing/EGADS/isSame.h
[ 74%] Checking style of src/Meshing/EGADS/EGObject.h
[ 74%] Checking style of src/Meshing/EGADS/clone.h
[ 74%] Checking style of src/Meshing/EGADS/EGCircle.h
[ 74%] Checking style of src/Meshing/EGADS/EGEdge.h
[ 74%] Checking style of src/Meshing/EGADS/EGLine.h
[ 74%] Checking style of src/Meshing/EGADS/extrude.h
[ 74%] Checking style of src/Meshing/EGADS/replaceFaces.h
[ 74%] Checking style of src/Meshing/EGADS/EGFace.h
[ 74%] Checking style of src/Meshing/EGADS/EGIntersection.h
[ 74%] Checking style of src/Meshing/EGADS/EGPlane.h
[ 77%] Checking style of src/Meshing/EGADS/tools.h
[ 77%] Checking style of src/Meshing/EGADS/rotate.h
[ 77%] Checking style of src/Meshing/EGADS/EGBody.h
[ 77%] Checking style of src/Meshing/EGADS/solidBoolean.h
[ 77%] Checking style of src/Meshing/EGADS/EGSense.h
[ 77%] Checking style of src/Meshing/EGADS/sewFaces.h
[ 77%] Checking style of src/Meshing/EGADS/EGModel.cpp
[ 77%] Checking style of src/Meshing/EGADS/EGEdge.cpp
[ 77%] Checking style of src/Meshing/EGADS/EGTopologyBase.cpp
[ 77%] Checking style of src/Meshing/EGADS/EGGeometryBase.cpp
[ 77%] Checking style of src/Meshing/EGADS/EGFace.cpp
[ 77%] Checking style of src/Meshing/EGADS/EGApproximate.cpp
[ 77%] Checking style of src/Meshing/EGADS/EGLoop.cpp
[ 77%] Checking style of src/Meshing/EGADS/EGNode.cpp
[ 77%] Checking style of src/Meshing/EGADS/Airfoils/NACA4.cpp
[ 77%] Checking style of src/Meshing/EGADS/EGObject.cpp
[ 77%] Checking style of src/Meshing/EGADS/EGLine.cpp
[ 77%] Checking style of src/Meshing/EGADS/EGBody.cpp
[ 77%] Checking style of src/Meshing/EGADS/EGPlane.cpp
[ 77%] Checking style of src/Meshing/EGADS/EGCircle.cpp
[ 77%] Checking style of src/Meshing/EGADS/EGStatus.cpp
[ 77%] Checking style of src/Meshing/EGADS/EGContext.cpp
[ 77%] Built target EGADSLib_vera
Scanning dependencies of target EGADSLib
[ 77%] Building CXX object src/Meshing/EGADS/CMakeFiles/EGADSLib.dir/EGStatus.cpp.o
[ 77%] Building CXX object src/Meshing/EGADS/CMakeFiles/EGADSLib.dir/EGContext.cpp.o
[ 77%] Building CXX object src/Meshing/EGADS/CMakeFiles/EGADSLib.dir/EGObject.cpp.o
[ 77%] Building CXX object src/Meshing/EGADS/CMakeFiles/EGADSLib.dir/EGGeometryBase.cpp.o
[ 77%] Building CXX object src/Meshing/EGADS/CMakeFiles/EGADSLib.dir/EGLine.cpp.o
[ 77%] Building CXX object src/Meshing/EGADS/CMakeFiles/EGADSLib.dir/EGCircle.cpp.o
[ 77%] Building CXX object src/Meshing/EGADS/CMakeFiles/EGADSLib.dir/EGPlane.cpp.o
[ 77%] Building CXX object src/Meshing/EGADS/CMakeFiles/EGADSLib.dir/EGApproximate.cpp.o
[ 77%] Building CXX object src/Meshing/EGADS/CMakeFiles/EGADSLib.dir/EGTopologyBase.cpp.o
[ 77%] Building CXX object src/Meshing/EGADS/CMakeFiles/EGADSLib.dir/EGNode.cpp.o
[ 77%] Building CXX object src/Meshing/EGADS/CMakeFiles/EGADSLib.dir/EGEdge.cpp.o
[ 77%] Building CXX object src/Meshing/EGADS/CMakeFiles/EGADSLib.dir/EGLoop.cpp.o
[ 77%] Building CXX object src/Meshing/EGADS/CMakeFiles/EGADSLib.dir/EGFace.cpp.o
[ 77%] Building CXX object src/Meshing/EGADS/CMakeFiles/EGADSLib.dir/EGBody.cpp.o
[ 77%] Building CXX object src/Meshing/EGADS/CMakeFiles/EGADSLib.dir/EGModel.cpp.o
[ 77%] Building CXX object src/Meshing/EGADS/CMakeFiles/EGADSLib.dir/Airfoils/NACA4.cpp.o
[ 77%] Linking CXX static library libEGADSLib.a
[ 77%] Built target EGADSLib
Scanning dependencies of target EGTessLib_vera
[ 77%] Checking style of src/Meshing/EGTess/EGTessellation.h
[ 77%] Checking style of src/Meshing/EGTess/EGTessBody.h
[ 77%] Checking style of src/Meshing/EGTess/EGVertexFace.h
[ 77%] Checking style of src/Meshing/EGTess/EGTessModel.h
[ 77%] Checking style of src/Meshing/EGTess/AFLR4.h
[ 77%] Checking style of src/Meshing/EGTess/WakedFarFieldBox.h
[ 77%] Checking style of src/Meshing/EGTess/EGVertexEdgeNode.h
[ 77%] Checking style of src/Meshing/EGTess/EGVertex_Mean.h
[ 77%] Checking style of src/Meshing/EGTess/EGVertexEdge.h
[ 77%] Checking style of src/Meshing/EGTess/intersectWake.h
[ 77%] Checking style of src/Meshing/EGTess/EGTessFace.h
[ 77%] Checking style of src/Meshing/EGTess/EGVertex.h
[ 77%] Checking style of src/Meshing/EGTess/EGTriangle.h
[ 77%] Checking style of src/Meshing/EGTess/EGTessEdge.h
[ 77%] Checking style of src/Meshing/EGTess/makeWakedAirfoil.h
[ 77%] Checking style of src/Meshing/EGTess/EGVertex.cpp
[ 77%] Checking style of src/Meshing/EGTess/AFLR4.cpp
[ 77%] Checking style of src/Meshing/EGTess/EGVertexEdge.cpp
[ 77%] Checking style of src/Meshing/EGTess/EGTriangle.cpp
[ 77%] Checking style of src/Meshing/EGTess/EGVertexEdgeNode.cpp
[ 77%] Checking style of src/Meshing/EGTess/EGTessFace.cpp
[ 77%] Checking style of src/Meshing/EGTess/intersectWake.cpp
[ 77%] Checking style of src/Meshing/EGTess/makeWakedAirfoil.cpp
[ 77%] Checking style of src/Meshing/EGTess/WakedFarFieldBox.cpp
[ 77%] Checking style of src/Meshing/EGTess/EGTessellation.cpp
[ 77%] Checking style of src/Meshing/EGTess/EGTessModel_aflr4.cpp
[ 80%] Checking style of src/Meshing/EGTess/EGVertexFace.cpp
[ 80%] Checking style of src/Meshing/EGTess/EGTessModel.cpp
[ 80%] Checking style of src/Meshing/EGTess/EGTessEdge.cpp
[ 80%] Built target EGTessLib_vera
Scanning dependencies of target EGTessLib
[ 80%] Building CXX object src/Meshing/EGTess/CMakeFiles/EGTessLib.dir/EGTessellation.cpp.o
[ 80%] Building CXX object src/Meshing/EGTess/CMakeFiles/EGTessLib.dir/EGTessEdge.cpp.o
[ 80%] Building CXX object src/Meshing/EGTess/CMakeFiles/EGTessLib.dir/EGTessFace.cpp.o
[ 80%] Building CXX object src/Meshing/EGTess/CMakeFiles/EGTessLib.dir/EGTessModel.cpp.o
[ 80%] Building CXX object src/Meshing/EGTess/CMakeFiles/EGTessLib.dir/EGVertex.cpp.o
[ 80%] Building CXX object src/Meshing/EGTess/CMakeFiles/EGTessLib.dir/EGVertexEdge.cpp.o
[ 80%] Building CXX object src/Meshing/EGTess/CMakeFiles/EGTessLib.dir/EGVertexFace.cpp.o
[ 80%] Building CXX object src/Meshing/EGTess/CMakeFiles/EGTessLib.dir/makeWakedAirfoil.cpp.o
[ 80%] Building CXX object src/Meshing/EGTess/CMakeFiles/EGTessLib.dir/WakedFarFieldBox.cpp.o
[ 80%] Building CXX object src/Meshing/EGTess/CMakeFiles/EGTessLib.dir/intersectWake.cpp.o
[ 80%] Building CXX object src/Meshing/EGTess/CMakeFiles/EGTessLib.dir/EGTriangle.cpp.o
[ 80%] Building C object src/Meshing/EGTess/CMakeFiles/EGTessLib.dir/getTessBody.c.o
[ 80%] Building CXX object src/Meshing/EGTess/CMakeFiles/EGTessLib.dir/EGTessModel_aflr4.cpp.o
[ 80%] Building CXX object src/Meshing/EGTess/CMakeFiles/EGTessLib.dir/AFLR4.cpp.o
[ 80%] Linking CXX static library libEGTessLib.a
[ 80%] Built target EGTessLib
Scanning dependencies of target EmbeddingLib_vera
[ 82%] Checking style of src/Meshing/Embedding/MesherInterface_Embedding.h
[ 82%] Checking style of src/Meshing/Embedding/MesherInterface_Embedding.cpp
[ 82%] Built target EmbeddingLib_vera
Scanning dependencies of target EmbeddingLib
[ 82%] Building CXX object src/Meshing/Embedding/CMakeFiles/EmbeddingLib.dir/MesherInterface_Embedding.cpp.o
[ 82%] Linking CXX static library libEmbeddingLib.a
[ 82%] Built target EmbeddingLib
Scanning dependencies of target EPICLib_vera
[ 82%] Checking style of src/Meshing/EPIC/WriteMeshMetric_Epic.h
[ 82%] Checking style of src/Meshing/EPIC/SolutionField_PX.h
[ 82%] Checking style of src/Meshing/EPIC/XField_PX.h
[ 82%] Checking style of src/Meshing/EPIC/MesherInterface_Epic.h
[ 82%] Checking style of src/Meshing/EPIC/XField_PX.cpp
[ 82%] Checking style of src/Meshing/EPIC/SolutionField_PX.cpp
[ 82%] Checking style of src/Meshing/EPIC/MesherInterface_Epic.cpp
[ 82%] Checking style of src/Meshing/EPIC/WriteMeshMetric_Epic.cpp
[ 82%] Built target EPICLib_vera
Scanning dependencies of target EPICLib
[ 82%] Building CXX object src/Meshing/EPIC/CMakeFiles/EPICLib.dir/MesherInterface_Epic.cpp.o
[ 82%] Building CXX object src/Meshing/EPIC/CMakeFiles/EPICLib.dir/WriteMeshMetric_Epic.cpp.o
[ 82%] Building CXX object src/Meshing/EPIC/CMakeFiles/EPICLib.dir/XField_PX.cpp.o
[ 82%] Building CXX object src/Meshing/EPIC/CMakeFiles/EPICLib.dir/SolutionField_PX.cpp.o
[ 82%] Linking CXX static library libEPICLib.a
[ 82%] Built target EPICLib
Scanning dependencies of target TetGenLib_vera
[ 82%] Checking style of src/Meshing/TetGen/EGTetGen.h
[ 82%] Checking style of src/Meshing/TetGen/makeTetGenModel.h
[ 82%] Checking style of src/Meshing/TetGen/makeTetGenModel.cpp
[ 82%] Checking style of src/Meshing/TetGen/EGTetGen.cpp
[ 82%] Built target TetGenLib_vera
Scanning dependencies of target TetGenLib
[ 82%] Building CXX object src/Meshing/TetGen/CMakeFiles/TetGenLib.dir/makeTetGenModel.cpp.o
[ 82%] Building CXX object src/Meshing/TetGen/CMakeFiles/TetGenLib.dir/EGTetGen.cpp.o
[ 82%] Linking CXX static library libTetGenLib.a
[ 82%] Built target TetGenLib
Scanning dependencies of target refineLib_vera
[ 82%] Checking style of src/Meshing/refine/XField_refine.h
[ 82%] Checking style of src/Meshing/refine/MultiScale_metric.h
[ 82%] Checking style of src/Meshing/refine/MesherInterface_refine.h
[ 82%] Checking style of src/Meshing/refine/refine_ptr.h
[ 82%] Checking style of src/Meshing/refine/refine_defs.h
[ 82%] Checking style of src/Meshing/refine/XField_refine.cpp
[ 82%] Checking style of src/Meshing/refine/refine_grid.cpp
[ 82%] Checking style of src/Meshing/refine/MesherInterface_refine.cpp
[ 82%] Checking style of src/Meshing/refine/MesherInterface_refineParams.cpp
[ 82%] Checking style of src/Meshing/refine/MultiScale_metric.cpp
[ 82%] Built target refineLib_vera
Scanning dependencies of target refineLib
[ 82%] Building CXX object src/Meshing/refine/CMakeFiles/refineLib.dir/MesherInterface_refine.cpp.o
[ 82%] Building CXX object src/Meshing/refine/CMakeFiles/refineLib.dir/MesherInterface_refineParams.cpp.o
[ 82%] Linking CXX static library librefineLib.a
[ 82%] Built target refineLib
Scanning dependencies of target libMeshbLib_vera
[ 82%] Checking style of src/Meshing/libMeshb/WriteMesh_libMeshb.h
[ 82%] Checking style of src/Meshing/libMeshb/XField_libMeshb.h
[ 82%] Checking style of src/Meshing/libMeshb/libMeshb_Interface.h
[ 82%] Checking style of src/Meshing/libMeshb/ReadSolution_libMeshb.h
[ 82%] Checking style of src/Meshing/libMeshb/WriteSolution_libMeshb.h
[ 82%] Checking style of src/Meshing/libMeshb/ReadSolution_libMeshb.cpp
[ 82%] Checking style of src/Meshing/libMeshb/WriteSolution_libMeshb.cpp
[ 82%] Checking style of src/Meshing/libMeshb/WriteMesh_libMeshb.cpp
[ 82%] Checking style of src/Meshing/libMeshb/XFieldArea_libMeshb.cpp
[ 82%] Checking style of src/Meshing/libMeshb/XFieldVolume_libMeshb.cpp
[ 82%] Built target libMeshbLib_vera
Scanning dependencies of target libMeshbLib
[ 82%] Building CXX object src/Meshing/libMeshb/CMakeFiles/libMeshbLib.dir/WriteMesh_libMeshb.cpp.o
[ 82%] Building CXX object src/Meshing/libMeshb/CMakeFiles/libMeshbLib.dir/WriteSolution_libMeshb.cpp.o
[ 82%] Building CXX object src/Meshing/libMeshb/CMakeFiles/libMeshbLib.dir/ReadSolution_libMeshb.cpp.o
[ 82%] Building CXX object src/Meshing/libMeshb/CMakeFiles/libMeshbLib.dir/XFieldArea_libMeshb.cpp.o
[ 82%] Building CXX object src/Meshing/libMeshb/CMakeFiles/libMeshbLib.dir/XFieldVolume_libMeshb.cpp.o
[ 82%] Linking CXX static library liblibMeshbLib.a
[ 82%] Built target libMeshbLib
Scanning dependencies of target FeFloaLib_vera
[ 82%] Checking style of src/Meshing/FeFloa/MesherInterface_FeFloa.h
[ 82%] Checking style of src/Meshing/FeFloa/MesherInterface_FeFloa.cpp
[ 82%] Built target FeFloaLib_vera
Scanning dependencies of target FeFloaLib
[ 82%] Building CXX object src/Meshing/FeFloa/CMakeFiles/FeFloaLib.dir/MesherInterface_FeFloa.cpp.o
[ 82%] Linking CXX static library libFeFloaLib.a
[ 82%] Built target FeFloaLib
Scanning dependencies of target XField1DLib_vera
[ 82%] Checking style of src/Meshing/XField1D/XField1D.h
[ 82%] Checking style of src/Meshing/XField1D/XField1D.cpp
[ 82%] Built target XField1DLib_vera
Scanning dependencies of target XField1DLib
[ 82%] Building CXX object src/Meshing/XField1D/CMakeFiles/XField1DLib.dir/XField1D.cpp.o
[ 82%] Linking CXX static library libXField1DLib.a
[ 82%] Built target XField1DLib
Scanning dependencies of target MPILib_vera
[ 82%] Checking style of src/MPI/communicator.h
[ 82%] Checking style of src/MPI/serialize_DenseLinAlg_MatrixS.h
[ 82%] Checking style of src/MPI/boost_serialization_array.h
[ 82%] Checking style of src/MPI/continuousElementMap.h
[ 82%] Checking style of src/MPI/serialize_BoundingBox.h
[ 82%] Checking style of src/MPI/operations.h
[ 82%] Checking style of src/MPI/serialize_SurrealS.h
[ 82%] Checking style of src/MPI/communicator_fwd.h
[ 82%] Checking style of src/MPI/MPI_sleep.h
[ 82%] Checking style of src/MPI/MPI_sleep.cpp
[ 82%] Built target MPILib_vera
Scanning dependencies of target MPILib
[ 82%] Building CXX object src/MPI/CMakeFiles/MPILib.dir/MPI_sleep.cpp.o
[ 82%] Linking CXX static library libMPILib.a
[ 82%] Built target MPILib
Scanning dependencies of target AdvectionDiffusionLib_vera
[ 82%] Checking style of src/pde/AdvectionDiffusion/TraitsAdvectionDiffusionArtificialViscosity.h
[ 82%] Checking style of src/pde/AdvectionDiffusion/SolutionFunction2D.h
[ 82%] Checking style of src/pde/AdvectionDiffusion/Source1D.h
[ 82%] Checking style of src/pde/AdvectionDiffusion/ForcingFunction1D.h
[ 82%] Checking style of src/pde/AdvectionDiffusion/PDEAdvectionDiffusion3D.h
[ 82%] Checking style of src/pde/AdvectionDiffusion/OutputAdvectionDiffusion1D.h
[ 82%] Checking style of src/pde/AdvectionDiffusion/BCAdvectionDiffusion1D.h
[ 82%] Checking style of src/pde/AdvectionDiffusion/AdvectiveFlux1D.h
[ 85%] Checking style of src/pde/AdvectionDiffusion/Source3D.h
[ 85%] Checking style of src/pde/AdvectionDiffusion/ForcingFunction2D.h
[ 85%] Checking style of src/pde/AdvectionDiffusion/ViscousFlux3D.h
[ 85%] Checking style of src/pde/AdvectionDiffusion/BCAdvectionDiffusionType.h
[ 85%] Checking style of src/pde/AdvectionDiffusion/BCAdvectionDiffusion3D.h
[ 85%] Checking style of src/pde/AdvectionDiffusion/ForcingFunction3D.h
[ 85%] Checking style of src/pde/AdvectionDiffusion/OutputAdvectionDiffusion2D.h
[ 85%] Checking style of src/pde/AdvectionDiffusion/AdvectiveFlux3D.h
[ 85%] Checking style of src/pde/AdvectionDiffusion/Source2D.h
[ 85%] Checking style of src/pde/AdvectionDiffusion/AdvectiveFlux2D.h
[ 85%] Checking style of src/pde/AdvectionDiffusion/BCAdvectionDiffusion2D.h
[ 85%] Checking style of src/pde/AdvectionDiffusion/PDEAdvectionDiffusion1D.h
[ 85%] Checking style of src/pde/AdvectionDiffusion/AdvectionDiffusion_Sensor.h
[ 85%] Checking style of src/pde/AdvectionDiffusion/ViscousFlux1D.h
[ 85%] Checking style of src/pde/AdvectionDiffusion/OutputAdvectionDiffusion3D.h
[ 85%] Checking style of src/pde/AdvectionDiffusion/AdvectionDiffusion_Traits.h
[ 85%] Checking style of src/pde/AdvectionDiffusion/BCAdvectionDiffusion_ArtificialViscosity2D.h
[ 85%] Checking style of src/pde/AdvectionDiffusion/ViscousFlux2D.h
[ 85%] Checking style of src/pde/AdvectionDiffusion/SolutionFunction1D.h
[ 85%] Checking style of src/pde/AdvectionDiffusion/PDEAdvectionDiffusion2D.h
[ 85%] Checking style of src/pde/AdvectionDiffusion/PDEAdvectionDiffusion_ArtificialViscosity2D.h
[ 85%] Checking style of src/pde/AdvectionDiffusion/PDEAdvectionDiffusion3D.cpp
[ 85%] Checking style of src/pde/AdvectionDiffusion/AdvectiveFlux2D.cpp
[ 85%] Checking style of src/pde/AdvectionDiffusion/AdvectionDiffusionArtificialViscosity3D.cpp
[ 85%] Checking style of src/pde/AdvectionDiffusion/AdvectiveFlux1D.cpp
[ 85%] Checking style of src/pde/AdvectionDiffusion/BCAdvectionDiffusion1D.cpp
[ 85%] Checking style of src/pde/AdvectionDiffusion/BCAdvectionDiffusion3D.cpp
[ 85%] Checking style of src/pde/AdvectionDiffusion/ViscousFlux1D.cpp
[ 85%] Checking style of src/pde/AdvectionDiffusion/BCAdvectionDiffusion_ArtificialViscosity2D.cpp
[ 85%] Checking style of src/pde/AdvectionDiffusion/AdvectiveFlux3D.cpp
[ 85%] Checking style of src/pde/AdvectionDiffusion/AdvectionDiffusionArtificialViscosity2D.cpp
[ 85%] Checking style of src/pde/AdvectionDiffusion/ViscousFlux2D.cpp
[ 85%] Checking style of src/pde/AdvectionDiffusion/PDEAdvectionDiffusion2D.cpp
[ 85%] Checking style of src/pde/AdvectionDiffusion/PDEAdvectionDiffusion1D.cpp
[ 85%] Checking style of src/pde/AdvectionDiffusion/BCAdvectionDiffusion2D.cpp
[ 85%] Checking style of src/pde/AdvectionDiffusion/AdvectionDiffusionArtificialViscosity1D.cpp
[ 85%] Checking style of src/pde/AdvectionDiffusion/ViscousFlux3D.cpp
[ 85%] Built target AdvectionDiffusionLib_vera
Scanning dependencies of target AdvectionDiffusionLib
[ 85%] Building CXX object src/pde/AdvectionDiffusion/CMakeFiles/AdvectionDiffusionLib.dir/AdvectiveFlux1D.cpp.o
[ 85%] Building CXX object src/pde/AdvectionDiffusion/CMakeFiles/AdvectionDiffusionLib.dir/ViscousFlux1D.cpp.o
[ 85%] Building CXX object src/pde/AdvectionDiffusion/CMakeFiles/AdvectionDiffusionLib.dir/PDEAdvectionDiffusion1D.cpp.o
[ 85%] Building CXX object src/pde/AdvectionDiffusion/CMakeFiles/AdvectionDiffusionLib.dir/BCAdvectionDiffusion1D.cpp.o
[ 85%] Building CXX object src/pde/AdvectionDiffusion/CMakeFiles/AdvectionDiffusionLib.dir/AdvectiveFlux2D.cpp.o
[ 85%] Building CXX object src/pde/AdvectionDiffusion/CMakeFiles/AdvectionDiffusionLib.dir/ViscousFlux2D.cpp.o
[ 85%] Building CXX object src/pde/AdvectionDiffusion/CMakeFiles/AdvectionDiffusionLib.dir/PDEAdvectionDiffusion2D.cpp.o
[ 85%] Building CXX object src/pde/AdvectionDiffusion/CMakeFiles/AdvectionDiffusionLib.dir/BCAdvectionDiffusion2D.cpp.o
[ 85%] Building CXX object src/pde/AdvectionDiffusion/CMakeFiles/AdvectionDiffusionLib.dir/AdvectiveFlux3D.cpp.o
[ 85%] Building CXX object src/pde/AdvectionDiffusion/CMakeFiles/AdvectionDiffusionLib.dir/ViscousFlux3D.cpp.o
[ 85%] Building CXX object src/pde/AdvectionDiffusion/CMakeFiles/AdvectionDiffusionLib.dir/PDEAdvectionDiffusion3D.cpp.o
[ 85%] Building CXX object src/pde/AdvectionDiffusion/CMakeFiles/AdvectionDiffusionLib.dir/BCAdvectionDiffusion3D.cpp.o
[ 85%] Building CXX object src/pde/AdvectionDiffusion/CMakeFiles/AdvectionDiffusionLib.dir/BCAdvectionDiffusion_ArtificialViscosity2D.cpp.o
[ 85%] Building CXX object src/pde/AdvectionDiffusion/CMakeFiles/AdvectionDiffusionLib.dir/AdvectionDiffusionArtificialViscosity1D.cpp.o
[ 85%] Building CXX object src/pde/AdvectionDiffusion/CMakeFiles/AdvectionDiffusionLib.dir/AdvectionDiffusionArtificialViscosity2D.cpp.o
[ 85%] Building CXX object src/pde/AdvectionDiffusion/CMakeFiles/AdvectionDiffusionLib.dir/AdvectionDiffusionArtificialViscosity3D.cpp.o
[ 85%] Linking CXX static library libAdvectionDiffusionLib.a
[ 85%] Built target AdvectionDiffusionLib
Scanning dependencies of target SolverInterface_DGAdvective_btest_OBJECT
[ 85%] Building CXX object test/system/Adaptation/CMakeFiles/SolverInterface_DGAdvective_btest_OBJECT.dir/SolverInterface_DGAdvective_btest.cpp.o
[ 85%] Built target SolverInterface_DGAdvective_btest_OBJECT
Scanning dependencies of target SolverInterface_DGAdvective_btest_build
[ 85%] Linking CXX executable SolverInterface_DGAdvective_btest
[ 85%] Built target SolverInterface_DGAdvective_btest_build
Scanning dependencies of target SolverInterface_Galerkin_Stabilized_btest_build_vera
[ 85%] Checking style of test/system/Adaptation/SolverInterface_Galerkin_Stabilized_btest.cpp
[ 85%] Built target SolverInterface_Galerkin_Stabilized_btest_build_vera
Scanning dependencies of target SolverInterface_Galerkin_Stabilized_btest_OBJECT
[ 85%] Building CXX object test/system/Adaptation/CMakeFiles/SolverInterface_Galerkin_Stabilized_btest_OBJECT.dir/SolverInterface_Galerkin_Stabilized_btest.cpp.o
[ 85%] Built target SolverInterface_Galerkin_Stabilized_btest_OBJECT
Scanning dependencies of target SolverInterface_Galerkin_Stabilized_btest_build
[ 85%] Linking CXX executable SolverInterface_Galerkin_Stabilized_btest
[ 85%] Built target SolverInterface_Galerkin_Stabilized_btest_build
Scanning dependencies of target SolverInterface_DGBR2_btest_build_vera
[ 85%] Checking style of test/system/Adaptation/SolverInterface_DGBR2_btest.cpp
[ 85%] Built target SolverInterface_DGBR2_btest_build_vera
Scanning dependencies of target SolverInterface_DGBR2_btest_OBJECT
[ 85%] Building CXX object test/system/Adaptation/CMakeFiles/SolverInterface_DGBR2_btest_OBJECT.dir/SolverInterface_DGBR2_btest.cpp.o
[ 85%] Built target SolverInterface_DGBR2_btest_OBJECT
Scanning dependencies of target SolverInterface_DGBR2_btest_build
[ 85%] Linking CXX executable SolverInterface_DGBR2_btest
[ 85%] Built target SolverInterface_DGBR2_btest_build
Scanning dependencies of target Adjoint2D_HDG_Triangle_AD_mitState_btest_build_vera
[ 85%] Checking style of test/system/Asymptotic/Adjoint2D_HDG_Triangle_AD_mitState_btest.cpp
[ 85%] Built target Adjoint2D_HDG_Triangle_AD_mitState_btest_build_vera
Scanning dependencies of target DGBR2PorusMediaLib
[ 85%] Building CXX object src/Discretization/CMakeFiles/DGBR2PorusMediaLib.dir/DG/DGBR2_Instantiate/AlgebraicEquationSet_DGBR2_BuckleyLeverett1D.cpp.o
[ 85%] Building CXX object src/Discretization/CMakeFiles/DGBR2PorusMediaLib.dir/DG/DGBR2_Instantiate/AlgebraicEquationSet_DGBR2_BuckleyLeverett1D_SurrogateSw.cpp.o
[ 85%] Building CXX object src/Discretization/CMakeFiles/DGBR2PorusMediaLib.dir/DG/DGBR2_Instantiate/AlgebraicEquationSet_DGBR2_BuckleyLeverett_AV1D.cpp.o
[ 85%] Building CXX object src/Discretization/CMakeFiles/DGBR2PorusMediaLib.dir/DG/DGBR2_Instantiate/AlgebraicEquationSet_DGBR2_TwoPhase1D.cpp.o
[ 85%] Building CXX object src/Discretization/CMakeFiles/DGBR2PorusMediaLib.dir/DG/DGBR2_Instantiate/AlgebraicEquationSet_DGBR2_TwoPhase2D.cpp.o
[ 85%] Building CXX object src/Discretization/CMakeFiles/DGBR2PorusMediaLib.dir/DG/DGBR2_Instantiate/AlgebraicEquationSet_DGBR2_TwoPhase2D_LogpnSw.cpp.o
[ 85%] Building CXX object src/Discretization/CMakeFiles/DGBR2PorusMediaLib.dir/DG/DGBR2_Instantiate/AlgebraicEquationSet_DGBR2_TwoPhase2D_Surrogate_pnSw.cpp.o
[ 85%] Building CXX object src/Discretization/CMakeFiles/DGBR2PorusMediaLib.dir/DG/DGBR2_Instantiate/AlgebraicEquationSet_DGBR2_TwoPhaseLinearized1D.cpp.o
[ 85%] Building CXX object src/Discretization/CMakeFiles/DGBR2PorusMediaLib.dir/DG/DGBR2_Instantiate/AlgebraicEquationSet_DGBR2_Sensor1D_AUSJump_BuckleyLeverett1D.cpp.o
[ 85%] Building CXX object src/Discretization/CMakeFiles/DGBR2PorusMediaLib.dir/DG/DGBR2_Instantiate/AlgebraicEquationSet_DGBR2_ArtificialViscosity_BuckleyLeverett1D.cpp.o
[ 85%] Building CXX object src/Discretization/CMakeFiles/DGBR2PorusMediaLib.dir/DG/DGBR2_Instantiate/AlgebraicEquationSet_DGBR2_ArtificialViscosity_TwoPhase1D.cpp.o
[ 85%] Building CXX object src/Discretization/CMakeFiles/DGBR2PorusMediaLib.dir/DG/DGBR2_Instantiate/AlgebraicEquationSet_DGBR2_ArtificialViscosity_TwoPhase2D.cpp.o
[ 85%] Linking CXX static library libDGBR2PorusMediaLib.a
[ 85%] Built target DGBR2PorusMediaLib
Scanning dependencies of target DGBR2RANSSALib
[ 85%] Building CXX object src/Discretization/CMakeFiles/DGBR2RANSSALib.dir/DG/DGBR2_Instantiate/AlgebraicEquationSet_DGBR2_RANSSA2D_PrimitiveConstVisc.cpp.o
[ 85%] Building CXX object src/Discretization/CMakeFiles/DGBR2RANSSALib.dir/DG/DGBR2_Instantiate/AlgebraicEquationSet_DGBR2_RANSSA_Source2D_PrimitiveConstVisc.cpp.o
[ 85%] Building CXX object src/Discretization/CMakeFiles/DGBR2RANSSALib.dir/DG/DGBR2_Instantiate/AlgebraicEquationSet_DGBR2_RANSSA_Source3D_PrimitiveConstVisc.cpp.o
[ 85%] Building CXX object src/Discretization/CMakeFiles/DGBR2RANSSALib.dir/DG/DGBR2_Instantiate/AlgebraicEquationSet_DGBR2_RANSSA2D_PrimitiveSutherland.cpp.o
[ 85%] Building CXX object src/Discretization/CMakeFiles/DGBR2RANSSALib.dir/DG/DGBR2_Instantiate/AlgebraicEquationSet_DGBR2_RANSSA3D_PrimitiveConstVisc.cpp.o
[ 85%] Building CXX object src/Discretization/CMakeFiles/DGBR2RANSSALib.dir/DG/DGBR2_Instantiate/AlgebraicEquationSet_DGBR2_RANSSA3D_PrimitiveSutherland.cpp.o
[ 85%] Building CXX object src/Discretization/CMakeFiles/DGBR2RANSSALib.dir/DG/DGBR2_Instantiate/AlgebraicEquationSet_DGBR2_RANSSA3D_SurrogateSutherland.cpp.o
[ 85%] Building CXX object src/Discretization/CMakeFiles/DGBR2RANSSALib.dir/DG/DGBR2_Instantiate/AlgebraicEquationSet_DGBR2_ArtificialViscosity_RANSSA3D_PrimitiveSutherland.cpp.o
[ 85%] Linking CXX static library libDGBR2RANSSALib.a
[ 85%] Built target DGBR2RANSSALib
Scanning dependencies of target DGBR2BurgersLib
[ 85%] Building CXX object src/Discretization/CMakeFiles/DGBR2BurgersLib.dir/DG/DGBR2_Instantiate/AlgebraicEquationSet_DGBR2_Burgers1D_Conservative_DUSU.cpp.o
[ 85%] Building CXX object src/Discretization/CMakeFiles/DGBR2BurgersLib.dir/DG/DGBR2_Instantiate/AlgebraicEquationSet_DGBR2_Burgers1D_Conservative_DUSN.cpp.o
[ 85%] Building CXX object src/Discretization/CMakeFiles/DGBR2BurgersLib.dir/DG/DGBR2_Instantiate/AlgebraicEquationSet_DGBR2_Burgers2D_Conservative_DUSN.cpp.o
[ 85%] Building CXX object src/Discretization/CMakeFiles/DGBR2BurgersLib.dir/DG/DGBR2_Instantiate/AlgebraicEquationSet_DGBR2_Burgers_AV1D_DUSUG.cpp.o
[ 85%] Linking CXX static library libDGBR2BurgersLib.a
[ 85%] Built target DGBR2BurgersLib
Scanning dependencies of target BurgersLib_vera
[ 85%] Checking style of src/pde/Burgers/BCBurgers1D.h
[ 85%] Checking style of src/pde/Burgers/Burgers_ArtificialViscosity_fwd.h
[ 85%] Checking style of src/pde/Burgers/BCBurgers2D.h
[ 85%] Checking style of src/pde/Burgers/BCmitAVSensorBurgers1D.h
[ 85%] Checking style of src/pde/Burgers/PDEBurgers2D.h
[ 85%] Checking style of src/pde/Burgers/PDEBurgers_fwd.h
[ 85%] Checking style of src/pde/Burgers/PDEBurgers_ArtificialViscosity1D.h
[ 85%] Checking style of src/pde/Burgers/BCmitAVSensorBurgers2D.h
[ 85%] Checking style of src/pde/Burgers/BurgersConservative2D.h
[ 85%] Checking style of src/pde/Burgers/PDEBurgers_ArtificialViscosity2D.h
[ 85%] Checking style of src/pde/Burgers/PDEBurgers1D.h
[ 88%] Checking style of src/pde/Burgers/BurgersConservative1D.h
[ 88%] Checking style of src/pde/Burgers/PDEBurgers2D.cpp
[ 88%] Checking style of src/pde/Burgers/BCBurgers2D.cpp
[ 88%] Checking style of src/pde/Burgers/BCmitAVSensorBurgers1D.cpp
[ 88%] Checking style of src/pde/Burgers/BurgersConservative1D.cpp
[ 88%] Checking style of src/pde/Burgers/BurgersConservative2D.cpp
[ 88%] Checking style of src/pde/Burgers/BCmitAVSensorBurgers2D.cpp
[ 88%] Checking style of src/pde/Burgers/BCBurgers1D.cpp
[ 88%] Checking style of src/pde/Burgers/PDEBurgers1D.cpp
[ 88%] Built target BurgersLib_vera
Scanning dependencies of target BurgersLib
[ 88%] Building CXX object src/pde/Burgers/CMakeFiles/BurgersLib.dir/BCBurgers1D.cpp.o
[ 88%] Building CXX object src/pde/Burgers/CMakeFiles/BurgersLib.dir/BCBurgers2D.cpp.o
[ 88%] Building CXX object src/pde/Burgers/CMakeFiles/BurgersLib.dir/PDEBurgers1D.cpp.o
[ 88%] Building CXX object src/pde/Burgers/CMakeFiles/BurgersLib.dir/PDEBurgers2D.cpp.o
[ 88%] Building CXX object src/pde/Burgers/CMakeFiles/BurgersLib.dir/BCmitAVSensorBurgers1D.cpp.o
[ 88%] Building CXX object src/pde/Burgers/CMakeFiles/BurgersLib.dir/BCmitAVSensorBurgers2D.cpp.o
[ 88%] Building CXX object src/pde/Burgers/CMakeFiles/BurgersLib.dir/BurgersConservative1D.cpp.o
[ 88%] Building CXX object src/pde/Burgers/CMakeFiles/BurgersLib.dir/BurgersConservative2D.cpp.o
[ 88%] Linking CXX static library libBurgersLib.a
[ 88%] Built target BurgersLib
Scanning dependencies of target PorousMediaLib_vera
[ 88%] Checking style of src/pde/PorousMedia/SolutionFunction_BuckleyLeverett1D.h
[ 88%] Checking style of src/pde/PorousMedia/TraitsBuckleyLeverett.h
[ 88%] Checking style of src/pde/PorousMedia/Q1DPrimitive_pnSw.h
[ 88%] Checking style of src/pde/PorousMedia/Q1DPrimitive_Surrogate_pnSw.h
[ 88%] Checking style of src/pde/PorousMedia/Q2DPrimitive_pnSw.h
[ 88%] Checking style of src/pde/PorousMedia/BCTwoPhaseLinearized1D.h
[ 88%] Checking style of src/pde/PorousMedia/Sensor_TwoPhase.h
[ 88%] Checking style of src/pde/PorousMedia/PDEBuckleyLeverett_ArtificialViscosity1D.h
[ 88%] Checking style of src/pde/PorousMedia/TraitsTwoPhaseArtificialViscosity.h
[ 88%] Checking style of src/pde/PorousMedia/PermeabilityModel2D.h
[ 88%] Checking style of src/pde/PorousMedia/TraitsBuckleyLeverettArtificialViscosity.h
[ 88%] Checking style of src/pde/PorousMedia/PDETwoPhase1D.h
[ 88%] Checking style of src/pde/PorousMedia/OutputTwoPhase.h
[ 88%] Checking style of src/pde/PorousMedia/ViscosityModel_Constant.h
[ 88%] Checking style of src/pde/PorousMedia/PDETwoPhase2D.h
[ 88%] Checking style of src/pde/PorousMedia/BCTwoPhaseArtificialViscosity2D.h
[ 88%] Checking style of src/pde/PorousMedia/Q1DPrimitive_Sw.h
[ 88%] Checking style of src/pde/PorousMedia/SolutionFunction_TwoPhase1D.h
[ 88%] Checking style of src/pde/PorousMedia/Q2DPrimitive_LogpnSw.h
[ 88%] Checking style of src/pde/PorousMedia/BCTwoPhase2D.h
[ 88%] Checking style of src/pde/PorousMedia/BCBuckleyLeverett_ArtificialViscosity1D.h
[ 88%] Checking style of src/pde/PorousMedia/PDEBuckleyLeverett1D.h
[ 88%] Checking style of src/pde/PorousMedia/BCTwoPhase1D.h
[ 88%] Checking style of src/pde/PorousMedia/PorosityModel.h
[ 88%] Checking style of src/pde/PorousMedia/SourceTwoPhase2D.h
[ 88%] Checking style of src/pde/PorousMedia/Q1DPrimitive_SurrogateSw.h
[ 88%] Checking style of src/pde/PorousMedia/RelPermModel_PowerLaw.h
[ 88%] Checking style of src/pde/PorousMedia/CapillaryModel.h
[ 88%] Checking style of src/pde/PorousMedia/CartTable.h
[ 88%] Checking style of src/pde/PorousMedia/BCTwoPhaseArtificialViscosity1D.h
[ 88%] Checking style of src/pde/PorousMedia/Q2DPrimitive_Surrogate_pnSw.h
[ 88%] Checking style of src/pde/PorousMedia/SolutionFunction_TwoPhase2D.h
[ 88%] Checking style of src/pde/PorousMedia/Sensor_BuckleyLeverett.h
[ 88%] Checking style of src/pde/PorousMedia/TraitsTwoPhase.h
[ 88%] Checking style of src/pde/PorousMedia/BCBuckleyLeverett1D.h
[ 88%] Checking style of src/pde/PorousMedia/DensityModel.h
[ 88%] Checking style of src/pde/PorousMedia/PDETwoPhase_ArtificialViscosity1D.h
[ 88%] Checking style of src/pde/PorousMedia/PDETwoPhase_ArtificialViscosity2D.h
[ 88%] Checking style of src/pde/PorousMedia/TwoPhaseVariable.h
[ 88%] Checking style of src/pde/PorousMedia/PDETwoPhaseLinearized1D.h
[ 88%] Checking style of src/pde/PorousMedia/SourceTwoPhase1D.h
[ 88%] Checking style of src/pde/PorousMedia/BCTwoPhase2D.cpp
[ 88%] Checking style of src/pde/PorousMedia/PermeabilityModel2D.cpp
[ 88%] Checking style of src/pde/PorousMedia/Q1DPrimitive_SurrogateSw.cpp
[ 88%] Checking style of src/pde/PorousMedia/BCTwoPhaseArtificialViscosity1D.cpp
[ 88%] Checking style of src/pde/PorousMedia/TwoPhaseVariable.cpp
[ 88%] Checking style of src/pde/PorousMedia/Q2DPrimitive_pnSw.cpp
[ 88%] Checking style of src/pde/PorousMedia/SolutionFunction_TwoPhase2D.cpp
[ 88%] Checking style of src/pde/PorousMedia/DensityModel.cpp
[ 88%] Checking style of src/pde/PorousMedia/SolutionFunction_TwoPhase1D.cpp
[ 88%] Checking style of src/pde/PorousMedia/BCBuckleyLeverett1D.cpp
[ 88%] Checking style of src/pde/PorousMedia/Q2DPrimitive_LogpnSw.cpp
[ 88%] Checking style of src/pde/PorousMedia/BCTwoPhaseLinearized1D.cpp
[ 88%] Checking style of src/pde/PorousMedia/BCTwoPhase1D.cpp
[ 88%] Checking style of src/pde/PorousMedia/BCBuckleyLeverett_ArtificialViscosity1D.cpp
[ 88%] Checking style of src/pde/PorousMedia/PorosityModel.cpp
[ 88%] Checking style of src/pde/PorousMedia/CartTable.cpp
[ 88%] Checking style of src/pde/PorousMedia/SourceTwoPhase1D.cpp
[ 88%] Checking style of src/pde/PorousMedia/SourceTwoPhase2D.cpp
[ 88%] Checking style of src/pde/PorousMedia/ViscosityModel_Constant.cpp
[ 88%] Checking style of src/pde/PorousMedia/Q1DPrimitive_Surrogate_pnSw.cpp
[ 88%] Checking style of src/pde/PorousMedia/Q1DPrimitive_pnSw.cpp
[ 88%] Checking style of src/pde/PorousMedia/Q1DPrimitive_Sw.cpp
[ 88%] Checking style of src/pde/PorousMedia/CapillaryModel.cpp
[ 88%] Checking style of src/pde/PorousMedia/Q2DPrimitive_Surrogate_pnSw.cpp
[ 88%] Checking style of src/pde/PorousMedia/BCTwoPhaseArtificialViscosity2D.cpp
[ 88%] Checking style of src/pde/PorousMedia/RelPermModel_PowerLaw.cpp
[ 88%] Built target PorousMediaLib_vera
Scanning dependencies of target PorousMediaLib
[ 88%] Building CXX object src/pde/PorousMedia/CMakeFiles/PorousMediaLib.dir/Q1DPrimitive_Sw.cpp.o
[ 88%] Building CXX object src/pde/PorousMedia/CMakeFiles/PorousMediaLib.dir/Q1DPrimitive_SurrogateSw.cpp.o
[ 88%] Building CXX object src/pde/PorousMedia/CMakeFiles/PorousMediaLib.dir/Q1DPrimitive_pnSw.cpp.o
[ 88%] Building CXX object src/pde/PorousMedia/CMakeFiles/PorousMediaLib.dir/Q2DPrimitive_pnSw.cpp.o
[ 88%] Building CXX object src/pde/PorousMedia/CMakeFiles/PorousMediaLib.dir/Q1DPrimitive_Surrogate_pnSw.cpp.o
[ 88%] Building CXX object src/pde/PorousMedia/CMakeFiles/PorousMediaLib.dir/Q2DPrimitive_Surrogate_pnSw.cpp.o
[ 91%] Building CXX object src/pde/PorousMedia/CMakeFiles/PorousMediaLib.dir/TwoPhaseVariable.cpp.o
[ 91%] Building CXX object src/pde/PorousMedia/CMakeFiles/PorousMediaLib.dir/RelPermModel_PowerLaw.cpp.o
[ 91%] Building CXX object src/pde/PorousMedia/CMakeFiles/PorousMediaLib.dir/ViscosityModel_Constant.cpp.o
[ 91%] Building CXX object src/pde/PorousMedia/CMakeFiles/PorousMediaLib.dir/DensityModel.cpp.o
[ 91%] Building CXX object src/pde/PorousMedia/CMakeFiles/PorousMediaLib.dir/PorosityModel.cpp.o
[ 91%] Building CXX object src/pde/PorousMedia/CMakeFiles/PorousMediaLib.dir/CapillaryModel.cpp.o
[ 91%] Building CXX object src/pde/PorousMedia/CMakeFiles/PorousMediaLib.dir/PermeabilityModel2D.cpp.o
[ 91%] Building CXX object src/pde/PorousMedia/CMakeFiles/PorousMediaLib.dir/BCBuckleyLeverett1D.cpp.o
[ 91%] Building CXX object src/pde/PorousMedia/CMakeFiles/PorousMediaLib.dir/BCBuckleyLeverett_ArtificialViscosity1D.cpp.o
[ 91%] Building CXX object src/pde/PorousMedia/CMakeFiles/PorousMediaLib.dir/BCTwoPhase1D.cpp.o
[ 91%] Building CXX object src/pde/PorousMedia/CMakeFiles/PorousMediaLib.dir/BCTwoPhase2D.cpp.o
[ 91%] Building CXX object src/pde/PorousMedia/CMakeFiles/PorousMediaLib.dir/BCTwoPhaseArtificialViscosity1D.cpp.o
[ 91%] Building CXX object src/pde/PorousMedia/CMakeFiles/PorousMediaLib.dir/BCTwoPhaseArtificialViscosity2D.cpp.o
[ 91%] Building CXX object src/pde/PorousMedia/CMakeFiles/PorousMediaLib.dir/BCTwoPhaseLinearized1D.cpp.o
[ 91%] Building CXX object src/pde/PorousMedia/CMakeFiles/PorousMediaLib.dir/SourceTwoPhase1D.cpp.o
[ 91%] Building CXX object src/pde/PorousMedia/CMakeFiles/PorousMediaLib.dir/SourceTwoPhase2D.cpp.o
[ 91%] Building CXX object src/pde/PorousMedia/CMakeFiles/PorousMediaLib.dir/SolutionFunction_TwoPhase1D.cpp.o
[ 91%] Building CXX object src/pde/PorousMedia/CMakeFiles/PorousMediaLib.dir/SolutionFunction_TwoPhase2D.cpp.o
[ 91%] Building CXX object src/pde/PorousMedia/CMakeFiles/PorousMediaLib.dir/CartTable.cpp.o
[ 91%] Linking CXX static library libPorousMediaLib.a
[ 91%] Built target PorousMediaLib
Scanning dependencies of target ShallowWaterLib_vera
[ 91%] Checking style of src/pde/ShallowWater/BCShallowWater1D.h
[ 91%] Checking style of src/pde/ShallowWater/ShallowWaterSolution1D.h
[ 91%] Checking style of src/pde/ShallowWater/VarInterp2D_manifold.h
[ 91%] Checking style of src/pde/ShallowWater/ShallowWater_Traits.h
[ 91%] Checking style of src/pde/ShallowWater/ShallowWater_Traits_manifold.h
[ 91%] Checking style of src/pde/ShallowWater/ShallowWaterSolution2D.h
[ 91%] Checking style of src/pde/ShallowWater/BCShallowWater2D.h
[ 91%] Checking style of src/pde/ShallowWater/PDEShallowWater2D.h
[ 91%] Checking style of src/pde/ShallowWater/ShallowWaterVariable2D.h
[ 91%] Checking style of src/pde/ShallowWater/ShallowWaterVariable1D.h
[ 91%] Checking style of src/pde/ShallowWater/ShallowWaterSolution2D_manifold.h
[ 91%] Checking style of src/pde/ShallowWater/OutputShallowWater2D_manifold.h
[ 91%] Checking style of src/pde/ShallowWater/PDEShallowWater2D_manifold.h
[ 91%] Checking style of src/pde/ShallowWater/OutputShallowWater2D.h
[ 91%] Checking style of src/pde/ShallowWater/VarInterp1D.h
[ 91%] Checking style of src/pde/ShallowWater/BCShallowWater2D_manifold.h
[ 91%] Checking style of src/pde/ShallowWater/ShallowWaterVariable2D_manifold.h
[ 91%] Checking style of src/pde/ShallowWater/OutputShallowWater1D.h
[ 91%] Checking style of src/pde/ShallowWater/VarInterp2D.h
[ 91%] Checking style of src/pde/ShallowWater/PDEShallowWater1D.h
[ 91%] Checking style of src/pde/ShallowWater/ShallowWaterSolution2D_manifold.cpp
[ 91%] Checking style of src/pde/ShallowWater/PDEShallowWater2D_manifold.cpp
[ 91%] Checking style of src/pde/ShallowWater/BCShallowWater2D_manifold.cpp
[ 91%] Checking style of src/pde/ShallowWater/ShallowWaterSolution1D.cpp
[ 91%] Checking style of src/pde/ShallowWater/BCShallowWater2D.cpp
[ 91%] Checking style of src/pde/ShallowWater/PDEShallowWater1D.cpp
[ 91%] Checking style of src/pde/ShallowWater/BCShallowWater1D.cpp
[ 91%] Checking style of src/pde/ShallowWater/ShallowWaterSolution2D.cpp
[ 91%] Checking style of src/pde/ShallowWater/PDEShallowWater2D.cpp
[ 91%] Built target ShallowWaterLib_vera
Scanning dependencies of target ShallowWaterLib
[ 91%] Building CXX object src/pde/ShallowWater/CMakeFiles/ShallowWaterLib.dir/PDEShallowWater1D.cpp.o
[ 91%] Building CXX object src/pde/ShallowWater/CMakeFiles/ShallowWaterLib.dir/ShallowWaterSolution1D.cpp.o
[ 91%] Building CXX object src/pde/ShallowWater/CMakeFiles/ShallowWaterLib.dir/BCShallowWater1D.cpp.o
[ 91%] Building CXX object src/pde/ShallowWater/CMakeFiles/ShallowWaterLib.dir/PDEShallowWater2D.cpp.o
[ 91%] Building CXX object src/pde/ShallowWater/CMakeFiles/ShallowWaterLib.dir/ShallowWaterSolution2D.cpp.o
[ 91%] Building CXX object src/pde/ShallowWater/CMakeFiles/ShallowWaterLib.dir/BCShallowWater2D.cpp.o
[ 91%] Building CXX object src/pde/ShallowWater/CMakeFiles/ShallowWaterLib.dir/PDEShallowWater2D_manifold.cpp.o
[ 91%] Building CXX object src/pde/ShallowWater/CMakeFiles/ShallowWaterLib.dir/ShallowWaterSolution2D_manifold.cpp.o
[ 91%] Building CXX object src/pde/ShallowWater/CMakeFiles/ShallowWaterLib.dir/BCShallowWater2D_manifold.cpp.o
[ 91%] Linking CXX static library libShallowWaterLib.a
[ 91%] Built target ShallowWaterLib
Scanning dependencies of target Adjoint2D_HDG_Triangle_AD_mitState_btest_OBJECT
[ 91%] Building CXX object test/system/Asymptotic/CMakeFiles/Adjoint2D_HDG_Triangle_AD_mitState_btest_OBJECT.dir/Adjoint2D_HDG_Triangle_AD_mitState_btest.cpp.o
[ 91%] Built target Adjoint2D_HDG_Triangle_AD_mitState_btest_OBJECT
Scanning dependencies of target Adjoint2D_HDG_Triangle_AD_mitState_btest_build
[ 91%] Linking CXX executable Adjoint2D_HDG_Triangle_AD_mitState_btest
[ 91%] Built target Adjoint2D_HDG_Triangle_AD_mitState_btest_build
Scanning dependencies of target ErrorOrder_2D_CGStabilized_RANS_MMS_btest_OBJECT
[ 91%] Building CXX object test/system/Asymptotic/CMakeFiles/ErrorOrder_2D_CGStabilized_RANS_MMS_btest_OBJECT.dir/ErrorOrder_2D_CGStabilized_RANS_MMS_btest.cpp.o
[ 91%] Built target ErrorOrder_2D_CGStabilized_RANS_MMS_btest_OBJECT
Scanning dependencies of target ErrorOrder_2D_CGStabilized_RANS_MMS_btest_build_vera
[ 91%] Checking style of test/system/Asymptotic/ErrorOrder_2D_CGStabilized_RANS_MMS_btest.cpp
[ 91%] Built target ErrorOrder_2D_CGStabilized_RANS_MMS_btest_build_vera
Scanning dependencies of target ErrorOrder_2D_CGStabilized_RANS_MMS_btest_build
[ 91%] Linking CXX executable ErrorOrder_2D_CGStabilized_RANS_MMS_btest
[ 91%] Built target ErrorOrder_2D_CGStabilized_RANS_MMS_btest_build
Scanning dependencies of target ErrorOrder_2D_DGAdvective_Annulus_Quad_btest_OBJECT
[ 91%] Building CXX object test/system/Asymptotic/CMakeFiles/ErrorOrder_2D_DGAdvective_Annulus_Quad_btest_OBJECT.dir/ErrorOrder_2D_DGAdvective_Annulus_Quad_btest.cpp.o
[ 91%] Built target ErrorOrder_2D_DGAdvective_Annulus_Quad_btest_OBJECT
Scanning dependencies of target ErrorOrder_2D_DGAdvective_Annulus_Quad_btest_build_vera
[ 91%] Checking style of test/system/Asymptotic/ErrorOrder_2D_DGAdvective_Annulus_Quad_btest.cpp
[ 91%] Built target ErrorOrder_2D_DGAdvective_Annulus_Quad_btest_build_vera
Scanning dependencies of target ErrorOrder_2D_DGAdvective_Annulus_Quad_btest_build
[ 91%] Linking CXX executable ErrorOrder_2D_DGAdvective_Annulus_Quad_btest
[ 91%] Built target ErrorOrder_2D_DGAdvective_Annulus_Quad_btest_build
Scanning dependencies of target ErrorOrder_1D_DGBR2_AD_HB_btest_build_vera
[ 91%] Checking style of test/system/Asymptotic/ErrorOrder_1D_DGBR2_AD_HB_btest.cpp
[ 91%] Built target ErrorOrder_1D_DGBR2_AD_HB_btest_build_vera
Scanning dependencies of target ErrorOrder_1D_DGBR2_AD_HB_btest_OBJECT
[ 91%] Building CXX object test/system/Asymptotic/CMakeFiles/ErrorOrder_1D_DGBR2_AD_HB_btest_OBJECT.dir/ErrorOrder_1D_DGBR2_AD_HB_btest.cpp.o
[ 91%] Built target ErrorOrder_1D_DGBR2_AD_HB_btest_OBJECT
Scanning dependencies of target ErrorOrder_1D_DGBR2_AD_HB_btest_build
[ 91%] Linking CXX executable ErrorOrder_1D_DGBR2_AD_HB_btest
[ 91%] Built target ErrorOrder_1D_DGBR2_AD_HB_btest_build
Scanning dependencies of target ErrorOrder_3D_DGBR2_Periodic_Hex_AD_btest_build_vera
[ 91%] Checking style of test/system/Asymptotic/ErrorOrder_3D_DGBR2_Periodic_Hex_AD_btest.cpp
[ 91%] Built target ErrorOrder_3D_DGBR2_Periodic_Hex_AD_btest_build_vera
Scanning dependencies of target ErrorOrder_3D_DGBR2_Periodic_Hex_AD_btest_OBJECT
[ 91%] Building CXX object test/system/Asymptotic/CMakeFiles/ErrorOrder_3D_DGBR2_Periodic_Hex_AD_btest_OBJECT.dir/ErrorOrder_3D_DGBR2_Periodic_Hex_AD_btest.cpp.o
[ 91%] Built target ErrorOrder_3D_DGBR2_Periodic_Hex_AD_btest_OBJECT
Scanning dependencies of target ErrorOrder_3D_DGBR2_Periodic_Hex_AD_btest_build
[ 91%] Linking CXX executable ErrorOrder_3D_DGBR2_Periodic_Hex_AD_btest
[ 91%] Built target ErrorOrder_3D_DGBR2_Periodic_Hex_AD_btest_build
Scanning dependencies of target Adjoint2D_DGBR2_Triangle_AD_btest_build_vera
[ 91%] Checking style of test/system/Asymptotic/Adjoint2D_DGBR2_Triangle_AD_btest.cpp
[ 91%] Built target Adjoint2D_DGBR2_Triangle_AD_btest_build_vera
Scanning dependencies of target Adjoint2D_DGBR2_Triangle_AD_btest_OBJECT
[ 91%] Building CXX object test/system/Asymptotic/CMakeFiles/Adjoint2D_DGBR2_Triangle_AD_btest_OBJECT.dir/Adjoint2D_DGBR2_Triangle_AD_btest.cpp.o
[ 91%] Built target Adjoint2D_DGBR2_Triangle_AD_btest_OBJECT
Scanning dependencies of target Adjoint2D_DGBR2_Triangle_AD_btest_build
[ 91%] Linking CXX executable Adjoint2D_DGBR2_Triangle_AD_btest
[ 91%] Built target Adjoint2D_DGBR2_Triangle_AD_btest_build
Scanning dependencies of target ErrorEstimateOrder_3D_CG_Tet_AD_btest_build_vera
[ 91%] Checking style of test/system/Asymptotic/ErrorEstimateOrder_3D_CG_Tet_AD_btest.cpp
[ 91%] Built target ErrorEstimateOrder_3D_CG_Tet_AD_btest_build_vera
Scanning dependencies of target ErrorEstimateOrder_3D_CG_Tet_AD_btest_OBJECT
[ 91%] Building CXX object test/system/Asymptotic/CMakeFiles/ErrorEstimateOrder_3D_CG_Tet_AD_btest_OBJECT.dir/ErrorEstimateOrder_3D_CG_Tet_AD_btest.cpp.o
[ 91%] Built target ErrorEstimateOrder_3D_CG_Tet_AD_btest_OBJECT
Scanning dependencies of target ErrorEstimateOrder_3D_CG_Tet_AD_btest_build
[ 91%] Linking CXX executable ErrorEstimateOrder_3D_CG_Tet_AD_btest
[ 91%] Built target ErrorEstimateOrder_3D_CG_Tet_AD_btest_build
Scanning dependencies of target ErrorOrder_1D_CG_AD_btest_build_vera
[ 91%] Checking style of test/system/Asymptotic/ErrorOrder_1D_CG_AD_btest.cpp
[ 91%] Built target ErrorOrder_1D_CG_AD_btest_build_vera
Scanning dependencies of target ErrorOrder_1D_CG_AD_btest_OBJECT
[ 91%] Building CXX object test/system/Asymptotic/CMakeFiles/ErrorOrder_1D_CG_AD_btest_OBJECT.dir/ErrorOrder_1D_CG_AD_btest.cpp.o
[ 91%] Built target ErrorOrder_1D_CG_AD_btest_OBJECT
Scanning dependencies of target ErrorOrder_1D_CG_AD_btest_build
[ 91%] Linking CXX executable ErrorOrder_1D_CG_AD_btest
[ 91%] Built target ErrorOrder_1D_CG_AD_btest_build
Scanning dependencies of target Adjoint2D_CG_Triangle_AD_btest_build_vera
[ 91%] Checking style of test/system/Asymptotic/Adjoint2D_CG_Triangle_AD_btest.cpp
[ 91%] Built target Adjoint2D_CG_Triangle_AD_btest_build_vera
Scanning dependencies of target Adjoint2D_CG_Triangle_AD_btest_OBJECT
[ 91%] Building CXX object test/system/Asymptotic/CMakeFiles/Adjoint2D_CG_Triangle_AD_btest_OBJECT.dir/Adjoint2D_CG_Triangle_AD_btest.cpp.o
[ 91%] Built target Adjoint2D_CG_Triangle_AD_btest_OBJECT
Scanning dependencies of target Adjoint2D_CG_Triangle_AD_btest_build
[ 91%] Linking CXX executable Adjoint2D_CG_Triangle_AD_btest
[ 91%] Built target Adjoint2D_CG_Triangle_AD_btest_build
Scanning dependencies of target ErrorOrder_2D_DGBR2_Triangle_AD_btest_OBJECT
[ 91%] Building CXX object test/system/Asymptotic/CMakeFiles/ErrorOrder_2D_DGBR2_Triangle_AD_btest_OBJECT.dir/ErrorOrder_2D_DGBR2_Triangle_AD_btest.cpp.o
[ 91%] Built target ErrorOrder_2D_DGBR2_Triangle_AD_btest_OBJECT
Scanning dependencies of target ErrorOrder_2D_DGBR2_Triangle_AD_btest_build_vera
[ 91%] Checking style of test/system/Asymptotic/ErrorOrder_2D_DGBR2_Triangle_AD_btest.cpp
[ 91%] Built target ErrorOrder_2D_DGBR2_Triangle_AD_btest_build_vera
Scanning dependencies of target ErrorOrder_2D_DGBR2_Triangle_AD_btest_build
[ 91%] Linking CXX executable ErrorOrder_2D_DGBR2_Triangle_AD_btest
[ 91%] Built target ErrorOrder_2D_DGBR2_Triangle_AD_btest_build
Scanning dependencies of target ErrorOrder_2D_DGBR2_RANS_MMS_btest_OBJECT
[ 91%] Building CXX object test/system/Asymptotic/CMakeFiles/ErrorOrder_2D_DGBR2_RANS_MMS_btest_OBJECT.dir/ErrorOrder_2D_DGBR2_RANS_MMS_btest.cpp.o
[ 91%] Built target ErrorOrder_2D_DGBR2_RANS_MMS_btest_OBJECT
Scanning dependencies of target ErrorOrder_2D_DGBR2_RANS_MMS_btest_build_vera
[ 91%] Checking style of test/system/Asymptotic/ErrorOrder_2D_DGBR2_RANS_MMS_btest.cpp
[ 91%] Built target ErrorOrder_2D_DGBR2_RANS_MMS_btest_build_vera
Scanning dependencies of target ErrorOrder_2D_DGBR2_RANS_MMS_btest_build
[ 91%] Linking CXX executable ErrorOrder_2D_DGBR2_RANS_MMS_btest
[ 91%] Built target ErrorOrder_2D_DGBR2_RANS_MMS_btest_build
Scanning dependencies of target Adjoint2D_HDG_Triangle_AD_sansLG_btest_build_vera
[ 91%] Checking style of test/system/Asymptotic/Adjoint2D_HDG_Triangle_AD_sansLG_btest.cpp
[ 91%] Built target Adjoint2D_HDG_Triangle_AD_sansLG_btest_build_vera
Scanning dependencies of target Adjoint2D_HDG_Triangle_AD_sansLG_btest_OBJECT
[ 91%] Building CXX object test/system/Asymptotic/CMakeFiles/Adjoint2D_HDG_Triangle_AD_sansLG_btest_OBJECT.dir/Adjoint2D_HDG_Triangle_AD_sansLG_btest.cpp.o
[ 91%] Built target Adjoint2D_HDG_Triangle_AD_sansLG_btest_OBJECT
Scanning dependencies of target Adjoint2D_HDG_Triangle_AD_sansLG_btest_build
[ 91%] Linking CXX executable Adjoint2D_HDG_Triangle_AD_sansLG_btest
[ 91%] Built target Adjoint2D_HDG_Triangle_AD_sansLG_btest_build
Scanning dependencies of target ErrorEstimateOrder_2D_DGAdvective_Triangle_AD_btest_OBJECT
[ 91%] Building CXX object test/system/Asymptotic/CMakeFiles/ErrorEstimateOrder_2D_DGAdvective_Triangle_AD_btest_OBJECT.dir/ErrorEstimateOrder_2D_DGAdvective_Triangle_AD_btest.cpp.o
[ 91%] Built target ErrorEstimateOrder_2D_DGAdvective_Triangle_AD_btest_OBJECT
Scanning dependencies of target ErrorEstimateOrder_2D_DGAdvective_Triangle_AD_btest_build_vera
[ 91%] Checking style of test/system/Asymptotic/ErrorEstimateOrder_2D_DGAdvective_Triangle_AD_btest.cpp
[ 91%] Built target ErrorEstimateOrder_2D_DGAdvective_Triangle_AD_btest_build_vera
Scanning dependencies of target ErrorEstimateOrder_2D_DGAdvective_Triangle_AD_btest_build
[ 91%] Linking CXX executable ErrorEstimateOrder_2D_DGAdvective_Triangle_AD_btest
[ 91%] Built target ErrorEstimateOrder_2D_DGAdvective_Triangle_AD_btest_build
Scanning dependencies of target ErrorOrder_3D_DGBR2_Tet_AD_btest_OBJECT
[ 91%] Building CXX object test/system/Asymptotic/CMakeFiles/ErrorOrder_3D_DGBR2_Tet_AD_btest_OBJECT.dir/ErrorOrder_3D_DGBR2_Tet_AD_btest.cpp.o
[ 91%] Built target ErrorOrder_3D_DGBR2_Tet_AD_btest_OBJECT
Scanning dependencies of target ErrorOrder_3D_DGBR2_Tet_AD_btest_build_vera
[ 91%] Checking style of test/system/Asymptotic/ErrorOrder_3D_DGBR2_Tet_AD_btest.cpp
[ 91%] Built target ErrorOrder_3D_DGBR2_Tet_AD_btest_build_vera
Scanning dependencies of target ErrorOrder_3D_DGBR2_Tet_AD_btest_build
[ 91%] Linking CXX executable ErrorOrder_3D_DGBR2_Tet_AD_btest
[ 91%] Built target ErrorOrder_3D_DGBR2_Tet_AD_btest_build
Scanning dependencies of target ErrorOrder_3D_CG_Tet_AD_btest_build_vera
[ 91%] Checking style of test/system/Asymptotic/ErrorOrder_3D_CG_Tet_AD_btest.cpp
[ 91%] Built target ErrorOrder_3D_CG_Tet_AD_btest_build_vera
Scanning dependencies of target ErrorOrder_3D_CG_Tet_AD_btest_OBJECT
[ 91%] Building CXX object test/system/Asymptotic/CMakeFiles/ErrorOrder_3D_CG_Tet_AD_btest_OBJECT.dir/ErrorOrder_3D_CG_Tet_AD_btest.cpp.o
[ 91%] Built target ErrorOrder_3D_CG_Tet_AD_btest_OBJECT
Scanning dependencies of target ErrorOrder_3D_CG_Tet_AD_btest_build
[ 91%] Linking CXX executable ErrorOrder_3D_CG_Tet_AD_btest
[ 91%] Built target ErrorOrder_3D_CG_Tet_AD_btest_build
Scanning dependencies of target ErrorOrder_3D_DGBR2_Sphere_Triangle_AD_btest_build_vera
[ 91%] Checking style of test/system/Asymptotic/ErrorOrder_3D_DGBR2_Sphere_Triangle_AD_btest.cpp
[ 91%] Built target ErrorOrder_3D_DGBR2_Sphere_Triangle_AD_btest_build_vera
Scanning dependencies of target ErrorOrder_3D_DGBR2_Sphere_Triangle_AD_btest_OBJECT
[ 91%] Building CXX object test/system/Asymptotic/CMakeFiles/ErrorOrder_3D_DGBR2_Sphere_Triangle_AD_btest_OBJECT.dir/ErrorOrder_3D_DGBR2_Sphere_Triangle_AD_btest.cpp.o
[ 91%] Built target ErrorOrder_3D_DGBR2_Sphere_Triangle_AD_btest_OBJECT
Scanning dependencies of target ErrorOrder_3D_DGBR2_Sphere_Triangle_AD_btest_build
[ 91%] Linking CXX executable ErrorOrder_3D_DGBR2_Sphere_Triangle_AD_btest
[ 91%] Built target ErrorOrder_3D_DGBR2_Sphere_Triangle_AD_btest_build
Scanning dependencies of target ErrorOrder_1D_DGBR2_Burgers_btest_build_vera
[ 91%] Checking style of test/system/Asymptotic/ErrorOrder_1D_DGBR2_Burgers_btest.cpp
[ 91%] Built target ErrorOrder_1D_DGBR2_Burgers_btest_build_vera
Scanning dependencies of target ErrorOrder_1D_DGBR2_Burgers_btest_OBJECT
[ 91%] Building CXX object test/system/Asymptotic/CMakeFiles/ErrorOrder_1D_DGBR2_Burgers_btest_OBJECT.dir/ErrorOrder_1D_DGBR2_Burgers_btest.cpp.o
[ 91%] Built target ErrorOrder_1D_DGBR2_Burgers_btest_OBJECT
Scanning dependencies of target ErrorOrder_1D_DGBR2_Burgers_btest_build
[ 91%] Linking CXX executable ErrorOrder_1D_DGBR2_Burgers_btest
[ 91%] Built target ErrorOrder_1D_DGBR2_Burgers_btest_build
Scanning dependencies of target Solve2D_DGAdvective_LinearRobin_mitLG_sansLG_Consistency_AD_btest_build_vera
[ 91%] Checking style of test/system/Asymptotic/Solve2D_DGAdvective_LinearRobin_mitLG_sansLG_Consistency_AD_btest.cpp
[ 91%] Built target Solve2D_DGAdvective_LinearRobin_mitLG_sansLG_Consistency_AD_btest_build_vera
Scanning dependencies of target Solve2D_DGAdvective_LinearRobin_mitLG_sansLG_Consistency_AD_btest_OBJECT
[ 91%] Building CXX object test/system/Asymptotic/CMakeFiles/Solve2D_DGAdvective_LinearRobin_mitLG_sansLG_Consistency_AD_btest_OBJECT.dir/Solve2D_DGAdvective_LinearRobin_mitLG_sansLG_Consistency_AD_btest.cpp.o
[ 91%] Built target Solve2D_DGAdvective_LinearRobin_mitLG_sansLG_Consistency_AD_btest_OBJECT
Scanning dependencies of target Solve2D_DGAdvective_LinearRobin_mitLG_sansLG_Consistency_AD_btest_build
[ 91%] Linking CXX executable Solve2D_DGAdvective_LinearRobin_mitLG_sansLG_Consistency_AD_btest
[ 91%] Built target Solve2D_DGAdvective_LinearRobin_mitLG_sansLG_Consistency_AD_btest_build
Scanning dependencies of target Adjoint2D_DGAdvective_Triangle_AD_btest_build_vera
[ 91%] Checking style of test/system/Asymptotic/Adjoint2D_DGAdvective_Triangle_AD_btest.cpp
[ 91%] Built target Adjoint2D_DGAdvective_Triangle_AD_btest_build_vera
Scanning dependencies of target Adjoint2D_DGAdvective_Triangle_AD_btest_OBJECT
[ 91%] Building CXX object test/system/Asymptotic/CMakeFiles/Adjoint2D_DGAdvective_Triangle_AD_btest_OBJECT.dir/Adjoint2D_DGAdvective_Triangle_AD_btest.cpp.o
[ 91%] Built target Adjoint2D_DGAdvective_Triangle_AD_btest_OBJECT
Scanning dependencies of target Adjoint2D_DGAdvective_Triangle_AD_btest_build
[ 91%] Linking CXX executable Adjoint2D_DGAdvective_Triangle_AD_btest
[ 91%] Built target Adjoint2D_DGAdvective_Triangle_AD_btest_build
Scanning dependencies of target ErrorOrder_4D_DG_Pentatope_btest_OBJECT
[ 91%] Building CXX object test/system/Asymptotic/CMakeFiles/ErrorOrder_4D_DG_Pentatope_btest_OBJECT.dir/ErrorOrder_4D_DG_Pentatope_btest.cpp.o
[ 91%] Built target ErrorOrder_4D_DG_Pentatope_btest_OBJECT
Scanning dependencies of target ErrorOrder_4D_DG_Pentatope_btest_build_vera
[ 91%] Checking style of test/system/Asymptotic/ErrorOrder_4D_DG_Pentatope_btest.cpp
[ 91%] Built target ErrorOrder_4D_DG_Pentatope_btest_build_vera
Scanning dependencies of target ErrorOrder_4D_DG_Pentatope_btest_build
[ 91%] Linking CXX executable ErrorOrder_4D_DG_Pentatope_btest
[ 91%] Built target ErrorOrder_4D_DG_Pentatope_btest_build
Scanning dependencies of target ErrorOrder_2D_EDG_Triangle_AD_btest_OBJECT
[ 91%] Building CXX object test/system/Asymptotic/CMakeFiles/ErrorOrder_2D_EDG_Triangle_AD_btest_OBJECT.dir/ErrorOrder_2D_EDG_Triangle_AD_btest.cpp.o
[ 91%] Built target ErrorOrder_2D_EDG_Triangle_AD_btest_OBJECT
Scanning dependencies of target ErrorOrder_2D_EDG_Triangle_AD_btest_build_vera
[ 91%] Checking style of test/system/Asymptotic/ErrorOrder_2D_EDG_Triangle_AD_btest.cpp
[ 91%] Built target ErrorOrder_2D_EDG_Triangle_AD_btest_build_vera
Scanning dependencies of target ErrorOrder_2D_EDG_Triangle_AD_btest_build
[ 91%] Linking CXX executable ErrorOrder_2D_EDG_Triangle_AD_btest
[ 91%] Built target ErrorOrder_2D_EDG_Triangle_AD_btest_build
Scanning dependencies of target ErrorEstimateOrder_1D_CG_Line_AD_btest_OBJECT
[ 91%] Building CXX object test/system/Asymptotic/CMakeFiles/ErrorEstimateOrder_1D_CG_Line_AD_btest_OBJECT.dir/ErrorEstimateOrder_1D_CG_Line_AD_btest.cpp.o
[ 91%] Built target ErrorEstimateOrder_1D_CG_Line_AD_btest_OBJECT
Scanning dependencies of target ErrorEstimateOrder_1D_CG_Line_AD_btest_build_vera
[ 91%] Checking style of test/system/Asymptotic/ErrorEstimateOrder_1D_CG_Line_AD_btest.cpp
[ 91%] Built target ErrorEstimateOrder_1D_CG_Line_AD_btest_build_vera
Scanning dependencies of target ErrorEstimateOrder_1D_CG_Line_AD_btest_build
[ 91%] Linking CXX executable ErrorEstimateOrder_1D_CG_Line_AD_btest
[ 91%] Built target ErrorEstimateOrder_1D_CG_Line_AD_btest_build
Scanning dependencies of target ErrorEstimateOrder_2D_HDG_Triangle_AD_btest_build_vera
[ 91%] Checking style of test/system/Asymptotic/ErrorEstimateOrder_2D_HDG_Triangle_AD_btest.cpp
[ 91%] Built target ErrorEstimateOrder_2D_HDG_Triangle_AD_btest_build_vera
Scanning dependencies of target ErrorEstimateOrder_2D_HDG_Triangle_AD_btest_OBJECT
[ 91%] Building CXX object test/system/Asymptotic/CMakeFiles/ErrorEstimateOrder_2D_HDG_Triangle_AD_btest_OBJECT.dir/ErrorEstimateOrder_2D_HDG_Triangle_AD_btest.cpp.o
[ 91%] Built target ErrorEstimateOrder_2D_HDG_Triangle_AD_btest_OBJECT
Scanning dependencies of target ErrorEstimateOrder_2D_HDG_Triangle_AD_btest_build
[ 91%] Linking CXX executable ErrorEstimateOrder_2D_HDG_Triangle_AD_btest
[ 91%] Built target ErrorEstimateOrder_2D_HDG_Triangle_AD_btest_build
Scanning dependencies of target ErrorOrder_1D_HDG_Burgers_btest_OBJECT
[ 91%] Building CXX object test/system/Asymptotic/CMakeFiles/ErrorOrder_1D_HDG_Burgers_btest_OBJECT.dir/ErrorOrder_1D_HDG_Burgers_btest.cpp.o
[ 91%] Built target ErrorOrder_1D_HDG_Burgers_btest_OBJECT
Scanning dependencies of target ErrorOrder_1D_HDG_Burgers_btest_build_vera
[ 91%] Checking style of test/system/Asymptotic/ErrorOrder_1D_HDG_Burgers_btest.cpp
[ 91%] Built target ErrorOrder_1D_HDG_Burgers_btest_build_vera
Scanning dependencies of target ErrorOrder_1D_HDG_Burgers_btest_build
[ 91%] Linking CXX executable ErrorOrder_1D_HDG_Burgers_btest
[ 91%] Built target ErrorOrder_1D_HDG_Burgers_btest_build
Scanning dependencies of target ErrorOrder_1D_DGBR2_TwoPhase_ST_btest_build_vera
[ 91%] Checking style of test/system/Asymptotic/ErrorOrder_1D_DGBR2_TwoPhase_ST_btest.cpp
[ 91%] Built target ErrorOrder_1D_DGBR2_TwoPhase_ST_btest_build_vera
Scanning dependencies of target ErrorOrder_1D_DGBR2_TwoPhase_ST_btest_OBJECT
[ 91%] Building CXX object test/system/Asymptotic/CMakeFiles/ErrorOrder_1D_DGBR2_TwoPhase_ST_btest_OBJECT.dir/ErrorOrder_1D_DGBR2_TwoPhase_ST_btest.cpp.o
[ 91%] Built target ErrorOrder_1D_DGBR2_TwoPhase_ST_btest_OBJECT
Scanning dependencies of target ErrorOrder_1D_DGBR2_TwoPhase_ST_btest_build
[ 91%] Linking CXX executable ErrorOrder_1D_DGBR2_TwoPhase_ST_btest
[ 91%] Built target ErrorOrder_1D_DGBR2_TwoPhase_ST_btest_build
Scanning dependencies of target Adjoint1D_DGBR2_BuckleyLeverett_ST_btest_build_vera
[ 91%] Checking style of test/system/Asymptotic/Adjoint1D_DGBR2_BuckleyLeverett_ST_btest.cpp
[ 91%] Built target Adjoint1D_DGBR2_BuckleyLeverett_ST_btest_build_vera
Scanning dependencies of target Adjoint1D_DGBR2_BuckleyLeverett_ST_btest_OBJECT
[ 91%] Building CXX object test/system/Asymptotic/CMakeFiles/Adjoint1D_DGBR2_BuckleyLeverett_ST_btest_OBJECT.dir/Adjoint1D_DGBR2_BuckleyLeverett_ST_btest.cpp.o
[ 91%] Built target Adjoint1D_DGBR2_BuckleyLeverett_ST_btest_OBJECT
Scanning dependencies of target Adjoint1D_DGBR2_BuckleyLeverett_ST_btest_build
[ 91%] Linking CXX executable Adjoint1D_DGBR2_BuckleyLeverett_ST_btest
[ 91%] Built target Adjoint1D_DGBR2_BuckleyLeverett_ST_btest_build
Scanning dependencies of target ErrorOrder_3D_CG_Sphere_Triangle_AD_btest_build_vera
[ 91%] Checking style of test/system/Asymptotic/ErrorOrder_3D_CG_Sphere_Triangle_AD_btest.cpp
[ 91%] Built target ErrorOrder_3D_CG_Sphere_Triangle_AD_btest_build_vera
Scanning dependencies of target ErrorOrder_3D_CG_Sphere_Triangle_AD_btest_OBJECT
[ 91%] Building CXX object test/system/Asymptotic/CMakeFiles/ErrorOrder_3D_CG_Sphere_Triangle_AD_btest_OBJECT.dir/ErrorOrder_3D_CG_Sphere_Triangle_AD_btest.cpp.o
[ 91%] Built target ErrorOrder_3D_CG_Sphere_Triangle_AD_btest_OBJECT
Scanning dependencies of target ErrorOrder_3D_CG_Sphere_Triangle_AD_btest_build
[ 91%] Linking CXX executable ErrorOrder_3D_CG_Sphere_Triangle_AD_btest
[ 91%] Built target ErrorOrder_3D_CG_Sphere_Triangle_AD_btest_build
Scanning dependencies of target ErrorOrder_1D_HDG_AD_btest_build_vera
[ 91%] Checking style of test/system/Asymptotic/ErrorOrder_1D_HDG_AD_btest.cpp
[ 91%] Built target ErrorOrder_1D_HDG_AD_btest_build_vera
Scanning dependencies of target ErrorOrder_1D_HDG_AD_btest_OBJECT
[ 91%] Building CXX object test/system/Asymptotic/CMakeFiles/ErrorOrder_1D_HDG_AD_btest_OBJECT.dir/ErrorOrder_1D_HDG_AD_btest.cpp.o
[ 91%] Built target ErrorOrder_1D_HDG_AD_btest_OBJECT
Scanning dependencies of target ErrorOrder_1D_HDG_AD_btest_build
[ 91%] Linking CXX executable ErrorOrder_1D_HDG_AD_btest
[ 91%] Built target ErrorOrder_1D_HDG_AD_btest_build
Scanning dependencies of target ErrorOrder_1D_HDG_AD_BDF_btest_build_vera
[ 91%] Checking style of test/system/Asymptotic/ErrorOrder_1D_HDG_AD_BDF_btest.cpp
[ 91%] Built target ErrorOrder_1D_HDG_AD_BDF_btest_build_vera
Scanning dependencies of target ErrorOrder_1D_HDG_AD_BDF_btest_OBJECT
[ 91%] Building CXX object test/system/Asymptotic/CMakeFiles/ErrorOrder_1D_HDG_AD_BDF_btest_OBJECT.dir/ErrorOrder_1D_HDG_AD_BDF_btest.cpp.o
[ 91%] Built target ErrorOrder_1D_HDG_AD_BDF_btest_OBJECT
Scanning dependencies of target ErrorOrder_1D_HDG_AD_BDF_btest_build
[ 91%] Linking CXX executable ErrorOrder_1D_HDG_AD_BDF_btest
[ 91%] Built target ErrorOrder_1D_HDG_AD_BDF_btest_build
Scanning dependencies of target ErrorOrder_1D_DGBR2_AD_BDF_btest_build_vera
[ 91%] Checking style of test/system/Asymptotic/ErrorOrder_1D_DGBR2_AD_BDF_btest.cpp
[ 91%] Built target ErrorOrder_1D_DGBR2_AD_BDF_btest_build_vera
Scanning dependencies of target ErrorOrder_1D_DGBR2_AD_BDF_btest_OBJECT
[ 91%] Building CXX object test/system/Asymptotic/CMakeFiles/ErrorOrder_1D_DGBR2_AD_BDF_btest_OBJECT.dir/ErrorOrder_1D_DGBR2_AD_BDF_btest.cpp.o
[ 91%] Built target ErrorOrder_1D_DGBR2_AD_BDF_btest_OBJECT
Scanning dependencies of target ErrorOrder_1D_DGBR2_AD_BDF_btest_build
[ 91%] Linking CXX executable ErrorOrder_1D_DGBR2_AD_BDF_btest
[ 91%] Built target ErrorOrder_1D_DGBR2_AD_BDF_btest_build
Scanning dependencies of target ErrorOrder_1D_HDGAdvective_Advection_btest_build_vera
[ 91%] Checking style of test/system/Asymptotic/ErrorOrder_1D_HDGAdvective_Advection_btest.cpp
[ 91%] Built target ErrorOrder_1D_HDGAdvective_Advection_btest_build_vera
Scanning dependencies of target ErrorOrder_1D_HDGAdvective_Advection_btest_OBJECT
[ 91%] Building CXX object test/system/Asymptotic/CMakeFiles/ErrorOrder_1D_HDGAdvective_Advection_btest_OBJECT.dir/ErrorOrder_1D_HDGAdvective_Advection_btest.cpp.o
[ 91%] Built target ErrorOrder_1D_HDGAdvective_Advection_btest_OBJECT
Scanning dependencies of target ErrorOrder_1D_HDGAdvective_Advection_btest_build
[ 91%] Linking CXX executable ErrorOrder_1D_HDGAdvective_Advection_btest
[ 91%] Built target ErrorOrder_1D_HDGAdvective_Advection_btest_build
Scanning dependencies of target ErrorEstimateOrder_2D_CG_Triangle_AD_btest_OBJECT
[ 91%] Building CXX object test/system/Asymptotic/CMakeFiles/ErrorEstimateOrder_2D_CG_Triangle_AD_btest_OBJECT.dir/ErrorEstimateOrder_2D_CG_Triangle_AD_btest.cpp.o
[ 91%] Built target ErrorEstimateOrder_2D_CG_Triangle_AD_btest_OBJECT
Scanning dependencies of target ErrorEstimateOrder_2D_CG_Triangle_AD_btest_build_vera
[ 91%] Checking style of test/system/Asymptotic/ErrorEstimateOrder_2D_CG_Triangle_AD_btest.cpp
[ 91%] Built target ErrorEstimateOrder_2D_CG_Triangle_AD_btest_build_vera
Scanning dependencies of target ErrorEstimateOrder_2D_CG_Triangle_AD_btest_build
[ 91%] Linking CXX executable ErrorEstimateOrder_2D_CG_Triangle_AD_btest
[ 91%] Built target ErrorEstimateOrder_2D_CG_Triangle_AD_btest_build
Scanning dependencies of target ErrorOrder_1D_CG_AD_BDF_btest_OBJECT
[ 91%] Building CXX object test/system/Asymptotic/CMakeFiles/ErrorOrder_1D_CG_AD_BDF_btest_OBJECT.dir/ErrorOrder_1D_CG_AD_BDF_btest.cpp.o
[ 91%] Built target ErrorOrder_1D_CG_AD_BDF_btest_OBJECT
Scanning dependencies of target ErrorOrder_1D_CG_AD_BDF_btest_build_vera
[ 91%] Checking style of test/system/Asymptotic/ErrorOrder_1D_CG_AD_BDF_btest.cpp
[ 91%] Built target ErrorOrder_1D_CG_AD_BDF_btest_build_vera
Scanning dependencies of target ErrorOrder_1D_CG_AD_BDF_btest_build
[ 91%] Linking CXX executable ErrorOrder_1D_CG_AD_BDF_btest
[ 91%] Built target ErrorOrder_1D_CG_AD_BDF_btest_build
Scanning dependencies of target ErrorEstimateOrder_1D_DGBR2_Line_AD_btest_build_vera
[ 91%] Checking style of test/system/Asymptotic/ErrorEstimateOrder_1D_DGBR2_Line_AD_btest.cpp
[ 91%] Built target ErrorEstimateOrder_1D_DGBR2_Line_AD_btest_build_vera
Scanning dependencies of target ErrorEstimateOrder_1D_DGBR2_Line_AD_btest_OBJECT
[ 91%] Building CXX object test/system/Asymptotic/CMakeFiles/ErrorEstimateOrder_1D_DGBR2_Line_AD_btest_OBJECT.dir/ErrorEstimateOrder_1D_DGBR2_Line_AD_btest.cpp.o
[ 91%] Built target ErrorEstimateOrder_1D_DGBR2_Line_AD_btest_OBJECT
Scanning dependencies of target ErrorEstimateOrder_1D_DGBR2_Line_AD_btest_build
[ 91%] Linking CXX executable ErrorEstimateOrder_1D_DGBR2_Line_AD_btest
[ 91%] Built target ErrorEstimateOrder_1D_DGBR2_Line_AD_btest_build
Scanning dependencies of target ErrorOrder_3D_CG_Hex_AD_btest_OBJECT
[ 91%] Building CXX object test/system/Asymptotic/CMakeFiles/ErrorOrder_3D_CG_Hex_AD_btest_OBJECT.dir/ErrorOrder_3D_CG_Hex_AD_btest.cpp.o
[ 91%] Built target ErrorOrder_3D_CG_Hex_AD_btest_OBJECT
Scanning dependencies of target ErrorOrder_3D_CG_Hex_AD_btest_build_vera
[ 91%] Checking style of test/system/Asymptotic/ErrorOrder_3D_CG_Hex_AD_btest.cpp
[ 91%] Built target ErrorOrder_3D_CG_Hex_AD_btest_build_vera
Scanning dependencies of target ErrorOrder_3D_CG_Hex_AD_btest_build
[ 91%] Linking CXX executable ErrorOrder_3D_CG_Hex_AD_btest
[ 91%] Built target ErrorOrder_3D_CG_Hex_AD_btest_build
Scanning dependencies of target ErrorEstimateOrder_2D_CG_Nodal_Triangle_AD_btest_OBJECT
[ 91%] Building CXX object test/system/Asymptotic/CMakeFiles/ErrorEstimateOrder_2D_CG_Nodal_Triangle_AD_btest_OBJECT.dir/ErrorEstimateOrder_2D_CG_Nodal_Triangle_AD_btest.cpp.o
[ 91%] Built target ErrorEstimateOrder_2D_CG_Nodal_Triangle_AD_btest_OBJECT
Scanning dependencies of target ErrorEstimateOrder_2D_CG_Nodal_Triangle_AD_btest_build_vera
[ 91%] Checking style of test/system/Asymptotic/ErrorEstimateOrder_2D_CG_Nodal_Triangle_AD_btest.cpp
[ 91%] Built target ErrorEstimateOrder_2D_CG_Nodal_Triangle_AD_btest_build_vera
Scanning dependencies of target ErrorEstimateOrder_2D_CG_Nodal_Triangle_AD_btest_build
[ 91%] Linking CXX executable ErrorEstimateOrder_2D_CG_Nodal_Triangle_AD_btest
[ 91%] Built target ErrorEstimateOrder_2D_CG_Nodal_Triangle_AD_btest_build
Scanning dependencies of target ErrorOrder_2D_DGAdvective_Flat_Line_AD_btest_OBJECT
[ 91%] Building CXX object test/system/Asymptotic/CMakeFiles/ErrorOrder_2D_DGAdvective_Flat_Line_AD_btest_OBJECT.dir/ErrorOrder_2D_DGAdvective_Flat_Line_AD_btest.cpp.o
[ 91%] Built target ErrorOrder_2D_DGAdvective_Flat_Line_AD_btest_OBJECT
Scanning dependencies of target ErrorOrder_2D_DGAdvective_Flat_Line_AD_btest_build_vera
[ 91%] Checking style of test/system/Asymptotic/ErrorOrder_2D_DGAdvective_Flat_Line_AD_btest.cpp
[ 91%] Built target ErrorOrder_2D_DGAdvective_Flat_Line_AD_btest_build_vera
Scanning dependencies of target ErrorOrder_2D_DGAdvective_Flat_Line_AD_btest_build
[ 91%] Linking CXX executable ErrorOrder_2D_DGAdvective_Flat_Line_AD_btest
[ 91%] Built target ErrorOrder_2D_DGAdvective_Flat_Line_AD_btest_build
Scanning dependencies of target ErrorOrder_1D_DGBR2_AD_btest_OBJECT
[ 91%] Building CXX object test/system/Asymptotic/CMakeFiles/ErrorOrder_1D_DGBR2_AD_btest_OBJECT.dir/ErrorOrder_1D_DGBR2_AD_btest.cpp.o
[ 91%] Built target ErrorOrder_1D_DGBR2_AD_btest_OBJECT
Scanning dependencies of target ErrorOrder_1D_DGBR2_AD_btest_build_vera
[ 91%] Checking style of test/system/Asymptotic/ErrorOrder_1D_DGBR2_AD_btest.cpp
[ 91%] Built target ErrorOrder_1D_DGBR2_AD_btest_build_vera
Scanning dependencies of target ErrorOrder_1D_DGBR2_AD_btest_build
[ 91%] Linking CXX executable ErrorOrder_1D_DGBR2_AD_btest
[ 91%] Built target ErrorOrder_1D_DGBR2_AD_btest_build
Scanning dependencies of target ErrorOrder_2D_HDG_Triangle_AD_btest_build_vera
[ 91%] Checking style of test/system/Asymptotic/ErrorOrder_2D_HDG_Triangle_AD_btest.cpp
[ 91%] Built target ErrorOrder_2D_HDG_Triangle_AD_btest_build_vera
Scanning dependencies of target ErrorOrder_2D_HDG_Triangle_AD_btest_OBJECT
[ 91%] Building CXX object test/system/Asymptotic/CMakeFiles/ErrorOrder_2D_HDG_Triangle_AD_btest_OBJECT.dir/ErrorOrder_2D_HDG_Triangle_AD_btest.cpp.o
[ 91%] Built target ErrorOrder_2D_HDG_Triangle_AD_btest_OBJECT
Scanning dependencies of target ErrorOrder_2D_HDG_Triangle_AD_btest_build
[ 91%] Linking CXX executable ErrorOrder_2D_HDG_Triangle_AD_btest
[ 91%] Built target ErrorOrder_2D_HDG_Triangle_AD_btest_build
Scanning dependencies of target ErrorOrder_2D_DGAdvective_Annulus_Triangle_btest_OBJECT
[ 91%] Building CXX object test/system/Asymptotic/CMakeFiles/ErrorOrder_2D_DGAdvective_Annulus_Triangle_btest_OBJECT.dir/ErrorOrder_2D_DGAdvective_Annulus_Triangle_btest.cpp.o
[ 91%] Built target ErrorOrder_2D_DGAdvective_Annulus_Triangle_btest_OBJECT
Scanning dependencies of target ErrorOrder_2D_DGAdvective_Annulus_Triangle_btest_build_vera
[ 91%] Checking style of test/system/Asymptotic/ErrorOrder_2D_DGAdvective_Annulus_Triangle_btest.cpp
[ 91%] Built target ErrorOrder_2D_DGAdvective_Annulus_Triangle_btest_build_vera
Scanning dependencies of target ErrorOrder_2D_DGAdvective_Annulus_Triangle_btest_build
[ 91%] Linking CXX executable ErrorOrder_2D_DGAdvective_Annulus_Triangle_btest
[ 91%] Built target ErrorOrder_2D_DGAdvective_Annulus_Triangle_btest_build
Scanning dependencies of target ErrorOrder_2D_DGAdvective_Circle_Line_AD_btest_OBJECT
[ 91%] Building CXX object test/system/Asymptotic/CMakeFiles/ErrorOrder_2D_DGAdvective_Circle_Line_AD_btest_OBJECT.dir/ErrorOrder_2D_DGAdvective_Circle_Line_AD_btest.cpp.o
[ 91%] Built target ErrorOrder_2D_DGAdvective_Circle_Line_AD_btest_OBJECT
Scanning dependencies of target ErrorOrder_2D_DGAdvective_Circle_Line_AD_btest_build_vera
[ 91%] Checking style of test/system/Asymptotic/ErrorOrder_2D_DGAdvective_Circle_Line_AD_btest.cpp
[ 91%] Built target ErrorOrder_2D_DGAdvective_Circle_Line_AD_btest_build_vera
Scanning dependencies of target ErrorOrder_2D_DGAdvective_Circle_Line_AD_btest_build
[ 91%] Linking CXX executable ErrorOrder_2D_DGAdvective_Circle_Line_AD_btest
[ 91%] Built target ErrorOrder_2D_DGAdvective_Circle_Line_AD_btest_build
Scanning dependencies of target ErrorEstimateOrder_2D_CG_Triangle_RD_btest_OBJECT
[ 91%] Building CXX object test/system/Asymptotic/CMakeFiles/ErrorEstimateOrder_2D_CG_Triangle_RD_btest_OBJECT.dir/ErrorEstimateOrder_2D_CG_Triangle_RD_btest.cpp.o
[ 91%] Built target ErrorEstimateOrder_2D_CG_Triangle_RD_btest_OBJECT
Scanning dependencies of target ErrorEstimateOrder_2D_CG_Triangle_RD_btest_build_vera
[ 91%] Checking style of test/system/Asymptotic/ErrorEstimateOrder_2D_CG_Triangle_RD_btest.cpp
[ 91%] Built target ErrorEstimateOrder_2D_CG_Triangle_RD_btest_build_vera
Scanning dependencies of target ErrorEstimateOrder_2D_CG_Triangle_RD_btest_build
[ 91%] Linking CXX executable ErrorEstimateOrder_2D_CG_Triangle_RD_btest
[ 91%] Built target ErrorEstimateOrder_2D_CG_Triangle_RD_btest_build
Scanning dependencies of target ErrorOrder_2D_CG_Triangle_AD_btest_OBJECT
[ 91%] Building CXX object test/system/Asymptotic/CMakeFiles/ErrorOrder_2D_CG_Triangle_AD_btest_OBJECT.dir/ErrorOrder_2D_CG_Triangle_AD_btest.cpp.o
[ 91%] Built target ErrorOrder_2D_CG_Triangle_AD_btest_OBJECT
Scanning dependencies of target ErrorOrder_2D_CG_Triangle_AD_btest_build_vera
[ 91%] Checking style of test/system/Asymptotic/ErrorOrder_2D_CG_Triangle_AD_btest.cpp
[ 91%] Built target ErrorOrder_2D_CG_Triangle_AD_btest_build_vera
Scanning dependencies of target ErrorOrder_2D_CG_Triangle_AD_btest_build
[ 91%] Linking CXX executable ErrorOrder_2D_CG_Triangle_AD_btest
[ 91%] Built target ErrorOrder_2D_CG_Triangle_AD_btest_build
Scanning dependencies of target ErrorOrder_1D_DGBR2_BuckleyLeverett_ST_btest_build_vera
[ 91%] Checking style of test/system/Asymptotic/ErrorOrder_1D_DGBR2_BuckleyLeverett_ST_btest.cpp
[ 91%] Built target ErrorOrder_1D_DGBR2_BuckleyLeverett_ST_btest_build_vera
Scanning dependencies of target ErrorOrder_1D_DGBR2_BuckleyLeverett_ST_btest_OBJECT
[ 91%] Building CXX object test/system/Asymptotic/CMakeFiles/ErrorOrder_1D_DGBR2_BuckleyLeverett_ST_btest_OBJECT.dir/ErrorOrder_1D_DGBR2_BuckleyLeverett_ST_btest.cpp.o
[ 91%] Built target ErrorOrder_1D_DGBR2_BuckleyLeverett_ST_btest_OBJECT
Scanning dependencies of target ErrorOrder_1D_DGBR2_BuckleyLeverett_ST_btest_build
[ 91%] Linking CXX executable ErrorOrder_1D_DGBR2_BuckleyLeverett_ST_btest
[ 91%] Built target ErrorOrder_1D_DGBR2_BuckleyLeverett_ST_btest_build
Scanning dependencies of target ErrorOrder_2D_CG_Quad_AD_btest_build_vera
[ 91%] Checking style of test/system/Asymptotic/ErrorOrder_2D_CG_Quad_AD_btest.cpp
[ 91%] Built target ErrorOrder_2D_CG_Quad_AD_btest_build_vera
Scanning dependencies of target ErrorOrder_2D_CG_Quad_AD_btest_OBJECT
[ 91%] Building CXX object test/system/Asymptotic/CMakeFiles/ErrorOrder_2D_CG_Quad_AD_btest_OBJECT.dir/ErrorOrder_2D_CG_Quad_AD_btest.cpp.o
[ 91%] Built target ErrorOrder_2D_CG_Quad_AD_btest_OBJECT
Scanning dependencies of target ErrorOrder_2D_CG_Quad_AD_btest_build
[ 91%] Linking CXX executable ErrorOrder_2D_CG_Quad_AD_btest
[ 91%] Built target ErrorOrder_2D_CG_Quad_AD_btest_build
Scanning dependencies of target ErrorEstimateOrder_2D_DGBR2_Triangle_AD_btest_OBJECT
[ 91%] Building CXX object test/system/Asymptotic/CMakeFiles/ErrorEstimateOrder_2D_DGBR2_Triangle_AD_btest_OBJECT.dir/ErrorEstimateOrder_2D_DGBR2_Triangle_AD_btest.cpp.o
[ 91%] Built target ErrorEstimateOrder_2D_DGBR2_Triangle_AD_btest_OBJECT
Scanning dependencies of target ErrorEstimateOrder_2D_DGBR2_Triangle_AD_btest_build_vera
[ 91%] Checking style of test/system/Asymptotic/ErrorEstimateOrder_2D_DGBR2_Triangle_AD_btest.cpp
[ 91%] Built target ErrorEstimateOrder_2D_DGBR2_Triangle_AD_btest_build_vera
Scanning dependencies of target ErrorEstimateOrder_2D_DGBR2_Triangle_AD_btest_build
[ 91%] Linking CXX executable ErrorEstimateOrder_2D_DGBR2_Triangle_AD_btest
[ 91%] Built target ErrorEstimateOrder_2D_DGBR2_Triangle_AD_btest_build
Scanning dependencies of target ErrorOrder_2D_DGAdvective_Circle_Line_ShallowWater_btest_build_vera
[ 91%] Checking style of test/system/Asymptotic/ErrorOrder_2D_DGAdvective_Circle_Line_ShallowWater_btest.cpp
[ 91%] Built target ErrorOrder_2D_DGAdvective_Circle_Line_ShallowWater_btest_build_vera
Scanning dependencies of target ErrorOrder_2D_DGAdvective_Circle_Line_ShallowWater_btest_OBJECT
[ 91%] Building CXX object test/system/Asymptotic/CMakeFiles/ErrorOrder_2D_DGAdvective_Circle_Line_ShallowWater_btest_OBJECT.dir/ErrorOrder_2D_DGAdvective_Circle_Line_ShallowWater_btest.cpp.o
[ 91%] Built target ErrorOrder_2D_DGAdvective_Circle_Line_ShallowWater_btest_OBJECT
Scanning dependencies of target ErrorOrder_2D_DGAdvective_Circle_Line_ShallowWater_btest_build
[ 91%] Linking CXX executable ErrorOrder_2D_DGAdvective_Circle_Line_ShallowWater_btest
[ 91%] Built target ErrorOrder_2D_DGAdvective_Circle_Line_ShallowWater_btest_build
Scanning dependencies of target ErrorOrder_1D_DGAdvective_ShallowWater_btest_OBJECT
[ 91%] Building CXX object test/system/Asymptotic/CMakeFiles/ErrorOrder_1D_DGAdvective_ShallowWater_btest_OBJECT.dir/ErrorOrder_1D_DGAdvective_ShallowWater_btest.cpp.o
[ 91%] Built target ErrorOrder_1D_DGAdvective_ShallowWater_btest_OBJECT
Scanning dependencies of target ErrorOrder_1D_DGAdvective_ShallowWater_btest_build_vera
[ 91%] Checking style of test/system/Asymptotic/ErrorOrder_1D_DGAdvective_ShallowWater_btest.cpp
[ 91%] Built target ErrorOrder_1D_DGAdvective_ShallowWater_btest_build_vera
Scanning dependencies of target ErrorOrder_1D_DGAdvective_ShallowWater_btest_build
[ 91%] Linking CXX executable ErrorOrder_1D_DGAdvective_ShallowWater_btest
[ 91%] Built target ErrorOrder_1D_DGAdvective_ShallowWater_btest_build
Scanning dependencies of target LocalSolve1D_HDG_AD_btest_build_vera
[ 91%] Checking style of test/system/LocalSolve/LocalSolve1D_HDG_AD_btest.cpp
[ 91%] Built target LocalSolve1D_HDG_AD_btest_build_vera
Scanning dependencies of target BlockLib
[ 91%] Building CXX object src/Discretization/CMakeFiles/BlockLib.dir/Block/AlgebraicEquationSet_Block2x2_Real_Real.cpp.o
[ 91%] Building CXX object src/Discretization/CMakeFiles/BlockLib.dir/Block/AlgebraicEquationSet_Block2x2_VecS3_Real.cpp.o
[ 91%] Building CXX object src/Discretization/CMakeFiles/BlockLib.dir/Block/AlgebraicEquationSet_Block2x2_VecS4_Real.cpp.o
[ 91%] Linking CXX static library libBlockLib.a
[ 91%] Built target BlockLib
Scanning dependencies of target BlockLinAlgLib_vera
[ 91%] Checking style of src/LinearAlgebra/BlockLinAlg/MatrixBlock_3x3.h
[ 91%] Checking style of src/LinearAlgebra/BlockLinAlg/MatrixBlock_2x2.h
[ 91%] Checking style of src/LinearAlgebra/BlockLinAlg/MatrixBlock_2x2_InverseLU.h
[ 91%] Checking style of src/LinearAlgebra/BlockLinAlg/MatrixBlock_2x2_Inverse.h
[ 91%] Checking style of src/LinearAlgebra/BlockLinAlg/BlockLinAlg_Type.h
[ 91%] Checking style of src/LinearAlgebra/BlockLinAlg/MatrixBlock_2x2_Decompose_LU.h
[ 91%] Checking style of src/LinearAlgebra/BlockLinAlg/VectorBlock_4.h
[ 91%] Checking style of src/LinearAlgebra/BlockLinAlg/MatrixBlock_2x2_Transpose.h
[ 91%] Checking style of src/LinearAlgebra/BlockLinAlg/MatrixBlock_2x2_InverseLUP.h
[ 91%] Checking style of src/LinearAlgebra/BlockLinAlg/MatrixBlock_4x4.h
[ 91%] Checking style of src/LinearAlgebra/BlockLinAlg/BlockLinAlg_Add.h
[ 91%] Checking style of src/LinearAlgebra/BlockLinAlg/BlockLinAlg_Mul.h
[ 91%] Checking style of src/LinearAlgebra/BlockLinAlg/MatrixBlock_2x2_Decompose_LUP.h
[ 91%] Checking style of src/LinearAlgebra/BlockLinAlg/VectorBlock_3.h
[ 91%] Checking style of src/LinearAlgebra/BlockLinAlg/VectorBlock_2.h
[ 91%] Checking style of src/LinearAlgebra/BlockLinAlg/MatrixBlock_2x2_InverseLUP.cpp
[ 91%] Checking style of src/LinearAlgebra/BlockLinAlg/MatrixBlock_2x2_Decompose_LUP.cpp
[ 91%] Checking style of src/LinearAlgebra/BlockLinAlg/MatrixBlock_2x2_Decompose_LU.cpp
[ 91%] Checking style of src/LinearAlgebra/BlockLinAlg/MatrixBlock_2x2_InverseLU.cpp
[ 91%] Built target BlockLinAlgLib_vera
Scanning dependencies of target BlockLinAlgLib
[ 91%] Building CXX object src/LinearAlgebra/BlockLinAlg/CMakeFiles/BlockLinAlgLib.dir/MatrixBlock_2x2_Decompose_LU.cpp.o
[ 91%] Building CXX object src/LinearAlgebra/BlockLinAlg/CMakeFiles/BlockLinAlgLib.dir/MatrixBlock_2x2_Decompose_LUP.cpp.o
[ 91%] Building CXX object src/LinearAlgebra/BlockLinAlg/CMakeFiles/BlockLinAlgLib.dir/MatrixBlock_2x2_InverseLU.cpp.o
[ 91%] Building CXX object src/LinearAlgebra/BlockLinAlg/CMakeFiles/BlockLinAlgLib.dir/MatrixBlock_2x2_InverseLUP.cpp.o
[ 91%] Linking CXX static library libBlockLinAlgLib.a
[ 91%] Built target BlockLinAlgLib
Scanning dependencies of target pdeSensorLib_vera
[ 91%] Checking style of src/pde/Sensor/Sensor_ViscousFlux1D.h
[ 91%] Checking style of src/pde/Sensor/Source1D_JumpSensor.h
[ 91%] Checking style of src/pde/Sensor/BCSensorParameter2D.h
[ 91%] Checking style of src/pde/Sensor/Sensor_Source1D.h
[ 91%] Checking style of src/pde/Sensor/Source2D_JumpSensor.h
[ 91%] Checking style of src/pde/Sensor/Sensor_Source2D.h
[ 91%] Checking style of src/pde/Sensor/PDESensorParameter2D.h
[ 91%] Checking style of src/pde/Sensor/Sensor_AdvectiveFlux2D.h
[ 91%] Checking style of src/pde/Sensor/Sensor_ViscousFlux2D.h
[ 91%] Checking style of src/pde/Sensor/BCSensorParameter1D.h
[ 91%] Checking style of src/pde/Sensor/SensorParameter_Traits.h
[ 91%] Checking style of src/pde/Sensor/PDESensorParameter1D.h
[ 91%] Checking style of src/pde/Sensor/Sensor_AdvectiveFlux1D.h
[ 91%] Checking style of src/pde/Sensor/Sensor_ViscousFlux1D.cpp
[ 91%] Checking style of src/pde/Sensor/Sensor_ViscousFlux2D.cpp
[ 91%] Checking style of src/pde/Sensor/Sensor_AdvectiveFlux1D.cpp
[ 91%] Checking style of src/pde/Sensor/PDESensorParameter1D.cpp
[ 91%] Checking style of src/pde/Sensor/Sensor_AdvectiveFlux2D.cpp
[ 91%] Checking style of src/pde/Sensor/BCSensorParameter2D.cpp
[ 91%] Checking style of src/pde/Sensor/BCSensorParameter1D.cpp
[ 91%] Checking style of src/pde/Sensor/PDESensorParameter2D.cpp
[ 91%] Built target pdeSensorLib_vera
Scanning dependencies of target pdeSensorLib
[ 91%] Building CXX object src/pde/Sensor/CMakeFiles/pdeSensorLib.dir/BCSensorParameter1D.cpp.o
[ 91%] Building CXX object src/pde/Sensor/CMakeFiles/pdeSensorLib.dir/BCSensorParameter2D.cpp.o
[ 91%] Building CXX object src/pde/Sensor/CMakeFiles/pdeSensorLib.dir/PDESensorParameter1D.cpp.o
[ 91%] Building CXX object src/pde/Sensor/CMakeFiles/pdeSensorLib.dir/PDESensorParameter2D.cpp.o
[ 91%] Building CXX object src/pde/Sensor/CMakeFiles/pdeSensorLib.dir/Sensor_AdvectiveFlux1D.cpp.o
[ 94%] Building CXX object src/pde/Sensor/CMakeFiles/pdeSensorLib.dir/Sensor_AdvectiveFlux2D.cpp.o
[ 94%] Building CXX object src/pde/Sensor/CMakeFiles/pdeSensorLib.dir/Sensor_ViscousFlux1D.cpp.o
[ 94%] Building CXX object src/pde/Sensor/CMakeFiles/pdeSensorLib.dir/Sensor_ViscousFlux2D.cpp.o
[ 94%] Linking CXX static library libpdeSensorLib.a
[ 94%] Built target pdeSensorLib
Scanning dependencies of target LocalSolve1D_HDG_AD_btest_OBJECT
[ 94%] Building CXX object test/system/LocalSolve/CMakeFiles/LocalSolve1D_HDG_AD_btest_OBJECT.dir/LocalSolve1D_HDG_AD_btest.cpp.o
[ 94%] Built target LocalSolve1D_HDG_AD_btest_OBJECT
Scanning dependencies of target LocalSolve1D_HDG_AD_btest_build
[ 94%] Linking CXX executable LocalSolve1D_HDG_AD_btest
[ 94%] Built target LocalSolve1D_HDG_AD_btest_build
Scanning dependencies of target LocalSolve1D_Split_HDG_AD_btest_build_vera
[ 94%] Checking style of test/system/LocalSolve/LocalSolve1D_Split_HDG_AD_btest.cpp
[ 94%] Built target LocalSolve1D_Split_HDG_AD_btest_build_vera
Scanning dependencies of target LocalSolve1D_Split_HDG_AD_btest_OBJECT
[ 94%] Building CXX object test/system/LocalSolve/CMakeFiles/LocalSolve1D_Split_HDG_AD_btest_OBJECT.dir/LocalSolve1D_Split_HDG_AD_btest.cpp.o
[ 94%] Built target LocalSolve1D_Split_HDG_AD_btest_OBJECT
Scanning dependencies of target LocalSolve1D_Split_HDG_AD_btest_build
[ 94%] Linking CXX executable LocalSolve1D_Split_HDG_AD_btest
[ 94%] Built target LocalSolve1D_Split_HDG_AD_btest_build
Scanning dependencies of target LocalSolve2D_Split_DGBR2_Triangle_AD_AV_btest_build_vera
[ 94%] Checking style of test/system/LocalSolve/LocalSolve2D_Split_DGBR2_Triangle_AD_AV_btest.cpp
[ 94%] Built target LocalSolve2D_Split_DGBR2_Triangle_AD_AV_btest_build_vera
Scanning dependencies of target LocalSolve2D_Split_DGBR2_Triangle_AD_AV_btest_OBJECT
[ 94%] Building CXX object test/system/LocalSolve/CMakeFiles/LocalSolve2D_Split_DGBR2_Triangle_AD_AV_btest_OBJECT.dir/LocalSolve2D_Split_DGBR2_Triangle_AD_AV_btest.cpp.o
[ 94%] Built target LocalSolve2D_Split_DGBR2_Triangle_AD_AV_btest_OBJECT
Scanning dependencies of target LocalSolve2D_Split_DGBR2_Triangle_AD_AV_btest_build
[ 94%] Linking CXX executable LocalSolve2D_Split_DGBR2_Triangle_AD_AV_btest
[ 94%] Built target LocalSolve2D_Split_DGBR2_Triangle_AD_AV_btest_build
Scanning dependencies of target LocalSolve1D_Split_DGBR2_AD_btest_build_vera
[ 94%] Checking style of test/system/LocalSolve/LocalSolve1D_Split_DGBR2_AD_btest.cpp
[ 94%] Built target LocalSolve1D_Split_DGBR2_AD_btest_build_vera
Scanning dependencies of target LocalSolve1D_Split_DGBR2_AD_btest_OBJECT
[ 94%] Building CXX object test/system/LocalSolve/CMakeFiles/LocalSolve1D_Split_DGBR2_AD_btest_OBJECT.dir/LocalSolve1D_Split_DGBR2_AD_btest.cpp.o
[ 94%] Built target LocalSolve1D_Split_DGBR2_AD_btest_OBJECT
Scanning dependencies of target LocalSolve1D_Split_DGBR2_AD_btest_build
[ 94%] Linking CXX executable LocalSolve1D_Split_DGBR2_AD_btest
[ 94%] Built target LocalSolve1D_Split_DGBR2_AD_btest_build
Scanning dependencies of target EdgeLocalSolve2D_Dual_Galerkin_Stabilized_Euler_btest_build_vera
[ 94%] Checking style of test/system/LocalSolve/EdgeLocalSolve2D_Dual_Galerkin_Stabilized_Euler_btest.cpp
[ 94%] Built target EdgeLocalSolve2D_Dual_Galerkin_Stabilized_Euler_btest_build_vera
Scanning dependencies of target EdgeLocalSolve2D_Dual_Galerkin_Stabilized_Euler_btest_OBJECT
[ 94%] Building CXX object test/system/LocalSolve/CMakeFiles/EdgeLocalSolve2D_Dual_Galerkin_Stabilized_Euler_btest_OBJECT.dir/EdgeLocalSolve2D_Dual_Galerkin_Stabilized_Euler_btest.cpp.o
[ 94%] Built target EdgeLocalSolve2D_Dual_Galerkin_Stabilized_Euler_btest_OBJECT
Scanning dependencies of target EdgeLocalSolve2D_Dual_Galerkin_Stabilized_Euler_btest_build
[ 94%] Linking CXX executable EdgeLocalSolve2D_Dual_Galerkin_Stabilized_Euler_btest
[ 94%] Built target EdgeLocalSolve2D_Dual_Galerkin_Stabilized_Euler_btest_build
Scanning dependencies of target ElementDualLocalSolve2D_Galerkin_Stabilized_Triangle_AD_btest_build_vera
[ 94%] Checking style of test/system/LocalSolve/ElementDualLocalSolve2D_Galerkin_Stabilized_Triangle_AD_btest.cpp
[ 94%] Built target ElementDualLocalSolve2D_Galerkin_Stabilized_Triangle_AD_btest_build_vera
Scanning dependencies of target ElementDualLocalSolve2D_Galerkin_Stabilized_Triangle_AD_btest_OBJECT
[ 94%] Building CXX object test/system/LocalSolve/CMakeFiles/ElementDualLocalSolve2D_Galerkin_Stabilized_Triangle_AD_btest_OBJECT.dir/ElementDualLocalSolve2D_Galerkin_Stabilized_Triangle_AD_btest.cpp.o
[ 94%] Built target ElementDualLocalSolve2D_Galerkin_Stabilized_Triangle_AD_btest_OBJECT
Scanning dependencies of target ElementDualLocalSolve2D_Galerkin_Stabilized_Triangle_AD_btest_build
[ 94%] Linking CXX executable ElementDualLocalSolve2D_Galerkin_Stabilized_Triangle_AD_btest
[ 94%] Built target ElementDualLocalSolve2D_Galerkin_Stabilized_Triangle_AD_btest_build
Scanning dependencies of target EdgeLocalSolve2D_Dual_Galerkin_Stabilized_AR_btest_OBJECT
[ 94%] Building CXX object test/system/LocalSolve/CMakeFiles/EdgeLocalSolve2D_Dual_Galerkin_Stabilized_AR_btest_OBJECT.dir/EdgeLocalSolve2D_Dual_Galerkin_Stabilized_AR_btest.cpp.o
[ 94%] Built target EdgeLocalSolve2D_Dual_Galerkin_Stabilized_AR_btest_OBJECT
Scanning dependencies of target EdgeLocalSolve2D_Dual_Galerkin_Stabilized_AR_btest_build_vera
[ 94%] Checking style of test/system/LocalSolve/EdgeLocalSolve2D_Dual_Galerkin_Stabilized_AR_btest.cpp
[ 94%] Built target EdgeLocalSolve2D_Dual_Galerkin_Stabilized_AR_btest_build_vera
Scanning dependencies of target EdgeLocalSolve2D_Dual_Galerkin_Stabilized_AR_btest_build
[ 94%] Linking CXX executable EdgeLocalSolve2D_Dual_Galerkin_Stabilized_AR_btest
[ 94%] Built target EdgeLocalSolve2D_Dual_Galerkin_Stabilized_AR_btest_build
Scanning dependencies of target AlgebraicEquationSet_Local_VMSD_Triangle_AD_btest_OBJECT
[ 94%] Building CXX object test/system/LocalSolve/CMakeFiles/AlgebraicEquationSet_Local_VMSD_Triangle_AD_btest_OBJECT.dir/AlgebraicEquationSet_Local_VMSD_Triangle_AD_btest.cpp.o
[ 94%] Built target AlgebraicEquationSet_Local_VMSD_Triangle_AD_btest_OBJECT
Scanning dependencies of target AlgebraicEquationSet_Local_VMSD_Triangle_AD_btest_build_vera
[ 94%] Checking style of test/system/LocalSolve/AlgebraicEquationSet_Local_VMSD_Triangle_AD_btest.cpp
[ 94%] Built target AlgebraicEquationSet_Local_VMSD_Triangle_AD_btest_build_vera
Scanning dependencies of target AlgebraicEquationSet_Local_VMSD_Triangle_AD_btest_build
[ 94%] Linking CXX executable AlgebraicEquationSet_Local_VMSD_Triangle_AD_btest
[ 94%] Built target AlgebraicEquationSet_Local_VMSD_Triangle_AD_btest_build
Scanning dependencies of target LocalSolve3D_HDG_Tet_AD_btest_build_vera
[ 94%] Checking style of test/system/LocalSolve/LocalSolve3D_HDG_Tet_AD_btest.cpp
[ 94%] Built target LocalSolve3D_HDG_Tet_AD_btest_build_vera
Scanning dependencies of target LocalSolve3D_HDG_Tet_AD_btest_OBJECT
[ 94%] Building CXX object test/system/LocalSolve/CMakeFiles/LocalSolve3D_HDG_Tet_AD_btest_OBJECT.dir/LocalSolve3D_HDG_Tet_AD_btest.cpp.o
[ 94%] Built target LocalSolve3D_HDG_Tet_AD_btest_OBJECT
Scanning dependencies of target LocalSolve3D_HDG_Tet_AD_btest_build
[ 94%] Linking CXX executable LocalSolve3D_HDG_Tet_AD_btest
[ 94%] Built target LocalSolve3D_HDG_Tet_AD_btest_build
Scanning dependencies of target ElementLocalSolve3D_DGBR2_Tet_AD_btest_build_vera
[ 94%] Checking style of test/system/LocalSolve/ElementLocalSolve3D_DGBR2_Tet_AD_btest.cpp
[ 94%] Built target ElementLocalSolve3D_DGBR2_Tet_AD_btest_build_vera
Scanning dependencies of target ElementLocalSolve3D_DGBR2_Tet_AD_btest_OBJECT
[ 94%] Building CXX object test/system/LocalSolve/CMakeFiles/ElementLocalSolve3D_DGBR2_Tet_AD_btest_OBJECT.dir/ElementLocalSolve3D_DGBR2_Tet_AD_btest.cpp.o
[ 94%] Built target ElementLocalSolve3D_DGBR2_Tet_AD_btest_OBJECT
Scanning dependencies of target ElementLocalSolve3D_DGBR2_Tet_AD_btest_build
[ 94%] Linking CXX executable ElementLocalSolve3D_DGBR2_Tet_AD_btest
[ 94%] Built target ElementLocalSolve3D_DGBR2_Tet_AD_btest_build
Scanning dependencies of target LocalSolve2D_HDG_Triangle_AD_btest_build_vera
[ 94%] Checking style of test/system/LocalSolve/LocalSolve2D_HDG_Triangle_AD_btest.cpp
[ 94%] Built target LocalSolve2D_HDG_Triangle_AD_btest_build_vera
Scanning dependencies of target LocalSolve2D_HDG_Triangle_AD_btest_OBJECT
[ 94%] Building CXX object test/system/LocalSolve/CMakeFiles/LocalSolve2D_HDG_Triangle_AD_btest_OBJECT.dir/LocalSolve2D_HDG_Triangle_AD_btest.cpp.o
[ 94%] Built target LocalSolve2D_HDG_Triangle_AD_btest_OBJECT
Scanning dependencies of target LocalSolve2D_HDG_Triangle_AD_btest_build
[ 94%] Linking CXX executable LocalSolve2D_HDG_Triangle_AD_btest
[ 94%] Built target LocalSolve2D_HDG_Triangle_AD_btest_build
Scanning dependencies of target EdgeLocalSolve3D_Dual_Galerkin_Stabilized_AD_btest_OBJECT
[ 94%] Building CXX object test/system/LocalSolve/CMakeFiles/EdgeLocalSolve3D_Dual_Galerkin_Stabilized_AD_btest_OBJECT.dir/EdgeLocalSolve3D_Dual_Galerkin_Stabilized_AD_btest.cpp.o
[ 94%] Built target EdgeLocalSolve3D_Dual_Galerkin_Stabilized_AD_btest_OBJECT
Scanning dependencies of target EdgeLocalSolve3D_Dual_Galerkin_Stabilized_AD_btest_build_vera
[ 94%] Checking style of test/system/LocalSolve/EdgeLocalSolve3D_Dual_Galerkin_Stabilized_AD_btest.cpp
[ 94%] Built target EdgeLocalSolve3D_Dual_Galerkin_Stabilized_AD_btest_build_vera
Scanning dependencies of target EdgeLocalSolve3D_Dual_Galerkin_Stabilized_AD_btest_build
[ 94%] Linking CXX executable EdgeLocalSolve3D_Dual_Galerkin_Stabilized_AD_btest
[ 94%] Built target EdgeLocalSolve3D_Dual_Galerkin_Stabilized_AD_btest_build
Scanning dependencies of target LocalSolve3D_Split_HDG_Tet_AD_btest_build_vera
[ 94%] Checking style of test/system/LocalSolve/LocalSolve3D_Split_HDG_Tet_AD_btest.cpp
[ 94%] Built target LocalSolve3D_Split_HDG_Tet_AD_btest_build_vera
Scanning dependencies of target LocalSolve3D_Split_HDG_Tet_AD_btest_OBJECT
[ 94%] Building CXX object test/system/LocalSolve/CMakeFiles/LocalSolve3D_Split_HDG_Tet_AD_btest_OBJECT.dir/LocalSolve3D_Split_HDG_Tet_AD_btest.cpp.o
[ 94%] Built target LocalSolve3D_Split_HDG_Tet_AD_btest_OBJECT
Scanning dependencies of target LocalSolve3D_Split_HDG_Tet_AD_btest_build
[ 94%] Linking CXX executable LocalSolve3D_Split_HDG_Tet_AD_btest
[ 94%] Built target LocalSolve3D_Split_HDG_Tet_AD_btest_build
Scanning dependencies of target LocalSolve2D_Split_HDG_Triangle_AD_btest_OBJECT
[ 94%] Building CXX object test/system/LocalSolve/CMakeFiles/LocalSolve2D_Split_HDG_Triangle_AD_btest_OBJECT.dir/LocalSolve2D_Split_HDG_Triangle_AD_btest.cpp.o
[ 94%] Built target LocalSolve2D_Split_HDG_Triangle_AD_btest_OBJECT
Scanning dependencies of target LocalSolve2D_Split_HDG_Triangle_AD_btest_build_vera
[ 94%] Checking style of test/system/LocalSolve/LocalSolve2D_Split_HDG_Triangle_AD_btest.cpp
[ 94%] Built target LocalSolve2D_Split_HDG_Triangle_AD_btest_build_vera
Scanning dependencies of target LocalSolve2D_Split_HDG_Triangle_AD_btest_build
[ 94%] Linking CXX executable LocalSolve2D_Split_HDG_Triangle_AD_btest
[ 94%] Built target LocalSolve2D_Split_HDG_Triangle_AD_btest_build
Scanning dependencies of target ElementDualLocalSolve3D_Galerkin_Stabilized_Triangle_AD_btest_OBJECT
[ 94%] Building CXX object test/system/LocalSolve/CMakeFiles/ElementDualLocalSolve3D_Galerkin_Stabilized_Triangle_AD_btest_OBJECT.dir/ElementDualLocalSolve3D_Galerkin_Stabilized_Triangle_AD_btest.cpp.o
[ 94%] Built target ElementDualLocalSolve3D_Galerkin_Stabilized_Triangle_AD_btest_OBJECT
Scanning dependencies of target ElementDualLocalSolve3D_Galerkin_Stabilized_Triangle_AD_btest_build_vera
[ 94%] Checking style of test/system/LocalSolve/ElementDualLocalSolve3D_Galerkin_Stabilized_Triangle_AD_btest.cpp
[ 94%] Built target ElementDualLocalSolve3D_Galerkin_Stabilized_Triangle_AD_btest_build_vera
Scanning dependencies of target ElementDualLocalSolve3D_Galerkin_Stabilized_Triangle_AD_btest_build
[ 94%] Linking CXX executable ElementDualLocalSolve3D_Galerkin_Stabilized_Triangle_AD_btest
[ 94%] Built target ElementDualLocalSolve3D_Galerkin_Stabilized_Triangle_AD_btest_build
Scanning dependencies of target ElementLocalSolve2D_DGBR2_Triangle_AD_btest_OBJECT
[ 94%] Building CXX object test/system/LocalSolve/CMakeFiles/ElementLocalSolve2D_DGBR2_Triangle_AD_btest_OBJECT.dir/ElementLocalSolve2D_DGBR2_Triangle_AD_btest.cpp.o
[ 94%] Built target ElementLocalSolve2D_DGBR2_Triangle_AD_btest_OBJECT
Scanning dependencies of target ElementLocalSolve2D_DGBR2_Triangle_AD_btest_build_vera
[ 94%] Checking style of test/system/LocalSolve/ElementLocalSolve2D_DGBR2_Triangle_AD_btest.cpp
[ 94%] Built target ElementLocalSolve2D_DGBR2_Triangle_AD_btest_build_vera
Scanning dependencies of target ElementLocalSolve2D_DGBR2_Triangle_AD_btest_build
[ 97%] Linking CXX executable ElementLocalSolve2D_DGBR2_Triangle_AD_btest
[ 97%] Built target ElementLocalSolve2D_DGBR2_Triangle_AD_btest_build
Scanning dependencies of target EdgeLocalSolve2D_Dual_Galerkin_Stabilized_AD_btest_build_vera
[ 97%] Checking style of test/system/LocalSolve/EdgeLocalSolve2D_Dual_Galerkin_Stabilized_AD_btest.cpp
[ 97%] Built target EdgeLocalSolve2D_Dual_Galerkin_Stabilized_AD_btest_build_vera
Scanning dependencies of target EdgeLocalSolve2D_Dual_Galerkin_Stabilized_AD_btest_OBJECT
[ 97%] Building CXX object test/system/LocalSolve/CMakeFiles/EdgeLocalSolve2D_Dual_Galerkin_Stabilized_AD_btest_OBJECT.dir/EdgeLocalSolve2D_Dual_Galerkin_Stabilized_AD_btest.cpp.o
[ 97%] Built target EdgeLocalSolve2D_Dual_Galerkin_Stabilized_AD_btest_OBJECT
Scanning dependencies of target EdgeLocalSolve2D_Dual_Galerkin_Stabilized_AD_btest_build
[ 97%] Linking CXX executable EdgeLocalSolve2D_Dual_Galerkin_Stabilized_AD_btest
[ 97%] Built target EdgeLocalSolve2D_Dual_Galerkin_Stabilized_AD_btest_build
Scanning dependencies of target ElementLocalSolve1D_DGBR2_Triangle_AD_btest_build_vera
[ 97%] Checking style of test/system/LocalSolve/ElementLocalSolve1D_DGBR2_Triangle_AD_btest.cpp
[ 97%] Built target ElementLocalSolve1D_DGBR2_Triangle_AD_btest_build_vera
Scanning dependencies of target ElementLocalSolve1D_DGBR2_Triangle_AD_btest_OBJECT
[ 97%] Building CXX object test/system/LocalSolve/CMakeFiles/ElementLocalSolve1D_DGBR2_Triangle_AD_btest_OBJECT.dir/ElementLocalSolve1D_DGBR2_Triangle_AD_btest.cpp.o
[ 97%] Built target ElementLocalSolve1D_DGBR2_Triangle_AD_btest_OBJECT
Scanning dependencies of target ElementLocalSolve1D_DGBR2_Triangle_AD_btest_build
[ 97%] Linking CXX executable ElementLocalSolve1D_DGBR2_Triangle_AD_btest
[ 97%] Built target ElementLocalSolve1D_DGBR2_Triangle_AD_btest_build
Scanning dependencies of target AlgebraicEquationSet_Local_VMSDBR2_Triangle_AD_btest_build_vera
[ 97%] Checking style of test/system/LocalSolve/AlgebraicEquationSet_Local_VMSDBR2_Triangle_AD_btest.cpp
[ 97%] Built target AlgebraicEquationSet_Local_VMSDBR2_Triangle_AD_btest_build_vera
Scanning dependencies of target AlgebraicEquationSet_Local_VMSDBR2_Triangle_AD_btest_OBJECT
[ 97%] Building CXX object test/system/LocalSolve/CMakeFiles/AlgebraicEquationSet_Local_VMSDBR2_Triangle_AD_btest_OBJECT.dir/AlgebraicEquationSet_Local_VMSDBR2_Triangle_AD_btest.cpp.o
[ 97%] Built target AlgebraicEquationSet_Local_VMSDBR2_Triangle_AD_btest_OBJECT
Scanning dependencies of target AlgebraicEquationSet_Local_VMSDBR2_Triangle_AD_btest_build
[ 97%] Linking CXX executable AlgebraicEquationSet_Local_VMSDBR2_Triangle_AD_btest
[ 97%] Built target AlgebraicEquationSet_Local_VMSDBR2_Triangle_AD_btest_build
Scanning dependencies of target ElementLocalSolve3D_DGAdvective_Tet_AD_btest_OBJECT
[ 97%] Building CXX object test/system/LocalSolve/CMakeFiles/ElementLocalSolve3D_DGAdvective_Tet_AD_btest_OBJECT.dir/ElementLocalSolve3D_DGAdvective_Tet_AD_btest.cpp.o
[ 97%] Built target ElementLocalSolve3D_DGAdvective_Tet_AD_btest_OBJECT
Scanning dependencies of target ElementLocalSolve3D_DGAdvective_Tet_AD_btest_build_vera
[ 97%] Checking style of test/system/LocalSolve/ElementLocalSolve3D_DGAdvective_Tet_AD_btest.cpp
[ 97%] Built target ElementLocalSolve3D_DGAdvective_Tet_AD_btest_build_vera
Scanning dependencies of target ElementLocalSolve3D_DGAdvective_Tet_AD_btest_build
[ 97%] Linking CXX executable ElementLocalSolve3D_DGAdvective_Tet_AD_btest
[ 97%] Built target ElementLocalSolve3D_DGAdvective_Tet_AD_btest_build
Scanning dependencies of target EdgeLocalSolve1D_Dual_Galerkin_Stabilized_Line_AD_btest_build_vera
[ 97%] Checking style of test/system/LocalSolve/EdgeLocalSolve1D_Dual_Galerkin_Stabilized_Line_AD_btest.cpp
[ 97%] Built target EdgeLocalSolve1D_Dual_Galerkin_Stabilized_Line_AD_btest_build_vera
Scanning dependencies of target EdgeLocalSolve1D_Dual_Galerkin_Stabilized_Line_AD_btest_OBJECT
[ 97%] Building CXX object test/system/LocalSolve/CMakeFiles/EdgeLocalSolve1D_Dual_Galerkin_Stabilized_Line_AD_btest_OBJECT.dir/EdgeLocalSolve1D_Dual_Galerkin_Stabilized_Line_AD_btest.cpp.o
[ 97%] Built target EdgeLocalSolve1D_Dual_Galerkin_Stabilized_Line_AD_btest_OBJECT
Scanning dependencies of target EdgeLocalSolve1D_Dual_Galerkin_Stabilized_Line_AD_btest_build
[ 97%] Linking CXX executable EdgeLocalSolve1D_Dual_Galerkin_Stabilized_Line_AD_btest
[ 97%] Built target EdgeLocalSolve1D_Dual_Galerkin_Stabilized_Line_AD_btest_build
Scanning dependencies of target Block_1D_Decoupled_AD_btest_build_vera
[ 97%] Checking style of test/system/BlockSolve/Block_1D_Decoupled_AD_btest.cpp
[ 97%] Built target Block_1D_Decoupled_AD_btest_build_vera
Scanning dependencies of target Block_1D_Decoupled_AD_btest_OBJECT
[ 97%] Building CXX object test/system/BlockSolve/CMakeFiles/Block_1D_Decoupled_AD_btest_OBJECT.dir/Block_1D_Decoupled_AD_btest.cpp.o
[ 97%] Built target Block_1D_Decoupled_AD_btest_OBJECT
Scanning dependencies of target Block_1D_Decoupled_AD_btest_build
[ 97%] Linking CXX executable Block_1D_Decoupled_AD_btest
[ 97%] Built target Block_1D_Decoupled_AD_btest_build
Scanning dependencies of target Block_1D_Decoupled_Burgers_btest_OBJECT
[ 97%] Building CXX object test/system/BlockSolve/CMakeFiles/Block_1D_Decoupled_Burgers_btest_OBJECT.dir/Block_1D_Decoupled_Burgers_btest.cpp.o
[ 97%] Built target Block_1D_Decoupled_Burgers_btest_OBJECT
Scanning dependencies of target Block_1D_Decoupled_Burgers_btest_build_vera
[ 97%] Checking style of test/system/BlockSolve/Block_1D_Decoupled_Burgers_btest.cpp
[ 97%] Built target Block_1D_Decoupled_Burgers_btest_build_vera
Scanning dependencies of target Block_1D_Decoupled_Burgers_btest_build
[ 97%] Linking CXX executable Block_1D_Decoupled_Burgers_btest
[ 97%] Built target Block_1D_Decoupled_Burgers_btest_build
Scanning dependencies of target AnalyticSolve3D_IBLFourEqn_StagnationFlow_LamiBL_Triangle_btest_build_vera
[ 97%] Checking style of test/system/AnalyticSolve/AnalyticSolve3D_IBLFourEqn_StagnationFlow_LamiBL_Triangle_btest.cpp
[ 97%] Built target AnalyticSolve3D_IBLFourEqn_StagnationFlow_LamiBL_Triangle_btest_build_vera
Scanning dependencies of target DGBR2NSLib
[ 97%] Building CXX object src/Discretization/CMakeFiles/DGBR2NSLib.dir/DG/DGBR2_Instantiate/AlgebraicEquationSet_DGBR2_NavierStokes2D_ConservativeConstVisc.cpp.o
[ 97%] Building CXX object src/Discretization/CMakeFiles/DGBR2NSLib.dir/DG/DGBR2_Instantiate/AlgebraicEquationSet_DGBR2_NavierStokes2D_PrimitiveConstVisc.cpp.o
[ 97%] Building CXX object src/Discretization/CMakeFiles/DGBR2NSLib.dir/DG/DGBR2_Instantiate/AlgebraicEquationSet_DGBR2_NavierStokes3D_PrimitiveConstVisc.cpp.o
[ 97%] Building CXX object src/Discretization/CMakeFiles/DGBR2NSLib.dir/DG/DGBR2_Instantiate/AlgebraicEquationSet_DGBR2_NavierStokes3D_PrimitiveSutherland.cpp.o
[ 97%] Building CXX object src/Discretization/CMakeFiles/DGBR2NSLib.dir/DG/DGBR2_Instantiate/AlgebraicEquationSet_DGBR2_NavierStokes3D_SurrogateSutherland.cpp.o
[ 97%] Linking CXX static library libDGBR2NSLib.a
[ 97%] Built target DGBR2NSLib
Scanning dependencies of target AnalyticSolve3D_IBLFourEqn_StagnationFlow_LamiBL_Triangle_btest_OBJECT
[ 97%] Building CXX object test/system/AnalyticSolve/CMakeFiles/AnalyticSolve3D_IBLFourEqn_StagnationFlow_LamiBL_Triangle_btest_OBJECT.dir/AnalyticSolve3D_IBLFourEqn_StagnationFlow_LamiBL_Triangle_btest.cpp.o
[ 97%] Built target AnalyticSolve3D_IBLFourEqn_StagnationFlow_LamiBL_Triangle_btest_OBJECT
Scanning dependencies of target AnalyticSolve3D_IBLFourEqn_StagnationFlow_LamiBL_Triangle_btest_build
[ 97%] Linking CXX executable AnalyticSolve3D_IBLFourEqn_StagnationFlow_LamiBL_Triangle_btest
CMakeFiles/AnalyticSolve3D_IBLFourEqn_StagnationFlow_LamiBL_Triangle_btest_OBJECT.dir/AnalyticSolve3D_IBLFourEqn_StagnationFlow_LamiBL_Triangle_btest.cpp.o: In function `void SANS::PDENDConvertSpace<PhysD3, SANS::PDEIBLFourEqn<PhysD3, SANS::VarTypeDsThFourEqn3D> >::forcingFunction<SANS::DLA::VectorS<5, double>, double>(SANS::ParamTuple<SANS::DLA::VectorS<5, double>, SANS::DLA::VectorS<3, double>, SANS::TupleClass<0> > const&, SANS::DLA::VectorS<6, double>&) const':
/jenkins/workspace/SANS_Weekly/builddir/debug_intel/buildnode/reynolds/src/pde/NDConvert/PDENDConvertSpace3D.h:1050: undefined reference to `void SANS::PDEIBLFourEqn<PhysD3, SANS::VarTypeDsThFourEqn3D>::forcingFunction<double, double>(SANS::DLA::VectorS<5, double> const&, double const&, double const&, double const&, double const&, SANS::DLA::VectorS<6, double>&) const'
test/system/AnalyticSolve/CMakeFiles/AnalyticSolve3D_IBLFourEqn_StagnationFlow_LamiBL_Triangle_btest_build.dir/build.make:196: recipe for target 'test/system/AnalyticSolve/AnalyticSolve3D_IBLFourEqn_StagnationFlow_LamiBL_Triangle_btest' failed
make[3]: *** [test/system/AnalyticSolve/AnalyticSolve3D_IBLFourEqn_StagnationFlow_LamiBL_Triangle_btest] Error 1
CMakeFiles/Makefile2:192616: recipe for target 'test/system/AnalyticSolve/CMakeFiles/AnalyticSolve3D_IBLFourEqn_StagnationFlow_LamiBL_Triangle_btest_build.dir/all' failed
make[2]: *** [test/system/AnalyticSolve/CMakeFiles/AnalyticSolve3D_IBLFourEqn_StagnationFlow_LamiBL_Triangle_btest_build.dir/all] Error 2
CMakeFiles/Makefile2:176440: recipe for target 'test/system/CMakeFiles/memcheck_system.dir/rule' failed
make[1]: *** [test/system/CMakeFiles/memcheck_system.dir/rule] Error 2
Makefile:61988: recipe for target 'memcheck_system' failed
make: *** [memcheck_system] Error 2

real	116m57.269s
user	90m23.096s
sys	11m7.596s
+ status=1
++ find /jenkins/workspace/SANS_Weekly/builddir/debug_intel/buildnode/reynolds/build/debug_intel -name Test.xml
+ mv /jenkins/workspace/SANS_Weekly/builddir/debug_intel/buildnode/reynolds/build/Test_system_memcheck.xml
mv: missing destination file operand after '/jenkins/workspace/SANS_Weekly/builddir/debug_intel/buildnode/reynolds/build/Test_system_memcheck.xml'
Try 'mv --help' for more information.
Build step 'Execute shell' marked build as failure
[GNU C Compiler (gcc)Clang (LLVM based)Intel Compiler (C, Fortran)Vera++] Skipping execution of recorder since overall result is 'FAILURE'
[Valgrind] Files to copy:
[Valgrind] Analysing valgrind results
[Valgrind] Ending the valgrind analysis.
INFO: Starting to record.
INFO: Processing CTest-Version 3.x (default)
INFO: [CTest-Version 3.x (default)] - No test report file(s) were found with the pattern 'build/Test*.xml' relative to '/jenkins/workspace/SANS_Weekly/builddir/debug_intel/buildnode/reynolds' for the testing framework 'CTest-Version 3.x (default)'.
Did you enter a pattern relative to (and within) the workspace directory?
Did you generate the result report(s) for 'CTest-Version 3.x (default)'?"
INFO: Skipping tests recording.
[PostBuildScript] - [INFO] Executing post build scripts.
[PostBuildScript] - [INFO] Build does not have any of the results []. Did not execute build step #0.
[WS-CLEANUP] Deleting project workspace...
[WS-CLEANUP] Deferred wipeout is used...
[WS-CLEANUP] done
Finished: FAILURE