Console Output

Skipping 330 KB.. Full Log
Scanning dependencies of target Adjoint2D_CG_Triangle_AD_btest_OBJECT
[ 88%] Building CXX object test/system/Asymptotic/CMakeFiles/Adjoint2D_CG_Triangle_AD_btest_OBJECT.dir/Adjoint2D_CG_Triangle_AD_btest.cpp.o
[ 88%] Built target Adjoint2D_CG_Triangle_AD_btest_OBJECT
Scanning dependencies of target Adjoint2D_CG_Triangle_AD_btest_build
[ 88%] Linking CXX executable Adjoint2D_CG_Triangle_AD_btest
[ 88%] Built target Adjoint2D_CG_Triangle_AD_btest_build
Scanning dependencies of target ErrorOrder_2D_DGBR2_Triangle_AD_btest_OBJECT
[ 88%] Building CXX object test/system/Asymptotic/CMakeFiles/ErrorOrder_2D_DGBR2_Triangle_AD_btest_OBJECT.dir/ErrorOrder_2D_DGBR2_Triangle_AD_btest.cpp.o
[ 88%] Built target ErrorOrder_2D_DGBR2_Triangle_AD_btest_OBJECT
Scanning dependencies of target ErrorOrder_2D_DGBR2_Triangle_AD_btest_build_vera
[ 88%] Checking style of test/system/Asymptotic/ErrorOrder_2D_DGBR2_Triangle_AD_btest.cpp
[ 88%] Built target ErrorOrder_2D_DGBR2_Triangle_AD_btest_build_vera
Scanning dependencies of target ErrorOrder_2D_DGBR2_Triangle_AD_btest_build
[ 88%] Linking CXX executable ErrorOrder_2D_DGBR2_Triangle_AD_btest
[ 88%] Built target ErrorOrder_2D_DGBR2_Triangle_AD_btest_build
Scanning dependencies of target ErrorOrder_2D_DGBR2_RANS_MMS_btest_OBJECT
[ 88%] Building CXX object test/system/Asymptotic/CMakeFiles/ErrorOrder_2D_DGBR2_RANS_MMS_btest_OBJECT.dir/ErrorOrder_2D_DGBR2_RANS_MMS_btest.cpp.o
[ 88%] Built target ErrorOrder_2D_DGBR2_RANS_MMS_btest_OBJECT
Scanning dependencies of target ErrorOrder_2D_DGBR2_RANS_MMS_btest_build_vera
[ 88%] Checking style of test/system/Asymptotic/ErrorOrder_2D_DGBR2_RANS_MMS_btest.cpp
[ 88%] Built target ErrorOrder_2D_DGBR2_RANS_MMS_btest_build_vera
Scanning dependencies of target ErrorOrder_2D_DGBR2_RANS_MMS_btest_build
[ 88%] Linking CXX executable ErrorOrder_2D_DGBR2_RANS_MMS_btest
[ 88%] Built target ErrorOrder_2D_DGBR2_RANS_MMS_btest_build
Scanning dependencies of target Adjoint2D_HDG_Triangle_AD_sansLG_btest_build_vera
[ 88%] Checking style of test/system/Asymptotic/Adjoint2D_HDG_Triangle_AD_sansLG_btest.cpp
[ 88%] Built target Adjoint2D_HDG_Triangle_AD_sansLG_btest_build_vera
Scanning dependencies of target Adjoint2D_HDG_Triangle_AD_sansLG_btest_OBJECT
[ 88%] Building CXX object test/system/Asymptotic/CMakeFiles/Adjoint2D_HDG_Triangle_AD_sansLG_btest_OBJECT.dir/Adjoint2D_HDG_Triangle_AD_sansLG_btest.cpp.o
[ 88%] Built target Adjoint2D_HDG_Triangle_AD_sansLG_btest_OBJECT
Scanning dependencies of target Adjoint2D_HDG_Triangle_AD_sansLG_btest_build
[ 88%] Linking CXX executable Adjoint2D_HDG_Triangle_AD_sansLG_btest
[ 88%] Built target Adjoint2D_HDG_Triangle_AD_sansLG_btest_build
Scanning dependencies of target ErrorEstimateOrder_2D_DGAdvective_Triangle_AD_btest_OBJECT
[ 88%] Building CXX object test/system/Asymptotic/CMakeFiles/ErrorEstimateOrder_2D_DGAdvective_Triangle_AD_btest_OBJECT.dir/ErrorEstimateOrder_2D_DGAdvective_Triangle_AD_btest.cpp.o
[ 88%] Built target ErrorEstimateOrder_2D_DGAdvective_Triangle_AD_btest_OBJECT
Scanning dependencies of target ErrorEstimateOrder_2D_DGAdvective_Triangle_AD_btest_build_vera
[ 88%] Checking style of test/system/Asymptotic/ErrorEstimateOrder_2D_DGAdvective_Triangle_AD_btest.cpp
[ 88%] Built target ErrorEstimateOrder_2D_DGAdvective_Triangle_AD_btest_build_vera
Scanning dependencies of target ErrorEstimateOrder_2D_DGAdvective_Triangle_AD_btest_build
[ 88%] Linking CXX executable ErrorEstimateOrder_2D_DGAdvective_Triangle_AD_btest
[ 88%] Built target ErrorEstimateOrder_2D_DGAdvective_Triangle_AD_btest_build
Scanning dependencies of target ErrorOrder_3D_DGBR2_Tet_AD_btest_OBJECT
[ 88%] Building CXX object test/system/Asymptotic/CMakeFiles/ErrorOrder_3D_DGBR2_Tet_AD_btest_OBJECT.dir/ErrorOrder_3D_DGBR2_Tet_AD_btest.cpp.o
[ 88%] Built target ErrorOrder_3D_DGBR2_Tet_AD_btest_OBJECT
Scanning dependencies of target ErrorOrder_3D_DGBR2_Tet_AD_btest_build_vera
[ 88%] Checking style of test/system/Asymptotic/ErrorOrder_3D_DGBR2_Tet_AD_btest.cpp
[ 88%] Built target ErrorOrder_3D_DGBR2_Tet_AD_btest_build_vera
Scanning dependencies of target ErrorOrder_3D_DGBR2_Tet_AD_btest_build
[ 88%] Linking CXX executable ErrorOrder_3D_DGBR2_Tet_AD_btest
[ 88%] Built target ErrorOrder_3D_DGBR2_Tet_AD_btest_build
Scanning dependencies of target ErrorOrder_3D_CG_Tet_AD_btest_build_vera
[ 88%] Checking style of test/system/Asymptotic/ErrorOrder_3D_CG_Tet_AD_btest.cpp
[ 88%] Built target ErrorOrder_3D_CG_Tet_AD_btest_build_vera
Scanning dependencies of target ErrorOrder_3D_CG_Tet_AD_btest_OBJECT
[ 91%] Building CXX object test/system/Asymptotic/CMakeFiles/ErrorOrder_3D_CG_Tet_AD_btest_OBJECT.dir/ErrorOrder_3D_CG_Tet_AD_btest.cpp.o
[ 91%] Built target ErrorOrder_3D_CG_Tet_AD_btest_OBJECT
Scanning dependencies of target ErrorOrder_3D_CG_Tet_AD_btest_build
[ 91%] Linking CXX executable ErrorOrder_3D_CG_Tet_AD_btest
[ 91%] Built target ErrorOrder_3D_CG_Tet_AD_btest_build
Scanning dependencies of target ErrorOrder_3D_DGBR2_Sphere_Triangle_AD_btest_build_vera
[ 91%] Checking style of test/system/Asymptotic/ErrorOrder_3D_DGBR2_Sphere_Triangle_AD_btest.cpp
[ 91%] Built target ErrorOrder_3D_DGBR2_Sphere_Triangle_AD_btest_build_vera
Scanning dependencies of target ErrorOrder_3D_DGBR2_Sphere_Triangle_AD_btest_OBJECT
[ 91%] Building CXX object test/system/Asymptotic/CMakeFiles/ErrorOrder_3D_DGBR2_Sphere_Triangle_AD_btest_OBJECT.dir/ErrorOrder_3D_DGBR2_Sphere_Triangle_AD_btest.cpp.o
[ 91%] Built target ErrorOrder_3D_DGBR2_Sphere_Triangle_AD_btest_OBJECT
Scanning dependencies of target ErrorOrder_3D_DGBR2_Sphere_Triangle_AD_btest_build
[ 91%] Linking CXX executable ErrorOrder_3D_DGBR2_Sphere_Triangle_AD_btest
[ 91%] Built target ErrorOrder_3D_DGBR2_Sphere_Triangle_AD_btest_build
Scanning dependencies of target ErrorOrder_1D_DGBR2_Burgers_btest_build_vera
[ 91%] Checking style of test/system/Asymptotic/ErrorOrder_1D_DGBR2_Burgers_btest.cpp
[ 91%] Built target ErrorOrder_1D_DGBR2_Burgers_btest_build_vera
Scanning dependencies of target ErrorOrder_1D_DGBR2_Burgers_btest_OBJECT
[ 91%] Building CXX object test/system/Asymptotic/CMakeFiles/ErrorOrder_1D_DGBR2_Burgers_btest_OBJECT.dir/ErrorOrder_1D_DGBR2_Burgers_btest.cpp.o
[ 91%] Built target ErrorOrder_1D_DGBR2_Burgers_btest_OBJECT
Scanning dependencies of target ErrorOrder_1D_DGBR2_Burgers_btest_build
[ 91%] Linking CXX executable ErrorOrder_1D_DGBR2_Burgers_btest
[ 91%] Built target ErrorOrder_1D_DGBR2_Burgers_btest_build
Scanning dependencies of target Solve2D_DGAdvective_LinearRobin_mitLG_sansLG_Consistency_AD_btest_build_vera
[ 91%] Checking style of test/system/Asymptotic/Solve2D_DGAdvective_LinearRobin_mitLG_sansLG_Consistency_AD_btest.cpp
[ 91%] Built target Solve2D_DGAdvective_LinearRobin_mitLG_sansLG_Consistency_AD_btest_build_vera
Scanning dependencies of target Solve2D_DGAdvective_LinearRobin_mitLG_sansLG_Consistency_AD_btest_OBJECT
[ 91%] Building CXX object test/system/Asymptotic/CMakeFiles/Solve2D_DGAdvective_LinearRobin_mitLG_sansLG_Consistency_AD_btest_OBJECT.dir/Solve2D_DGAdvective_LinearRobin_mitLG_sansLG_Consistency_AD_btest.cpp.o
[ 91%] Built target Solve2D_DGAdvective_LinearRobin_mitLG_sansLG_Consistency_AD_btest_OBJECT
Scanning dependencies of target Solve2D_DGAdvective_LinearRobin_mitLG_sansLG_Consistency_AD_btest_build
[ 91%] Linking CXX executable Solve2D_DGAdvective_LinearRobin_mitLG_sansLG_Consistency_AD_btest
[ 91%] Built target Solve2D_DGAdvective_LinearRobin_mitLG_sansLG_Consistency_AD_btest_build
Scanning dependencies of target Adjoint2D_DGAdvective_Triangle_AD_btest_build_vera
[ 91%] Checking style of test/system/Asymptotic/Adjoint2D_DGAdvective_Triangle_AD_btest.cpp
[ 91%] Built target Adjoint2D_DGAdvective_Triangle_AD_btest_build_vera
Scanning dependencies of target Adjoint2D_DGAdvective_Triangle_AD_btest_OBJECT
[ 91%] Building CXX object test/system/Asymptotic/CMakeFiles/Adjoint2D_DGAdvective_Triangle_AD_btest_OBJECT.dir/Adjoint2D_DGAdvective_Triangle_AD_btest.cpp.o
[ 91%] Built target Adjoint2D_DGAdvective_Triangle_AD_btest_OBJECT
Scanning dependencies of target Adjoint2D_DGAdvective_Triangle_AD_btest_build
[ 91%] Linking CXX executable Adjoint2D_DGAdvective_Triangle_AD_btest
[ 91%] Built target Adjoint2D_DGAdvective_Triangle_AD_btest_build
Scanning dependencies of target ErrorOrder_4D_DG_Pentatope_btest_OBJECT
[ 91%] Building CXX object test/system/Asymptotic/CMakeFiles/ErrorOrder_4D_DG_Pentatope_btest_OBJECT.dir/ErrorOrder_4D_DG_Pentatope_btest.cpp.o
[ 91%] Built target ErrorOrder_4D_DG_Pentatope_btest_OBJECT
Scanning dependencies of target ErrorOrder_4D_DG_Pentatope_btest_build_vera
[ 91%] Checking style of test/system/Asymptotic/ErrorOrder_4D_DG_Pentatope_btest.cpp
[ 91%] Built target ErrorOrder_4D_DG_Pentatope_btest_build_vera
Scanning dependencies of target ErrorOrder_4D_DG_Pentatope_btest_build
[ 91%] Linking CXX executable ErrorOrder_4D_DG_Pentatope_btest
[ 91%] Built target ErrorOrder_4D_DG_Pentatope_btest_build
Scanning dependencies of target ErrorOrder_2D_EDG_Triangle_AD_btest_OBJECT
[ 91%] Building CXX object test/system/Asymptotic/CMakeFiles/ErrorOrder_2D_EDG_Triangle_AD_btest_OBJECT.dir/ErrorOrder_2D_EDG_Triangle_AD_btest.cpp.o
[ 91%] Built target ErrorOrder_2D_EDG_Triangle_AD_btest_OBJECT
Scanning dependencies of target ErrorOrder_2D_EDG_Triangle_AD_btest_build_vera
[ 91%] Checking style of test/system/Asymptotic/ErrorOrder_2D_EDG_Triangle_AD_btest.cpp
[ 91%] Built target ErrorOrder_2D_EDG_Triangle_AD_btest_build_vera
Scanning dependencies of target ErrorOrder_2D_EDG_Triangle_AD_btest_build
[ 91%] Linking CXX executable ErrorOrder_2D_EDG_Triangle_AD_btest
[ 91%] Built target ErrorOrder_2D_EDG_Triangle_AD_btest_build
Scanning dependencies of target ErrorEstimateOrder_1D_CG_Line_AD_btest_OBJECT
[ 91%] Building CXX object test/system/Asymptotic/CMakeFiles/ErrorEstimateOrder_1D_CG_Line_AD_btest_OBJECT.dir/ErrorEstimateOrder_1D_CG_Line_AD_btest.cpp.o
[ 91%] Built target ErrorEstimateOrder_1D_CG_Line_AD_btest_OBJECT
Scanning dependencies of target ErrorEstimateOrder_1D_CG_Line_AD_btest_build_vera
[ 91%] Checking style of test/system/Asymptotic/ErrorEstimateOrder_1D_CG_Line_AD_btest.cpp
[ 91%] Built target ErrorEstimateOrder_1D_CG_Line_AD_btest_build_vera
Scanning dependencies of target ErrorEstimateOrder_1D_CG_Line_AD_btest_build
[ 91%] Linking CXX executable ErrorEstimateOrder_1D_CG_Line_AD_btest
[ 91%] Built target ErrorEstimateOrder_1D_CG_Line_AD_btest_build
Scanning dependencies of target ErrorEstimateOrder_2D_HDG_Triangle_AD_btest_build_vera
[ 91%] Checking style of test/system/Asymptotic/ErrorEstimateOrder_2D_HDG_Triangle_AD_btest.cpp
[ 91%] Built target ErrorEstimateOrder_2D_HDG_Triangle_AD_btest_build_vera
Scanning dependencies of target ErrorEstimateOrder_2D_HDG_Triangle_AD_btest_OBJECT
[ 91%] Building CXX object test/system/Asymptotic/CMakeFiles/ErrorEstimateOrder_2D_HDG_Triangle_AD_btest_OBJECT.dir/ErrorEstimateOrder_2D_HDG_Triangle_AD_btest.cpp.o
[ 91%] Built target ErrorEstimateOrder_2D_HDG_Triangle_AD_btest_OBJECT
Scanning dependencies of target ErrorEstimateOrder_2D_HDG_Triangle_AD_btest_build
[ 91%] Linking CXX executable ErrorEstimateOrder_2D_HDG_Triangle_AD_btest
[ 91%] Built target ErrorEstimateOrder_2D_HDG_Triangle_AD_btest_build
Scanning dependencies of target ErrorOrder_1D_HDG_Burgers_btest_OBJECT
[ 91%] Building CXX object test/system/Asymptotic/CMakeFiles/ErrorOrder_1D_HDG_Burgers_btest_OBJECT.dir/ErrorOrder_1D_HDG_Burgers_btest.cpp.o
[ 91%] Built target ErrorOrder_1D_HDG_Burgers_btest_OBJECT
Scanning dependencies of target ErrorOrder_1D_HDG_Burgers_btest_build_vera
[ 91%] Checking style of test/system/Asymptotic/ErrorOrder_1D_HDG_Burgers_btest.cpp
[ 91%] Built target ErrorOrder_1D_HDG_Burgers_btest_build_vera
Scanning dependencies of target ErrorOrder_1D_HDG_Burgers_btest_build
[ 91%] Linking CXX executable ErrorOrder_1D_HDG_Burgers_btest
[ 91%] Built target ErrorOrder_1D_HDG_Burgers_btest_build
Scanning dependencies of target ErrorOrder_1D_DGBR2_TwoPhase_ST_btest_build_vera
[ 91%] Checking style of test/system/Asymptotic/ErrorOrder_1D_DGBR2_TwoPhase_ST_btest.cpp
[ 91%] Built target ErrorOrder_1D_DGBR2_TwoPhase_ST_btest_build_vera
Scanning dependencies of target ErrorOrder_1D_DGBR2_TwoPhase_ST_btest_OBJECT
[ 91%] Building CXX object test/system/Asymptotic/CMakeFiles/ErrorOrder_1D_DGBR2_TwoPhase_ST_btest_OBJECT.dir/ErrorOrder_1D_DGBR2_TwoPhase_ST_btest.cpp.o
[ 91%] Built target ErrorOrder_1D_DGBR2_TwoPhase_ST_btest_OBJECT
Scanning dependencies of target ErrorOrder_1D_DGBR2_TwoPhase_ST_btest_build
[ 91%] Linking CXX executable ErrorOrder_1D_DGBR2_TwoPhase_ST_btest
[ 91%] Built target ErrorOrder_1D_DGBR2_TwoPhase_ST_btest_build
Scanning dependencies of target Adjoint1D_DGBR2_BuckleyLeverett_ST_btest_build_vera
[ 91%] Checking style of test/system/Asymptotic/Adjoint1D_DGBR2_BuckleyLeverett_ST_btest.cpp
[ 91%] Built target Adjoint1D_DGBR2_BuckleyLeverett_ST_btest_build_vera
Scanning dependencies of target Adjoint1D_DGBR2_BuckleyLeverett_ST_btest_OBJECT
[ 91%] Building CXX object test/system/Asymptotic/CMakeFiles/Adjoint1D_DGBR2_BuckleyLeverett_ST_btest_OBJECT.dir/Adjoint1D_DGBR2_BuckleyLeverett_ST_btest.cpp.o
[ 91%] Built target Adjoint1D_DGBR2_BuckleyLeverett_ST_btest_OBJECT
Scanning dependencies of target Adjoint1D_DGBR2_BuckleyLeverett_ST_btest_build
[ 91%] Linking CXX executable Adjoint1D_DGBR2_BuckleyLeverett_ST_btest
[ 91%] Built target Adjoint1D_DGBR2_BuckleyLeverett_ST_btest_build
Scanning dependencies of target ErrorOrder_3D_CG_Sphere_Triangle_AD_btest_build_vera
[ 91%] Checking style of test/system/Asymptotic/ErrorOrder_3D_CG_Sphere_Triangle_AD_btest.cpp
[ 91%] Built target ErrorOrder_3D_CG_Sphere_Triangle_AD_btest_build_vera
Scanning dependencies of target ErrorOrder_3D_CG_Sphere_Triangle_AD_btest_OBJECT
[ 91%] Building CXX object test/system/Asymptotic/CMakeFiles/ErrorOrder_3D_CG_Sphere_Triangle_AD_btest_OBJECT.dir/ErrorOrder_3D_CG_Sphere_Triangle_AD_btest.cpp.o
[ 91%] Built target ErrorOrder_3D_CG_Sphere_Triangle_AD_btest_OBJECT
Scanning dependencies of target ErrorOrder_3D_CG_Sphere_Triangle_AD_btest_build
[ 91%] Linking CXX executable ErrorOrder_3D_CG_Sphere_Triangle_AD_btest
[ 91%] Built target ErrorOrder_3D_CG_Sphere_Triangle_AD_btest_build
Scanning dependencies of target ErrorOrder_1D_HDG_AD_btest_build_vera
[ 91%] Checking style of test/system/Asymptotic/ErrorOrder_1D_HDG_AD_btest.cpp
[ 91%] Built target ErrorOrder_1D_HDG_AD_btest_build_vera
Scanning dependencies of target ErrorOrder_1D_HDG_AD_btest_OBJECT
[ 91%] Building CXX object test/system/Asymptotic/CMakeFiles/ErrorOrder_1D_HDG_AD_btest_OBJECT.dir/ErrorOrder_1D_HDG_AD_btest.cpp.o
[ 91%] Built target ErrorOrder_1D_HDG_AD_btest_OBJECT
Scanning dependencies of target ErrorOrder_1D_HDG_AD_btest_build
[ 91%] Linking CXX executable ErrorOrder_1D_HDG_AD_btest
[ 91%] Built target ErrorOrder_1D_HDG_AD_btest_build
Scanning dependencies of target ErrorOrder_1D_HDG_AD_BDF_btest_build_vera
[ 91%] Checking style of test/system/Asymptotic/ErrorOrder_1D_HDG_AD_BDF_btest.cpp
[ 91%] Built target ErrorOrder_1D_HDG_AD_BDF_btest_build_vera
Scanning dependencies of target ErrorOrder_1D_HDG_AD_BDF_btest_OBJECT
[ 91%] Building CXX object test/system/Asymptotic/CMakeFiles/ErrorOrder_1D_HDG_AD_BDF_btest_OBJECT.dir/ErrorOrder_1D_HDG_AD_BDF_btest.cpp.o
[ 91%] Built target ErrorOrder_1D_HDG_AD_BDF_btest_OBJECT
Scanning dependencies of target ErrorOrder_1D_HDG_AD_BDF_btest_build
[ 91%] Linking CXX executable ErrorOrder_1D_HDG_AD_BDF_btest
[ 91%] Built target ErrorOrder_1D_HDG_AD_BDF_btest_build
Scanning dependencies of target ErrorOrder_1D_DGBR2_AD_BDF_btest_build_vera
[ 91%] Checking style of test/system/Asymptotic/ErrorOrder_1D_DGBR2_AD_BDF_btest.cpp
[ 91%] Built target ErrorOrder_1D_DGBR2_AD_BDF_btest_build_vera
Scanning dependencies of target ErrorOrder_1D_DGBR2_AD_BDF_btest_OBJECT
[ 91%] Building CXX object test/system/Asymptotic/CMakeFiles/ErrorOrder_1D_DGBR2_AD_BDF_btest_OBJECT.dir/ErrorOrder_1D_DGBR2_AD_BDF_btest.cpp.o
[ 91%] Built target ErrorOrder_1D_DGBR2_AD_BDF_btest_OBJECT
Scanning dependencies of target ErrorOrder_1D_DGBR2_AD_BDF_btest_build
[ 91%] Linking CXX executable ErrorOrder_1D_DGBR2_AD_BDF_btest
[ 91%] Built target ErrorOrder_1D_DGBR2_AD_BDF_btest_build
Scanning dependencies of target ErrorOrder_1D_HDGAdvective_Advection_btest_build_vera
[ 91%] Checking style of test/system/Asymptotic/ErrorOrder_1D_HDGAdvective_Advection_btest.cpp
[ 91%] Built target ErrorOrder_1D_HDGAdvective_Advection_btest_build_vera
Scanning dependencies of target ErrorOrder_1D_HDGAdvective_Advection_btest_OBJECT
[ 91%] Building CXX object test/system/Asymptotic/CMakeFiles/ErrorOrder_1D_HDGAdvective_Advection_btest_OBJECT.dir/ErrorOrder_1D_HDGAdvective_Advection_btest.cpp.o
[ 91%] Built target ErrorOrder_1D_HDGAdvective_Advection_btest_OBJECT
Scanning dependencies of target ErrorOrder_1D_HDGAdvective_Advection_btest_build
[ 91%] Linking CXX executable ErrorOrder_1D_HDGAdvective_Advection_btest
[ 91%] Built target ErrorOrder_1D_HDGAdvective_Advection_btest_build
Scanning dependencies of target ErrorEstimateOrder_2D_CG_Triangle_AD_btest_OBJECT
[ 91%] Building CXX object test/system/Asymptotic/CMakeFiles/ErrorEstimateOrder_2D_CG_Triangle_AD_btest_OBJECT.dir/ErrorEstimateOrder_2D_CG_Triangle_AD_btest.cpp.o
[ 91%] Built target ErrorEstimateOrder_2D_CG_Triangle_AD_btest_OBJECT
Scanning dependencies of target ErrorEstimateOrder_2D_CG_Triangle_AD_btest_build_vera
[ 91%] Checking style of test/system/Asymptotic/ErrorEstimateOrder_2D_CG_Triangle_AD_btest.cpp
[ 91%] Built target ErrorEstimateOrder_2D_CG_Triangle_AD_btest_build_vera
Scanning dependencies of target ErrorEstimateOrder_2D_CG_Triangle_AD_btest_build
[ 91%] Linking CXX executable ErrorEstimateOrder_2D_CG_Triangle_AD_btest
[ 91%] Built target ErrorEstimateOrder_2D_CG_Triangle_AD_btest_build
Scanning dependencies of target ErrorOrder_1D_CG_AD_BDF_btest_OBJECT
[ 91%] Building CXX object test/system/Asymptotic/CMakeFiles/ErrorOrder_1D_CG_AD_BDF_btest_OBJECT.dir/ErrorOrder_1D_CG_AD_BDF_btest.cpp.o
[ 91%] Built target ErrorOrder_1D_CG_AD_BDF_btest_OBJECT
Scanning dependencies of target ErrorOrder_1D_CG_AD_BDF_btest_build_vera
[ 91%] Checking style of test/system/Asymptotic/ErrorOrder_1D_CG_AD_BDF_btest.cpp
[ 91%] Built target ErrorOrder_1D_CG_AD_BDF_btest_build_vera
Scanning dependencies of target ErrorOrder_1D_CG_AD_BDF_btest_build
[ 94%] Linking CXX executable ErrorOrder_1D_CG_AD_BDF_btest
[ 94%] Built target ErrorOrder_1D_CG_AD_BDF_btest_build
Scanning dependencies of target ErrorEstimateOrder_1D_DGBR2_Line_AD_btest_build_vera
[ 94%] Checking style of test/system/Asymptotic/ErrorEstimateOrder_1D_DGBR2_Line_AD_btest.cpp
[ 94%] Built target ErrorEstimateOrder_1D_DGBR2_Line_AD_btest_build_vera
Scanning dependencies of target ErrorEstimateOrder_1D_DGBR2_Line_AD_btest_OBJECT
[ 94%] Building CXX object test/system/Asymptotic/CMakeFiles/ErrorEstimateOrder_1D_DGBR2_Line_AD_btest_OBJECT.dir/ErrorEstimateOrder_1D_DGBR2_Line_AD_btest.cpp.o
[ 94%] Built target ErrorEstimateOrder_1D_DGBR2_Line_AD_btest_OBJECT
Scanning dependencies of target ErrorEstimateOrder_1D_DGBR2_Line_AD_btest_build
[ 94%] Linking CXX executable ErrorEstimateOrder_1D_DGBR2_Line_AD_btest
[ 94%] Built target ErrorEstimateOrder_1D_DGBR2_Line_AD_btest_build
Scanning dependencies of target ErrorOrder_3D_CG_Hex_AD_btest_OBJECT
[ 94%] Building CXX object test/system/Asymptotic/CMakeFiles/ErrorOrder_3D_CG_Hex_AD_btest_OBJECT.dir/ErrorOrder_3D_CG_Hex_AD_btest.cpp.o
[ 94%] Built target ErrorOrder_3D_CG_Hex_AD_btest_OBJECT
Scanning dependencies of target ErrorOrder_3D_CG_Hex_AD_btest_build_vera
[ 94%] Checking style of test/system/Asymptotic/ErrorOrder_3D_CG_Hex_AD_btest.cpp
[ 94%] Built target ErrorOrder_3D_CG_Hex_AD_btest_build_vera
Scanning dependencies of target ErrorOrder_3D_CG_Hex_AD_btest_build
[ 94%] Linking CXX executable ErrorOrder_3D_CG_Hex_AD_btest
[ 94%] Built target ErrorOrder_3D_CG_Hex_AD_btest_build
Scanning dependencies of target ErrorEstimateOrder_2D_CG_Nodal_Triangle_AD_btest_OBJECT
[ 94%] Building CXX object test/system/Asymptotic/CMakeFiles/ErrorEstimateOrder_2D_CG_Nodal_Triangle_AD_btest_OBJECT.dir/ErrorEstimateOrder_2D_CG_Nodal_Triangle_AD_btest.cpp.o
[ 94%] Built target ErrorEstimateOrder_2D_CG_Nodal_Triangle_AD_btest_OBJECT
Scanning dependencies of target ErrorEstimateOrder_2D_CG_Nodal_Triangle_AD_btest_build_vera
[ 94%] Checking style of test/system/Asymptotic/ErrorEstimateOrder_2D_CG_Nodal_Triangle_AD_btest.cpp
[ 94%] Built target ErrorEstimateOrder_2D_CG_Nodal_Triangle_AD_btest_build_vera
Scanning dependencies of target ErrorEstimateOrder_2D_CG_Nodal_Triangle_AD_btest_build
[ 94%] Linking CXX executable ErrorEstimateOrder_2D_CG_Nodal_Triangle_AD_btest
[ 94%] Built target ErrorEstimateOrder_2D_CG_Nodal_Triangle_AD_btest_build
Scanning dependencies of target ErrorOrder_2D_DGAdvective_Flat_Line_AD_btest_OBJECT
[ 94%] Building CXX object test/system/Asymptotic/CMakeFiles/ErrorOrder_2D_DGAdvective_Flat_Line_AD_btest_OBJECT.dir/ErrorOrder_2D_DGAdvective_Flat_Line_AD_btest.cpp.o
[ 94%] Built target ErrorOrder_2D_DGAdvective_Flat_Line_AD_btest_OBJECT
Scanning dependencies of target ErrorOrder_2D_DGAdvective_Flat_Line_AD_btest_build_vera
[ 94%] Checking style of test/system/Asymptotic/ErrorOrder_2D_DGAdvective_Flat_Line_AD_btest.cpp
[ 94%] Built target ErrorOrder_2D_DGAdvective_Flat_Line_AD_btest_build_vera
Scanning dependencies of target ErrorOrder_2D_DGAdvective_Flat_Line_AD_btest_build
[ 94%] Linking CXX executable ErrorOrder_2D_DGAdvective_Flat_Line_AD_btest
[ 94%] Built target ErrorOrder_2D_DGAdvective_Flat_Line_AD_btest_build
Scanning dependencies of target ErrorOrder_1D_DGBR2_AD_btest_OBJECT
[ 94%] Building CXX object test/system/Asymptotic/CMakeFiles/ErrorOrder_1D_DGBR2_AD_btest_OBJECT.dir/ErrorOrder_1D_DGBR2_AD_btest.cpp.o
[ 94%] Built target ErrorOrder_1D_DGBR2_AD_btest_OBJECT
Scanning dependencies of target ErrorOrder_1D_DGBR2_AD_btest_build_vera
[ 94%] Checking style of test/system/Asymptotic/ErrorOrder_1D_DGBR2_AD_btest.cpp
[ 94%] Built target ErrorOrder_1D_DGBR2_AD_btest_build_vera
Scanning dependencies of target ErrorOrder_1D_DGBR2_AD_btest_build
[ 94%] Linking CXX executable ErrorOrder_1D_DGBR2_AD_btest
[ 94%] Built target ErrorOrder_1D_DGBR2_AD_btest_build
Scanning dependencies of target ErrorOrder_2D_HDG_Triangle_AD_btest_build_vera
[ 94%] Checking style of test/system/Asymptotic/ErrorOrder_2D_HDG_Triangle_AD_btest.cpp
[ 94%] Built target ErrorOrder_2D_HDG_Triangle_AD_btest_build_vera
Scanning dependencies of target ErrorOrder_2D_HDG_Triangle_AD_btest_OBJECT
[ 94%] Building CXX object test/system/Asymptotic/CMakeFiles/ErrorOrder_2D_HDG_Triangle_AD_btest_OBJECT.dir/ErrorOrder_2D_HDG_Triangle_AD_btest.cpp.o
[ 94%] Built target ErrorOrder_2D_HDG_Triangle_AD_btest_OBJECT
Scanning dependencies of target ErrorOrder_2D_HDG_Triangle_AD_btest_build
[ 94%] Linking CXX executable ErrorOrder_2D_HDG_Triangle_AD_btest
[ 94%] Built target ErrorOrder_2D_HDG_Triangle_AD_btest_build
Scanning dependencies of target ErrorOrder_2D_DGAdvective_Annulus_Triangle_btest_OBJECT
[ 94%] Building CXX object test/system/Asymptotic/CMakeFiles/ErrorOrder_2D_DGAdvective_Annulus_Triangle_btest_OBJECT.dir/ErrorOrder_2D_DGAdvective_Annulus_Triangle_btest.cpp.o
[ 94%] Built target ErrorOrder_2D_DGAdvective_Annulus_Triangle_btest_OBJECT
Scanning dependencies of target ErrorOrder_2D_DGAdvective_Annulus_Triangle_btest_build_vera
[ 94%] Checking style of test/system/Asymptotic/ErrorOrder_2D_DGAdvective_Annulus_Triangle_btest.cpp
[ 94%] Built target ErrorOrder_2D_DGAdvective_Annulus_Triangle_btest_build_vera
Scanning dependencies of target ErrorOrder_2D_DGAdvective_Annulus_Triangle_btest_build
[ 94%] Linking CXX executable ErrorOrder_2D_DGAdvective_Annulus_Triangle_btest
[ 94%] Built target ErrorOrder_2D_DGAdvective_Annulus_Triangle_btest_build
Scanning dependencies of target ErrorOrder_2D_DGAdvective_Circle_Line_AD_btest_OBJECT
[ 94%] Building CXX object test/system/Asymptotic/CMakeFiles/ErrorOrder_2D_DGAdvective_Circle_Line_AD_btest_OBJECT.dir/ErrorOrder_2D_DGAdvective_Circle_Line_AD_btest.cpp.o
[ 94%] Built target ErrorOrder_2D_DGAdvective_Circle_Line_AD_btest_OBJECT
Scanning dependencies of target ErrorOrder_2D_DGAdvective_Circle_Line_AD_btest_build_vera
[ 94%] Checking style of test/system/Asymptotic/ErrorOrder_2D_DGAdvective_Circle_Line_AD_btest.cpp
[ 94%] Built target ErrorOrder_2D_DGAdvective_Circle_Line_AD_btest_build_vera
Scanning dependencies of target ErrorOrder_2D_DGAdvective_Circle_Line_AD_btest_build
[ 94%] Linking CXX executable ErrorOrder_2D_DGAdvective_Circle_Line_AD_btest
[ 94%] Built target ErrorOrder_2D_DGAdvective_Circle_Line_AD_btest_build
Scanning dependencies of target ErrorEstimateOrder_2D_CG_Triangle_RD_btest_OBJECT
[ 94%] Building CXX object test/system/Asymptotic/CMakeFiles/ErrorEstimateOrder_2D_CG_Triangle_RD_btest_OBJECT.dir/ErrorEstimateOrder_2D_CG_Triangle_RD_btest.cpp.o
[ 94%] Built target ErrorEstimateOrder_2D_CG_Triangle_RD_btest_OBJECT
Scanning dependencies of target ErrorEstimateOrder_2D_CG_Triangle_RD_btest_build_vera
[ 94%] Checking style of test/system/Asymptotic/ErrorEstimateOrder_2D_CG_Triangle_RD_btest.cpp
[ 94%] Built target ErrorEstimateOrder_2D_CG_Triangle_RD_btest_build_vera
Scanning dependencies of target ErrorEstimateOrder_2D_CG_Triangle_RD_btest_build
[ 94%] Linking CXX executable ErrorEstimateOrder_2D_CG_Triangle_RD_btest
[ 94%] Built target ErrorEstimateOrder_2D_CG_Triangle_RD_btest_build
Scanning dependencies of target ErrorOrder_2D_CG_Triangle_AD_btest_OBJECT
[ 94%] Building CXX object test/system/Asymptotic/CMakeFiles/ErrorOrder_2D_CG_Triangle_AD_btest_OBJECT.dir/ErrorOrder_2D_CG_Triangle_AD_btest.cpp.o
[ 94%] Built target ErrorOrder_2D_CG_Triangle_AD_btest_OBJECT
Scanning dependencies of target ErrorOrder_2D_CG_Triangle_AD_btest_build_vera
[ 94%] Checking style of test/system/Asymptotic/ErrorOrder_2D_CG_Triangle_AD_btest.cpp
[ 94%] Built target ErrorOrder_2D_CG_Triangle_AD_btest_build_vera
Scanning dependencies of target ErrorOrder_2D_CG_Triangle_AD_btest_build
[ 94%] Linking CXX executable ErrorOrder_2D_CG_Triangle_AD_btest
[ 94%] Built target ErrorOrder_2D_CG_Triangle_AD_btest_build
Scanning dependencies of target ErrorOrder_1D_DGBR2_BuckleyLeverett_ST_btest_build_vera
[ 94%] Checking style of test/system/Asymptotic/ErrorOrder_1D_DGBR2_BuckleyLeverett_ST_btest.cpp
[ 94%] Built target ErrorOrder_1D_DGBR2_BuckleyLeverett_ST_btest_build_vera
Scanning dependencies of target ErrorOrder_1D_DGBR2_BuckleyLeverett_ST_btest_OBJECT
[ 94%] Building CXX object test/system/Asymptotic/CMakeFiles/ErrorOrder_1D_DGBR2_BuckleyLeverett_ST_btest_OBJECT.dir/ErrorOrder_1D_DGBR2_BuckleyLeverett_ST_btest.cpp.o
[ 94%] Built target ErrorOrder_1D_DGBR2_BuckleyLeverett_ST_btest_OBJECT
Scanning dependencies of target ErrorOrder_1D_DGBR2_BuckleyLeverett_ST_btest_build
[ 94%] Linking CXX executable ErrorOrder_1D_DGBR2_BuckleyLeverett_ST_btest
[ 94%] Built target ErrorOrder_1D_DGBR2_BuckleyLeverett_ST_btest_build
Scanning dependencies of target ErrorOrder_2D_CG_Quad_AD_btest_build_vera
[ 94%] Checking style of test/system/Asymptotic/ErrorOrder_2D_CG_Quad_AD_btest.cpp
[ 94%] Built target ErrorOrder_2D_CG_Quad_AD_btest_build_vera
Scanning dependencies of target ErrorOrder_2D_CG_Quad_AD_btest_OBJECT
[ 94%] Building CXX object test/system/Asymptotic/CMakeFiles/ErrorOrder_2D_CG_Quad_AD_btest_OBJECT.dir/ErrorOrder_2D_CG_Quad_AD_btest.cpp.o
[ 94%] Built target ErrorOrder_2D_CG_Quad_AD_btest_OBJECT
Scanning dependencies of target ErrorOrder_2D_CG_Quad_AD_btest_build
[ 94%] Linking CXX executable ErrorOrder_2D_CG_Quad_AD_btest
[ 94%] Built target ErrorOrder_2D_CG_Quad_AD_btest_build
Scanning dependencies of target ErrorEstimateOrder_2D_DGBR2_Triangle_AD_btest_OBJECT
[ 94%] Building CXX object test/system/Asymptotic/CMakeFiles/ErrorEstimateOrder_2D_DGBR2_Triangle_AD_btest_OBJECT.dir/ErrorEstimateOrder_2D_DGBR2_Triangle_AD_btest.cpp.o
[ 94%] Built target ErrorEstimateOrder_2D_DGBR2_Triangle_AD_btest_OBJECT
Scanning dependencies of target ErrorEstimateOrder_2D_DGBR2_Triangle_AD_btest_build_vera
[ 94%] Checking style of test/system/Asymptotic/ErrorEstimateOrder_2D_DGBR2_Triangle_AD_btest.cpp
[ 94%] Built target ErrorEstimateOrder_2D_DGBR2_Triangle_AD_btest_build_vera
Scanning dependencies of target ErrorEstimateOrder_2D_DGBR2_Triangle_AD_btest_build
[ 94%] Linking CXX executable ErrorEstimateOrder_2D_DGBR2_Triangle_AD_btest
[ 94%] Built target ErrorEstimateOrder_2D_DGBR2_Triangle_AD_btest_build
Scanning dependencies of target ErrorOrder_2D_DGAdvective_Circle_Line_ShallowWater_btest_build_vera
[ 94%] Checking style of test/system/Asymptotic/ErrorOrder_2D_DGAdvective_Circle_Line_ShallowWater_btest.cpp
[ 94%] Built target ErrorOrder_2D_DGAdvective_Circle_Line_ShallowWater_btest_build_vera
Scanning dependencies of target ErrorOrder_2D_DGAdvective_Circle_Line_ShallowWater_btest_OBJECT
[ 94%] Building CXX object test/system/Asymptotic/CMakeFiles/ErrorOrder_2D_DGAdvective_Circle_Line_ShallowWater_btest_OBJECT.dir/ErrorOrder_2D_DGAdvective_Circle_Line_ShallowWater_btest.cpp.o
[ 94%] Built target ErrorOrder_2D_DGAdvective_Circle_Line_ShallowWater_btest_OBJECT
Scanning dependencies of target ErrorOrder_2D_DGAdvective_Circle_Line_ShallowWater_btest_build
[ 94%] Linking CXX executable ErrorOrder_2D_DGAdvective_Circle_Line_ShallowWater_btest
[ 94%] Built target ErrorOrder_2D_DGAdvective_Circle_Line_ShallowWater_btest_build
Scanning dependencies of target ErrorOrder_1D_DGAdvective_ShallowWater_btest_OBJECT
[ 94%] Building CXX object test/system/Asymptotic/CMakeFiles/ErrorOrder_1D_DGAdvective_ShallowWater_btest_OBJECT.dir/ErrorOrder_1D_DGAdvective_ShallowWater_btest.cpp.o
[ 94%] Built target ErrorOrder_1D_DGAdvective_ShallowWater_btest_OBJECT
Scanning dependencies of target ErrorOrder_1D_DGAdvective_ShallowWater_btest_build_vera
[ 94%] Checking style of test/system/Asymptotic/ErrorOrder_1D_DGAdvective_ShallowWater_btest.cpp
[ 94%] Built target ErrorOrder_1D_DGAdvective_ShallowWater_btest_build_vera
Scanning dependencies of target ErrorOrder_1D_DGAdvective_ShallowWater_btest_build
[ 94%] Linking CXX executable ErrorOrder_1D_DGAdvective_ShallowWater_btest
[ 94%] Built target ErrorOrder_1D_DGAdvective_ShallowWater_btest_build
Scanning dependencies of target LocalSolve1D_HDG_AD_btest_build_vera
[ 94%] Checking style of test/system/LocalSolve/LocalSolve1D_HDG_AD_btest.cpp
[ 94%] Built target LocalSolve1D_HDG_AD_btest_build_vera
[ 94%] Generating CXX unity source src/Discretization/cotire/BlockLib_CXX_unity.cxx
[ 94%] Generating CXX prefix source src/Discretization/cotire/BlockLib_CXX_prefix.cxx
[ 94%] Generating CXX prefix header src/Discretization/cotire/BlockLib_CXX_prefix.hxx
[ 94%] Building CXX precompiled header src/Discretization/cotire/BlockLib_CXX_prefix.hxx.gch
Scanning dependencies of target BlockLib
[ 94%] Building CXX object src/Discretization/CMakeFiles/BlockLib.dir/Block/AlgebraicEquationSet_Block2x2_Real_Real.cpp.o
[ 94%] Building CXX object src/Discretization/CMakeFiles/BlockLib.dir/Block/AlgebraicEquationSet_Block2x2_VecS3_Real.cpp.o
[ 94%] Building CXX object src/Discretization/CMakeFiles/BlockLib.dir/Block/AlgebraicEquationSet_Block2x2_VecS4_Real.cpp.o
[ 94%] Linking CXX static library libBlockLib.a
[ 94%] Built target BlockLib
Scanning dependencies of target BlockLinAlgLib_vera
[ 94%] Checking style of src/LinearAlgebra/BlockLinAlg/MatrixBlock_3x3.h
[ 94%] Checking style of src/LinearAlgebra/BlockLinAlg/MatrixBlock_2x2.h
[ 94%] Checking style of src/LinearAlgebra/BlockLinAlg/MatrixBlock_2x2_InverseLU.h
[ 94%] Checking style of src/LinearAlgebra/BlockLinAlg/MatrixBlock_2x2_Inverse.h
[ 94%] Checking style of src/LinearAlgebra/BlockLinAlg/BlockLinAlg_Type.h
[ 94%] Checking style of src/LinearAlgebra/BlockLinAlg/MatrixBlock_2x2_Decompose_LU.h
[ 94%] Checking style of src/LinearAlgebra/BlockLinAlg/VectorBlock_4.h
[ 94%] Checking style of src/LinearAlgebra/BlockLinAlg/MatrixBlock_2x2_Transpose.h
[ 94%] Checking style of src/LinearAlgebra/BlockLinAlg/MatrixBlock_2x2_InverseLUP.h
[ 94%] Checking style of src/LinearAlgebra/BlockLinAlg/MatrixBlock_4x4.h
[ 94%] Checking style of src/LinearAlgebra/BlockLinAlg/BlockLinAlg_Add.h
[ 94%] Checking style of src/LinearAlgebra/BlockLinAlg/BlockLinAlg_Mul.h
[ 94%] Checking style of src/LinearAlgebra/BlockLinAlg/MatrixBlock_2x2_Decompose_LUP.h
[ 94%] Checking style of src/LinearAlgebra/BlockLinAlg/VectorBlock_3.h
[ 94%] Checking style of src/LinearAlgebra/BlockLinAlg/VectorBlock_2.h
[ 94%] Checking style of src/LinearAlgebra/BlockLinAlg/MatrixBlock_2x2_InverseLUP.cpp
[ 94%] Checking style of src/LinearAlgebra/BlockLinAlg/MatrixBlock_2x2_Decompose_LUP.cpp
[ 94%] Checking style of src/LinearAlgebra/BlockLinAlg/MatrixBlock_2x2_Decompose_LU.cpp
[ 94%] Checking style of src/LinearAlgebra/BlockLinAlg/MatrixBlock_2x2_InverseLU.cpp
[ 94%] Built target BlockLinAlgLib_vera
[ 94%] Generating CXX unity source src/LinearAlgebra/BlockLinAlg/cotire/BlockLinAlgLib_CXX_unity.cxx
[ 94%] Generating CXX prefix source src/LinearAlgebra/BlockLinAlg/cotire/BlockLinAlgLib_CXX_prefix.cxx
[ 94%] Generating CXX prefix header src/LinearAlgebra/BlockLinAlg/cotire/BlockLinAlgLib_CXX_prefix.hxx
[ 94%] Building CXX precompiled header src/LinearAlgebra/BlockLinAlg/cotire/BlockLinAlgLib_CXX_prefix.hxx.gch
Scanning dependencies of target BlockLinAlgLib
[ 94%] Building CXX object src/LinearAlgebra/BlockLinAlg/CMakeFiles/BlockLinAlgLib.dir/MatrixBlock_2x2_Decompose_LU.cpp.o
[ 94%] Building CXX object src/LinearAlgebra/BlockLinAlg/CMakeFiles/BlockLinAlgLib.dir/MatrixBlock_2x2_Decompose_LUP.cpp.o
[ 94%] Building CXX object src/LinearAlgebra/BlockLinAlg/CMakeFiles/BlockLinAlgLib.dir/MatrixBlock_2x2_InverseLU.cpp.o
[ 94%] Building CXX object src/LinearAlgebra/BlockLinAlg/CMakeFiles/BlockLinAlgLib.dir/MatrixBlock_2x2_InverseLUP.cpp.o
[ 94%] Linking CXX static library libBlockLinAlgLib.a
[ 94%] Built target BlockLinAlgLib
Scanning dependencies of target pdeSensorLib_vera
[ 94%] Checking style of src/pde/Sensor/Sensor_ViscousFlux1D.h
[ 94%] Checking style of src/pde/Sensor/Source1D_JumpSensor.h
[ 94%] Checking style of src/pde/Sensor/BCSensorParameter2D.h
[ 94%] Checking style of src/pde/Sensor/Sensor_Source1D.h
[ 94%] Checking style of src/pde/Sensor/Source2D_JumpSensor.h
[ 94%] Checking style of src/pde/Sensor/Sensor_Source2D.h
[ 94%] Checking style of src/pde/Sensor/PDESensorParameter2D.h
[ 94%] Checking style of src/pde/Sensor/Sensor_AdvectiveFlux2D.h
[ 94%] Checking style of src/pde/Sensor/Sensor_ViscousFlux2D.h
[ 94%] Checking style of src/pde/Sensor/BCSensorParameter1D.h
[ 94%] Checking style of src/pde/Sensor/SensorParameter_Traits.h
[ 94%] Checking style of src/pde/Sensor/PDESensorParameter1D.h
[ 97%] Checking style of src/pde/Sensor/Sensor_AdvectiveFlux1D.h
[ 97%] Checking style of src/pde/Sensor/Sensor_ViscousFlux1D.cpp
[ 97%] Checking style of src/pde/Sensor/Sensor_ViscousFlux2D.cpp
[ 97%] Checking style of src/pde/Sensor/Sensor_AdvectiveFlux1D.cpp
[ 97%] Checking style of src/pde/Sensor/PDESensorParameter1D.cpp
[ 97%] Checking style of src/pde/Sensor/Sensor_AdvectiveFlux2D.cpp
[ 97%] Checking style of src/pde/Sensor/BCSensorParameter2D.cpp
[ 97%] Checking style of src/pde/Sensor/BCSensorParameter1D.cpp
[ 97%] Checking style of src/pde/Sensor/PDESensorParameter2D.cpp
[ 97%] Built target pdeSensorLib_vera
[ 97%] Generating CXX unity source src/pde/Sensor/cotire/pdeSensorLib_CXX_unity.cxx
[ 97%] Generating CXX prefix source src/pde/Sensor/cotire/pdeSensorLib_CXX_prefix.cxx
[ 97%] Generating CXX prefix header src/pde/Sensor/cotire/pdeSensorLib_CXX_prefix.hxx
[ 97%] Building CXX precompiled header src/pde/Sensor/cotire/pdeSensorLib_CXX_prefix.hxx.gch
Scanning dependencies of target pdeSensorLib
[ 97%] Building CXX object src/pde/Sensor/CMakeFiles/pdeSensorLib.dir/BCSensorParameter1D.cpp.o
[ 97%] Building CXX object src/pde/Sensor/CMakeFiles/pdeSensorLib.dir/BCSensorParameter2D.cpp.o
[ 97%] Building CXX object src/pde/Sensor/CMakeFiles/pdeSensorLib.dir/PDESensorParameter1D.cpp.o
[ 97%] Building CXX object src/pde/Sensor/CMakeFiles/pdeSensorLib.dir/PDESensorParameter2D.cpp.o
[ 97%] Building CXX object src/pde/Sensor/CMakeFiles/pdeSensorLib.dir/Sensor_AdvectiveFlux1D.cpp.o
[ 97%] Building CXX object src/pde/Sensor/CMakeFiles/pdeSensorLib.dir/Sensor_AdvectiveFlux2D.cpp.o
[ 97%] Building CXX object src/pde/Sensor/CMakeFiles/pdeSensorLib.dir/Sensor_ViscousFlux1D.cpp.o
[ 97%] Building CXX object src/pde/Sensor/CMakeFiles/pdeSensorLib.dir/Sensor_ViscousFlux2D.cpp.o
[ 97%] Linking CXX static library libpdeSensorLib.a
[ 97%] Built target pdeSensorLib
Scanning dependencies of target LocalSolve1D_HDG_AD_btest_OBJECT
[ 97%] Building CXX object test/system/LocalSolve/CMakeFiles/LocalSolve1D_HDG_AD_btest_OBJECT.dir/LocalSolve1D_HDG_AD_btest.cpp.o
[ 97%] Built target LocalSolve1D_HDG_AD_btest_OBJECT
Scanning dependencies of target LocalSolve1D_HDG_AD_btest_build
[ 97%] Linking CXX executable LocalSolve1D_HDG_AD_btest
[ 97%] Built target LocalSolve1D_HDG_AD_btest_build
Scanning dependencies of target LocalSolve1D_Split_HDG_AD_btest_build_vera
[ 97%] Checking style of test/system/LocalSolve/LocalSolve1D_Split_HDG_AD_btest.cpp
[ 97%] Built target LocalSolve1D_Split_HDG_AD_btest_build_vera
Scanning dependencies of target LocalSolve1D_Split_HDG_AD_btest_OBJECT
[ 97%] Building CXX object test/system/LocalSolve/CMakeFiles/LocalSolve1D_Split_HDG_AD_btest_OBJECT.dir/LocalSolve1D_Split_HDG_AD_btest.cpp.o
[ 97%] Built target LocalSolve1D_Split_HDG_AD_btest_OBJECT
Scanning dependencies of target LocalSolve1D_Split_HDG_AD_btest_build
[ 97%] Linking CXX executable LocalSolve1D_Split_HDG_AD_btest
[ 97%] Built target LocalSolve1D_Split_HDG_AD_btest_build
Scanning dependencies of target LocalSolve2D_Split_DGBR2_Triangle_AD_AV_btest_build_vera
[ 97%] Checking style of test/system/LocalSolve/LocalSolve2D_Split_DGBR2_Triangle_AD_AV_btest.cpp
[ 97%] Built target LocalSolve2D_Split_DGBR2_Triangle_AD_AV_btest_build_vera
Scanning dependencies of target LocalSolve2D_Split_DGBR2_Triangle_AD_AV_btest_OBJECT
[ 97%] Building CXX object test/system/LocalSolve/CMakeFiles/LocalSolve2D_Split_DGBR2_Triangle_AD_AV_btest_OBJECT.dir/LocalSolve2D_Split_DGBR2_Triangle_AD_AV_btest.cpp.o
[ 97%] Built target LocalSolve2D_Split_DGBR2_Triangle_AD_AV_btest_OBJECT
Scanning dependencies of target LocalSolve2D_Split_DGBR2_Triangle_AD_AV_btest_build
[ 97%] Linking CXX executable LocalSolve2D_Split_DGBR2_Triangle_AD_AV_btest
[ 97%] Built target LocalSolve2D_Split_DGBR2_Triangle_AD_AV_btest_build
Scanning dependencies of target LocalSolve1D_Split_DGBR2_AD_btest_build_vera
[ 97%] Checking style of test/system/LocalSolve/LocalSolve1D_Split_DGBR2_AD_btest.cpp
[ 97%] Built target LocalSolve1D_Split_DGBR2_AD_btest_build_vera
Scanning dependencies of target LocalSolve1D_Split_DGBR2_AD_btest_OBJECT
[ 97%] Building CXX object test/system/LocalSolve/CMakeFiles/LocalSolve1D_Split_DGBR2_AD_btest_OBJECT.dir/LocalSolve1D_Split_DGBR2_AD_btest.cpp.o
[ 97%] Built target LocalSolve1D_Split_DGBR2_AD_btest_OBJECT
Scanning dependencies of target LocalSolve1D_Split_DGBR2_AD_btest_build
[ 97%] Linking CXX executable LocalSolve1D_Split_DGBR2_AD_btest
[ 97%] Built target LocalSolve1D_Split_DGBR2_AD_btest_build
Scanning dependencies of target EdgeLocalSolve2D_Dual_Galerkin_Stabilized_Euler_btest_build_vera
[ 97%] Checking style of test/system/LocalSolve/EdgeLocalSolve2D_Dual_Galerkin_Stabilized_Euler_btest.cpp
[ 97%] Built target EdgeLocalSolve2D_Dual_Galerkin_Stabilized_Euler_btest_build_vera
Scanning dependencies of target EdgeLocalSolve2D_Dual_Galerkin_Stabilized_Euler_btest_OBJECT
[ 97%] Building CXX object test/system/LocalSolve/CMakeFiles/EdgeLocalSolve2D_Dual_Galerkin_Stabilized_Euler_btest_OBJECT.dir/EdgeLocalSolve2D_Dual_Galerkin_Stabilized_Euler_btest.cpp.o
[ 97%] Built target EdgeLocalSolve2D_Dual_Galerkin_Stabilized_Euler_btest_OBJECT
Scanning dependencies of target EdgeLocalSolve2D_Dual_Galerkin_Stabilized_Euler_btest_build
[ 97%] Linking CXX executable EdgeLocalSolve2D_Dual_Galerkin_Stabilized_Euler_btest
[ 97%] Built target EdgeLocalSolve2D_Dual_Galerkin_Stabilized_Euler_btest_build
Scanning dependencies of target ElementDualLocalSolve2D_Galerkin_Stabilized_Triangle_AD_btest_build_vera
[ 97%] Checking style of test/system/LocalSolve/ElementDualLocalSolve2D_Galerkin_Stabilized_Triangle_AD_btest.cpp
[ 97%] Built target ElementDualLocalSolve2D_Galerkin_Stabilized_Triangle_AD_btest_build_vera
Scanning dependencies of target ElementDualLocalSolve2D_Galerkin_Stabilized_Triangle_AD_btest_OBJECT
[ 97%] Building CXX object test/system/LocalSolve/CMakeFiles/ElementDualLocalSolve2D_Galerkin_Stabilized_Triangle_AD_btest_OBJECT.dir/ElementDualLocalSolve2D_Galerkin_Stabilized_Triangle_AD_btest.cpp.o
[ 97%] Built target ElementDualLocalSolve2D_Galerkin_Stabilized_Triangle_AD_btest_OBJECT
Scanning dependencies of target ElementDualLocalSolve2D_Galerkin_Stabilized_Triangle_AD_btest_build
[ 97%] Linking CXX executable ElementDualLocalSolve2D_Galerkin_Stabilized_Triangle_AD_btest
[ 97%] Built target ElementDualLocalSolve2D_Galerkin_Stabilized_Triangle_AD_btest_build
Scanning dependencies of target EdgeLocalSolve2D_Dual_Galerkin_Stabilized_AR_btest_OBJECT
[ 97%] Building CXX object test/system/LocalSolve/CMakeFiles/EdgeLocalSolve2D_Dual_Galerkin_Stabilized_AR_btest_OBJECT.dir/EdgeLocalSolve2D_Dual_Galerkin_Stabilized_AR_btest.cpp.o
[ 97%] Built target EdgeLocalSolve2D_Dual_Galerkin_Stabilized_AR_btest_OBJECT
Scanning dependencies of target EdgeLocalSolve2D_Dual_Galerkin_Stabilized_AR_btest_build_vera
[ 97%] Checking style of test/system/LocalSolve/EdgeLocalSolve2D_Dual_Galerkin_Stabilized_AR_btest.cpp
[ 97%] Built target EdgeLocalSolve2D_Dual_Galerkin_Stabilized_AR_btest_build_vera
Scanning dependencies of target EdgeLocalSolve2D_Dual_Galerkin_Stabilized_AR_btest_build
[ 97%] Linking CXX executable EdgeLocalSolve2D_Dual_Galerkin_Stabilized_AR_btest
[ 97%] Built target EdgeLocalSolve2D_Dual_Galerkin_Stabilized_AR_btest_build
Scanning dependencies of target AlgebraicEquationSet_Local_VMSD_Triangle_AD_btest_OBJECT
[ 97%] Building CXX object test/system/LocalSolve/CMakeFiles/AlgebraicEquationSet_Local_VMSD_Triangle_AD_btest_OBJECT.dir/AlgebraicEquationSet_Local_VMSD_Triangle_AD_btest.cpp.o
[ 97%] Built target AlgebraicEquationSet_Local_VMSD_Triangle_AD_btest_OBJECT
Scanning dependencies of target AlgebraicEquationSet_Local_VMSD_Triangle_AD_btest_build_vera
[ 97%] Checking style of test/system/LocalSolve/AlgebraicEquationSet_Local_VMSD_Triangle_AD_btest.cpp
[ 97%] Built target AlgebraicEquationSet_Local_VMSD_Triangle_AD_btest_build_vera
Scanning dependencies of target AlgebraicEquationSet_Local_VMSD_Triangle_AD_btest_build
[ 97%] Linking CXX executable AlgebraicEquationSet_Local_VMSD_Triangle_AD_btest
[ 97%] Built target AlgebraicEquationSet_Local_VMSD_Triangle_AD_btest_build
Scanning dependencies of target LocalSolve3D_HDG_Tet_AD_btest_build_vera
[ 97%] Checking style of test/system/LocalSolve/LocalSolve3D_HDG_Tet_AD_btest.cpp
[ 97%] Built target LocalSolve3D_HDG_Tet_AD_btest_build_vera
Scanning dependencies of target LocalSolve3D_HDG_Tet_AD_btest_OBJECT
[ 97%] Building CXX object test/system/LocalSolve/CMakeFiles/LocalSolve3D_HDG_Tet_AD_btest_OBJECT.dir/LocalSolve3D_HDG_Tet_AD_btest.cpp.o
[ 97%] Built target LocalSolve3D_HDG_Tet_AD_btest_OBJECT
Scanning dependencies of target LocalSolve3D_HDG_Tet_AD_btest_build
[ 97%] Linking CXX executable LocalSolve3D_HDG_Tet_AD_btest
[ 97%] Built target LocalSolve3D_HDG_Tet_AD_btest_build
Scanning dependencies of target ElementLocalSolve3D_DGBR2_Tet_AD_btest_build_vera
[ 97%] Checking style of test/system/LocalSolve/ElementLocalSolve3D_DGBR2_Tet_AD_btest.cpp
[ 97%] Built target ElementLocalSolve3D_DGBR2_Tet_AD_btest_build_vera
Scanning dependencies of target ElementLocalSolve3D_DGBR2_Tet_AD_btest_OBJECT
[ 97%] Building CXX object test/system/LocalSolve/CMakeFiles/ElementLocalSolve3D_DGBR2_Tet_AD_btest_OBJECT.dir/ElementLocalSolve3D_DGBR2_Tet_AD_btest.cpp.o
[ 97%] Built target ElementLocalSolve3D_DGBR2_Tet_AD_btest_OBJECT
Scanning dependencies of target ElementLocalSolve3D_DGBR2_Tet_AD_btest_build
[ 97%] Linking CXX executable ElementLocalSolve3D_DGBR2_Tet_AD_btest
[ 97%] Built target ElementLocalSolve3D_DGBR2_Tet_AD_btest_build
Scanning dependencies of target LocalSolve2D_HDG_Triangle_AD_btest_build_vera
[ 97%] Checking style of test/system/LocalSolve/LocalSolve2D_HDG_Triangle_AD_btest.cpp
[ 97%] Built target LocalSolve2D_HDG_Triangle_AD_btest_build_vera
Scanning dependencies of target LocalSolve2D_HDG_Triangle_AD_btest_OBJECT
[ 97%] Building CXX object test/system/LocalSolve/CMakeFiles/LocalSolve2D_HDG_Triangle_AD_btest_OBJECT.dir/LocalSolve2D_HDG_Triangle_AD_btest.cpp.o
[ 97%] Built target LocalSolve2D_HDG_Triangle_AD_btest_OBJECT
Scanning dependencies of target LocalSolve2D_HDG_Triangle_AD_btest_build
[ 97%] Linking CXX executable LocalSolve2D_HDG_Triangle_AD_btest
[ 97%] Built target LocalSolve2D_HDG_Triangle_AD_btest_build
Scanning dependencies of target EdgeLocalSolve3D_Dual_Galerkin_Stabilized_AD_btest_OBJECT
[ 97%] Building CXX object test/system/LocalSolve/CMakeFiles/EdgeLocalSolve3D_Dual_Galerkin_Stabilized_AD_btest_OBJECT.dir/EdgeLocalSolve3D_Dual_Galerkin_Stabilized_AD_btest.cpp.o
[ 97%] Built target EdgeLocalSolve3D_Dual_Galerkin_Stabilized_AD_btest_OBJECT
Scanning dependencies of target EdgeLocalSolve3D_Dual_Galerkin_Stabilized_AD_btest_build_vera
[ 97%] Checking style of test/system/LocalSolve/EdgeLocalSolve3D_Dual_Galerkin_Stabilized_AD_btest.cpp
[ 97%] Built target EdgeLocalSolve3D_Dual_Galerkin_Stabilized_AD_btest_build_vera
Scanning dependencies of target EdgeLocalSolve3D_Dual_Galerkin_Stabilized_AD_btest_build
[ 97%] Linking CXX executable EdgeLocalSolve3D_Dual_Galerkin_Stabilized_AD_btest
[ 97%] Built target EdgeLocalSolve3D_Dual_Galerkin_Stabilized_AD_btest_build
Scanning dependencies of target LocalSolve3D_Split_HDG_Tet_AD_btest_build_vera
[ 97%] Checking style of test/system/LocalSolve/LocalSolve3D_Split_HDG_Tet_AD_btest.cpp
[ 97%] Built target LocalSolve3D_Split_HDG_Tet_AD_btest_build_vera
Scanning dependencies of target LocalSolve3D_Split_HDG_Tet_AD_btest_OBJECT
[ 97%] Building CXX object test/system/LocalSolve/CMakeFiles/LocalSolve3D_Split_HDG_Tet_AD_btest_OBJECT.dir/LocalSolve3D_Split_HDG_Tet_AD_btest.cpp.o
[ 97%] Built target LocalSolve3D_Split_HDG_Tet_AD_btest_OBJECT
Scanning dependencies of target LocalSolve3D_Split_HDG_Tet_AD_btest_build
[ 97%] Linking CXX executable LocalSolve3D_Split_HDG_Tet_AD_btest
[ 97%] Built target LocalSolve3D_Split_HDG_Tet_AD_btest_build
Scanning dependencies of target LocalSolve2D_Split_HDG_Triangle_AD_btest_OBJECT
[ 97%] Building CXX object test/system/LocalSolve/CMakeFiles/LocalSolve2D_Split_HDG_Triangle_AD_btest_OBJECT.dir/LocalSolve2D_Split_HDG_Triangle_AD_btest.cpp.o
[ 97%] Built target LocalSolve2D_Split_HDG_Triangle_AD_btest_OBJECT
Scanning dependencies of target LocalSolve2D_Split_HDG_Triangle_AD_btest_build_vera
[ 97%] Checking style of test/system/LocalSolve/LocalSolve2D_Split_HDG_Triangle_AD_btest.cpp
[ 97%] Built target LocalSolve2D_Split_HDG_Triangle_AD_btest_build_vera
Scanning dependencies of target LocalSolve2D_Split_HDG_Triangle_AD_btest_build
[ 97%] Linking CXX executable LocalSolve2D_Split_HDG_Triangle_AD_btest
[ 97%] Built target LocalSolve2D_Split_HDG_Triangle_AD_btest_build
Scanning dependencies of target ElementDualLocalSolve3D_Galerkin_Stabilized_Triangle_AD_btest_OBJECT
[ 97%] Building CXX object test/system/LocalSolve/CMakeFiles/ElementDualLocalSolve3D_Galerkin_Stabilized_Triangle_AD_btest_OBJECT.dir/ElementDualLocalSolve3D_Galerkin_Stabilized_Triangle_AD_btest.cpp.o
[ 97%] Built target ElementDualLocalSolve3D_Galerkin_Stabilized_Triangle_AD_btest_OBJECT
Scanning dependencies of target ElementDualLocalSolve3D_Galerkin_Stabilized_Triangle_AD_btest_build_vera
[ 97%] Checking style of test/system/LocalSolve/ElementDualLocalSolve3D_Galerkin_Stabilized_Triangle_AD_btest.cpp
[ 97%] Built target ElementDualLocalSolve3D_Galerkin_Stabilized_Triangle_AD_btest_build_vera
Scanning dependencies of target ElementDualLocalSolve3D_Galerkin_Stabilized_Triangle_AD_btest_build
[ 97%] Linking CXX executable ElementDualLocalSolve3D_Galerkin_Stabilized_Triangle_AD_btest
[ 97%] Built target ElementDualLocalSolve3D_Galerkin_Stabilized_Triangle_AD_btest_build
Scanning dependencies of target ElementLocalSolve2D_DGBR2_Triangle_AD_btest_OBJECT
[ 97%] Building CXX object test/system/LocalSolve/CMakeFiles/ElementLocalSolve2D_DGBR2_Triangle_AD_btest_OBJECT.dir/ElementLocalSolve2D_DGBR2_Triangle_AD_btest.cpp.o
[ 97%] Built target ElementLocalSolve2D_DGBR2_Triangle_AD_btest_OBJECT
Scanning dependencies of target ElementLocalSolve2D_DGBR2_Triangle_AD_btest_build_vera
[ 97%] Checking style of test/system/LocalSolve/ElementLocalSolve2D_DGBR2_Triangle_AD_btest.cpp
[ 97%] Built target ElementLocalSolve2D_DGBR2_Triangle_AD_btest_build_vera
Scanning dependencies of target ElementLocalSolve2D_DGBR2_Triangle_AD_btest_build
[ 97%] Linking CXX executable ElementLocalSolve2D_DGBR2_Triangle_AD_btest
[ 97%] Built target ElementLocalSolve2D_DGBR2_Triangle_AD_btest_build
Scanning dependencies of target EdgeLocalSolve2D_Dual_Galerkin_Stabilized_AD_btest_build_vera
[ 97%] Checking style of test/system/LocalSolve/EdgeLocalSolve2D_Dual_Galerkin_Stabilized_AD_btest.cpp
[ 97%] Built target EdgeLocalSolve2D_Dual_Galerkin_Stabilized_AD_btest_build_vera
Scanning dependencies of target EdgeLocalSolve2D_Dual_Galerkin_Stabilized_AD_btest_OBJECT
[ 97%] Building CXX object test/system/LocalSolve/CMakeFiles/EdgeLocalSolve2D_Dual_Galerkin_Stabilized_AD_btest_OBJECT.dir/EdgeLocalSolve2D_Dual_Galerkin_Stabilized_AD_btest.cpp.o
[ 97%] Built target EdgeLocalSolve2D_Dual_Galerkin_Stabilized_AD_btest_OBJECT
Scanning dependencies of target EdgeLocalSolve2D_Dual_Galerkin_Stabilized_AD_btest_build
[ 97%] Linking CXX executable EdgeLocalSolve2D_Dual_Galerkin_Stabilized_AD_btest
[ 97%] Built target EdgeLocalSolve2D_Dual_Galerkin_Stabilized_AD_btest_build
Scanning dependencies of target ElementLocalSolve1D_DGBR2_Triangle_AD_btest_build_vera
[ 97%] Checking style of test/system/LocalSolve/ElementLocalSolve1D_DGBR2_Triangle_AD_btest.cpp
[ 97%] Built target ElementLocalSolve1D_DGBR2_Triangle_AD_btest_build_vera
Scanning dependencies of target ElementLocalSolve1D_DGBR2_Triangle_AD_btest_OBJECT
[ 97%] Building CXX object test/system/LocalSolve/CMakeFiles/ElementLocalSolve1D_DGBR2_Triangle_AD_btest_OBJECT.dir/ElementLocalSolve1D_DGBR2_Triangle_AD_btest.cpp.o
[ 97%] Built target ElementLocalSolve1D_DGBR2_Triangle_AD_btest_OBJECT
Scanning dependencies of target ElementLocalSolve1D_DGBR2_Triangle_AD_btest_build
[ 97%] Linking CXX executable ElementLocalSolve1D_DGBR2_Triangle_AD_btest
[ 97%] Built target ElementLocalSolve1D_DGBR2_Triangle_AD_btest_build
Scanning dependencies of target AlgebraicEquationSet_Local_VMSDBR2_Triangle_AD_btest_build_vera
[ 97%] Checking style of test/system/LocalSolve/AlgebraicEquationSet_Local_VMSDBR2_Triangle_AD_btest.cpp
[ 97%] Built target AlgebraicEquationSet_Local_VMSDBR2_Triangle_AD_btest_build_vera
Scanning dependencies of target AlgebraicEquationSet_Local_VMSDBR2_Triangle_AD_btest_OBJECT
[ 97%] Building CXX object test/system/LocalSolve/CMakeFiles/AlgebraicEquationSet_Local_VMSDBR2_Triangle_AD_btest_OBJECT.dir/AlgebraicEquationSet_Local_VMSDBR2_Triangle_AD_btest.cpp.o
[ 97%] Built target AlgebraicEquationSet_Local_VMSDBR2_Triangle_AD_btest_OBJECT
Scanning dependencies of target AlgebraicEquationSet_Local_VMSDBR2_Triangle_AD_btest_build
[ 97%] Linking CXX executable AlgebraicEquationSet_Local_VMSDBR2_Triangle_AD_btest
[ 97%] Built target AlgebraicEquationSet_Local_VMSDBR2_Triangle_AD_btest_build
Scanning dependencies of target ElementLocalSolve3D_DGAdvective_Tet_AD_btest_OBJECT
[ 97%] Building CXX object test/system/LocalSolve/CMakeFiles/ElementLocalSolve3D_DGAdvective_Tet_AD_btest_OBJECT.dir/ElementLocalSolve3D_DGAdvective_Tet_AD_btest.cpp.o
[ 97%] Built target ElementLocalSolve3D_DGAdvective_Tet_AD_btest_OBJECT
Scanning dependencies of target ElementLocalSolve3D_DGAdvective_Tet_AD_btest_build_vera
[ 97%] Checking style of test/system/LocalSolve/ElementLocalSolve3D_DGAdvective_Tet_AD_btest.cpp
[ 97%] Built target ElementLocalSolve3D_DGAdvective_Tet_AD_btest_build_vera
Scanning dependencies of target ElementLocalSolve3D_DGAdvective_Tet_AD_btest_build
[ 97%] Linking CXX executable ElementLocalSolve3D_DGAdvective_Tet_AD_btest
[ 97%] Built target ElementLocalSolve3D_DGAdvective_Tet_AD_btest_build
Scanning dependencies of target EdgeLocalSolve1D_Dual_Galerkin_Stabilized_Line_AD_btest_build_vera
[ 97%] Checking style of test/system/LocalSolve/EdgeLocalSolve1D_Dual_Galerkin_Stabilized_Line_AD_btest.cpp
[ 97%] Built target EdgeLocalSolve1D_Dual_Galerkin_Stabilized_Line_AD_btest_build_vera
Scanning dependencies of target EdgeLocalSolve1D_Dual_Galerkin_Stabilized_Line_AD_btest_OBJECT
[ 97%] Building CXX object test/system/LocalSolve/CMakeFiles/EdgeLocalSolve1D_Dual_Galerkin_Stabilized_Line_AD_btest_OBJECT.dir/EdgeLocalSolve1D_Dual_Galerkin_Stabilized_Line_AD_btest.cpp.o
[ 97%] Built target EdgeLocalSolve1D_Dual_Galerkin_Stabilized_Line_AD_btest_OBJECT
Scanning dependencies of target EdgeLocalSolve1D_Dual_Galerkin_Stabilized_Line_AD_btest_build
[ 97%] Linking CXX executable EdgeLocalSolve1D_Dual_Galerkin_Stabilized_Line_AD_btest
[ 97%] Built target EdgeLocalSolve1D_Dual_Galerkin_Stabilized_Line_AD_btest_build
Scanning dependencies of target Block_1D_Decoupled_AD_btest_build_vera
[ 97%] Checking style of test/system/BlockSolve/Block_1D_Decoupled_AD_btest.cpp
[ 97%] Built target Block_1D_Decoupled_AD_btest_build_vera
Scanning dependencies of target Block_1D_Decoupled_AD_btest_OBJECT
[ 97%] Building CXX object test/system/BlockSolve/CMakeFiles/Block_1D_Decoupled_AD_btest_OBJECT.dir/Block_1D_Decoupled_AD_btest.cpp.o
[ 97%] Built target Block_1D_Decoupled_AD_btest_OBJECT
Scanning dependencies of target Block_1D_Decoupled_AD_btest_build
[ 97%] Linking CXX executable Block_1D_Decoupled_AD_btest
[ 97%] Built target Block_1D_Decoupled_AD_btest_build
Scanning dependencies of target Block_1D_Decoupled_Burgers_btest_OBJECT
[ 97%] Building CXX object test/system/BlockSolve/CMakeFiles/Block_1D_Decoupled_Burgers_btest_OBJECT.dir/Block_1D_Decoupled_Burgers_btest.cpp.o
[ 97%] Built target Block_1D_Decoupled_Burgers_btest_OBJECT
Scanning dependencies of target Block_1D_Decoupled_Burgers_btest_build_vera
[ 97%] Checking style of test/system/BlockSolve/Block_1D_Decoupled_Burgers_btest.cpp
[ 97%] Built target Block_1D_Decoupled_Burgers_btest_build_vera
Scanning dependencies of target Block_1D_Decoupled_Burgers_btest_build
[ 97%] Linking CXX executable Block_1D_Decoupled_Burgers_btest
[ 97%] Built target Block_1D_Decoupled_Burgers_btest_build
Scanning dependencies of target AnalyticSolve2D_DGAdvective_Triangle_Euler_UniformStream_btest_build_vera
[ 97%] Checking style of test/system/AnalyticSolve/AnalyticSolve2D_DGAdvective_Triangle_Euler_UniformStream_btest.cpp
[ 97%] Built target AnalyticSolve2D_DGAdvective_Triangle_Euler_UniformStream_btest_build_vera
[ 97%] Generating CXX unity source src/Discretization/cotire/DGBR2NSLib_CXX_unity.cxx
[ 97%] Generating CXX prefix source src/Discretization/cotire/DGBR2NSLib_CXX_prefix.cxx
[ 97%] Generating CXX prefix header src/Discretization/cotire/DGBR2NSLib_CXX_prefix.hxx
[ 97%] Building CXX precompiled header src/Discretization/cotire/DGBR2NSLib_CXX_prefix.hxx.gch
Scanning dependencies of target DGBR2NSLib
[ 97%] Building CXX object src/Discretization/CMakeFiles/DGBR2NSLib.dir/DG/DGBR2_Instantiate/AlgebraicEquationSet_DGBR2_NavierStokes2D_ConservativeConstVisc.cpp.o
[ 97%] Building CXX object src/Discretization/CMakeFiles/DGBR2NSLib.dir/DG/DGBR2_Instantiate/AlgebraicEquationSet_DGBR2_NavierStokes2D_PrimitiveConstVisc.cpp.o
[ 97%] Building CXX object src/Discretization/CMakeFiles/DGBR2NSLib.dir/DG/DGBR2_Instantiate/AlgebraicEquationSet_DGBR2_NavierStokes3D_PrimitiveConstVisc.cpp.o
[ 97%] Building CXX object src/Discretization/CMakeFiles/DGBR2NSLib.dir/DG/DGBR2_Instantiate/AlgebraicEquationSet_DGBR2_NavierStokes3D_PrimitiveSutherland.cpp.o
[ 97%] Building CXX object src/Discretization/CMakeFiles/DGBR2NSLib.dir/DG/DGBR2_Instantiate/AlgebraicEquationSet_DGBR2_NavierStokes3D_SurrogateSutherland.cpp.o
[ 97%] Linking CXX static library libDGBR2NSLib.a
[ 97%] Built target DGBR2NSLib
Scanning dependencies of target AnalyticSolve2D_DGAdvective_Triangle_Euler_UniformStream_btest_OBJECT
[ 97%] Building CXX object test/system/AnalyticSolve/CMakeFiles/AnalyticSolve2D_DGAdvective_Triangle_Euler_UniformStream_btest_OBJECT.dir/AnalyticSolve2D_DGAdvective_Triangle_Euler_UniformStream_btest.cpp.o
[ 97%] Built target AnalyticSolve2D_DGAdvective_Triangle_Euler_UniformStream_btest_OBJECT
Scanning dependencies of target AnalyticSolve2D_DGAdvective_Triangle_Euler_UniformStream_btest_build
[ 97%] Linking CXX executable AnalyticSolve2D_DGAdvective_Triangle_Euler_UniformStream_btest
[ 97%] Built target AnalyticSolve2D_DGAdvective_Triangle_Euler_UniformStream_btest_build
Scanning dependencies of target AnalyticSolve2D_DGBR2_Triangle_NavierStokes_UniformStream_btest_build_vera
[ 97%] Checking style of test/system/AnalyticSolve/AnalyticSolve2D_DGBR2_Triangle_NavierStokes_UniformStream_btest.cpp
[ 97%] Built target AnalyticSolve2D_DGBR2_Triangle_NavierStokes_UniformStream_btest_build_vera
Scanning dependencies of target AnalyticSolve2D_DGBR2_Triangle_NavierStokes_UniformStream_btest_OBJECT
[ 97%] Building CXX object test/system/AnalyticSolve/CMakeFiles/AnalyticSolve2D_DGBR2_Triangle_NavierStokes_UniformStream_btest_OBJECT.dir/AnalyticSolve2D_DGBR2_Triangle_NavierStokes_UniformStream_btest.cpp.o
[ 97%] Built target AnalyticSolve2D_DGBR2_Triangle_NavierStokes_UniformStream_btest_OBJECT
Scanning dependencies of target AnalyticSolve2D_DGBR2_Triangle_NavierStokes_UniformStream_btest_build
[ 97%] Linking CXX executable AnalyticSolve2D_DGBR2_Triangle_NavierStokes_UniformStream_btest
[ 97%] Built target AnalyticSolve2D_DGBR2_Triangle_NavierStokes_UniformStream_btest_build
Scanning dependencies of target AnalyticSolve2D_HDG_Triangle_NavierStokes_btest_build_vera
[ 97%] Checking style of test/system/AnalyticSolve/AnalyticSolve2D_HDG_Triangle_NavierStokes_btest.cpp
[ 97%] Built target AnalyticSolve2D_HDG_Triangle_NavierStokes_btest_build_vera
Scanning dependencies of target AnalyticSolve2D_HDG_Triangle_NavierStokes_btest_OBJECT
[ 97%] Building CXX object test/system/AnalyticSolve/CMakeFiles/AnalyticSolve2D_HDG_Triangle_NavierStokes_btest_OBJECT.dir/AnalyticSolve2D_HDG_Triangle_NavierStokes_btest.cpp.o
[ 97%] Built target AnalyticSolve2D_HDG_Triangle_NavierStokes_btest_OBJECT
Scanning dependencies of target AnalyticSolve2D_HDG_Triangle_NavierStokes_btest_build
[ 97%] Linking CXX executable AnalyticSolve2D_HDG_Triangle_NavierStokes_btest
[ 97%] Built target AnalyticSolve2D_HDG_Triangle_NavierStokes_btest_build
Scanning dependencies of target AnalyticSolve2D_DGAdvective_IBL_StagnationFlow_LamiBL_btest_OBJECT
[ 97%] Building CXX object test/system/AnalyticSolve/CMakeFiles/AnalyticSolve2D_DGAdvective_IBL_StagnationFlow_LamiBL_btest_OBJECT.dir/AnalyticSolve2D_DGAdvective_IBL_StagnationFlow_LamiBL_btest.cpp.o
[ 97%] Built target AnalyticSolve2D_DGAdvective_IBL_StagnationFlow_LamiBL_btest_OBJECT
Scanning dependencies of target AnalyticSolve2D_DGAdvective_IBL_StagnationFlow_LamiBL_btest_build_vera
[ 97%] Checking style of test/system/AnalyticSolve/AnalyticSolve2D_DGAdvective_IBL_StagnationFlow_LamiBL_btest.cpp
[ 97%] Built target AnalyticSolve2D_DGAdvective_IBL_StagnationFlow_LamiBL_btest_build_vera
Scanning dependencies of target AnalyticSolve2D_DGAdvective_IBL_StagnationFlow_LamiBL_btest_build
[ 97%] Linking CXX executable AnalyticSolve2D_DGAdvective_IBL_StagnationFlow_LamiBL_btest
[ 97%] Built target AnalyticSolve2D_DGAdvective_IBL_StagnationFlow_LamiBL_btest_build
Scanning dependencies of target AnalyticSolve2D_DGAdvective_IBL_StagnationFlow_SingleElem_LamiBL_btest_OBJECT
[ 97%] Building CXX object test/system/AnalyticSolve/CMakeFiles/AnalyticSolve2D_DGAdvective_IBL_StagnationFlow_SingleElem_LamiBL_btest_OBJECT.dir/AnalyticSolve2D_DGAdvective_IBL_StagnationFlow_SingleElem_LamiBL_btest.cpp.o
[ 97%] Built target AnalyticSolve2D_DGAdvective_IBL_StagnationFlow_SingleElem_LamiBL_btest_OBJECT
Scanning dependencies of target AnalyticSolve2D_DGAdvective_IBL_StagnationFlow_SingleElem_LamiBL_btest_build_vera
[ 97%] Checking style of test/system/AnalyticSolve/AnalyticSolve2D_DGAdvective_IBL_StagnationFlow_SingleElem_LamiBL_btest.cpp
[ 97%] Built target AnalyticSolve2D_DGAdvective_IBL_StagnationFlow_SingleElem_LamiBL_btest_build_vera
Scanning dependencies of target AnalyticSolve2D_DGAdvective_IBL_StagnationFlow_SingleElem_LamiBL_btest_build
[ 97%] Linking CXX executable AnalyticSolve2D_DGAdvective_IBL_StagnationFlow_SingleElem_LamiBL_btest
[ 97%] Built target AnalyticSolve2D_DGAdvective_IBL_StagnationFlow_SingleElem_LamiBL_btest_build
Scanning dependencies of target AnalyticSolve2D_HDG_Triangle_NavierStokes_UniformStream_btest_OBJECT
[ 97%] Building CXX object test/system/AnalyticSolve/CMakeFiles/AnalyticSolve2D_HDG_Triangle_NavierStokes_UniformStream_btest_OBJECT.dir/AnalyticSolve2D_HDG_Triangle_NavierStokes_UniformStream_btest.cpp.o
[ 97%] Built target AnalyticSolve2D_HDG_Triangle_NavierStokes_UniformStream_btest_OBJECT
Scanning dependencies of target AnalyticSolve2D_HDG_Triangle_NavierStokes_UniformStream_btest_build_vera
[ 97%] Checking style of test/system/AnalyticSolve/AnalyticSolve2D_HDG_Triangle_NavierStokes_UniformStream_btest.cpp
[ 97%] Built target AnalyticSolve2D_HDG_Triangle_NavierStokes_UniformStream_btest_build_vera
Scanning dependencies of target AnalyticSolve2D_HDG_Triangle_NavierStokes_UniformStream_btest_build
[ 97%] Linking CXX executable AnalyticSolve2D_HDG_Triangle_NavierStokes_UniformStream_btest
[ 97%] Built target AnalyticSolve2D_HDG_Triangle_NavierStokes_UniformStream_btest_build
Scanning dependencies of target AnalyticSolve_HDG_AD_btest_build_vera
[ 97%] Checking style of test/system/AnalyticSolve/AnalyticSolve_HDG_AD_btest.cpp
[ 97%] Built target AnalyticSolve_HDG_AD_btest_build_vera
Scanning dependencies of target AnalyticSolve_HDG_AD_btest_OBJECT
[ 97%] Building CXX object test/system/AnalyticSolve/CMakeFiles/AnalyticSolve_HDG_AD_btest_OBJECT.dir/AnalyticSolve_HDG_AD_btest.cpp.o
[ 97%] Built target AnalyticSolve_HDG_AD_btest_OBJECT
Scanning dependencies of target AnalyticSolve_HDG_AD_btest_build
[ 97%] Linking CXX executable AnalyticSolve_HDG_AD_btest
[ 97%] Built target AnalyticSolve_HDG_AD_btest_build
Scanning dependencies of target AnalyticSolve2D_DGBR2_Triangle_NavierStokes_btest_build_vera
[ 97%] Checking style of test/system/AnalyticSolve/AnalyticSolve2D_DGBR2_Triangle_NavierStokes_btest.cpp
[ 97%] Built target AnalyticSolve2D_DGBR2_Triangle_NavierStokes_btest_build_vera
Scanning dependencies of target AnalyticSolve2D_DGBR2_Triangle_NavierStokes_btest_OBJECT
[ 97%] Building CXX object test/system/AnalyticSolve/CMakeFiles/AnalyticSolve2D_DGBR2_Triangle_NavierStokes_btest_OBJECT.dir/AnalyticSolve2D_DGBR2_Triangle_NavierStokes_btest.cpp.o
[ 97%] Built target AnalyticSolve2D_DGBR2_Triangle_NavierStokes_btest_OBJECT
Scanning dependencies of target AnalyticSolve2D_DGBR2_Triangle_NavierStokes_btest_build
[ 97%] Linking CXX executable AnalyticSolve2D_DGBR2_Triangle_NavierStokes_btest
[ 97%] Built target AnalyticSolve2D_DGBR2_Triangle_NavierStokes_btest_build
Scanning dependencies of target PDEEulermitAVDiffusion2D_Consistency_btest_build_vera
[ 97%] Checking style of test/system/CodeConsistency/PDEEulermitAVDiffusion2D_Consistency_btest.cpp
[ 97%] Built target PDEEulermitAVDiffusion2D_Consistency_btest_build_vera
Scanning dependencies of target PDEEulermitAVDiffusion2D_Consistency_btest_OBJECT
[ 97%] Building CXX object test/system/CodeConsistency/CMakeFiles/PDEEulermitAVDiffusion2D_Consistency_btest_OBJECT.dir/PDEEulermitAVDiffusion2D_Consistency_btest.cpp.o
[ 97%] Built target PDEEulermitAVDiffusion2D_Consistency_btest_OBJECT
Scanning dependencies of target PDEEulermitAVDiffusion2D_Consistency_btest_build
[ 97%] Linking CXX executable PDEEulermitAVDiffusion2D_Consistency_btest
[ 97%] Built target PDEEulermitAVDiffusion2D_Consistency_btest_build
Scanning dependencies of target BCEulermitAVSensor2D_Consistency_btest_OBJECT
[ 97%] Building CXX object test/system/CodeConsistency/CMakeFiles/BCEulermitAVSensor2D_Consistency_btest_OBJECT.dir/BCEulermitAVSensor2D_Consistency_btest.cpp.o
[ 97%] Built target BCEulermitAVSensor2D_Consistency_btest_OBJECT
Scanning dependencies of target BCEulermitAVSensor2D_Consistency_btest_build_vera
[ 97%] Checking style of test/system/CodeConsistency/BCEulermitAVSensor2D_Consistency_btest.cpp
[ 97%] Built target BCEulermitAVSensor2D_Consistency_btest_build_vera
Scanning dependencies of target BCEulermitAVSensor2D_Consistency_btest_build
[ 97%] Linking CXX executable BCEulermitAVSensor2D_Consistency_btest
[ 97%] Built target BCEulermitAVSensor2D_Consistency_btest_build
Scanning dependencies of target PDEmitAVSensor3D_Consistency_btest_OBJECT
[ 97%] Building CXX object test/system/CodeConsistency/CMakeFiles/PDEmitAVSensor3D_Consistency_btest_OBJECT.dir/PDEmitAVSensor3D_Consistency_btest.cpp.o
[ 97%] Built target PDEmitAVSensor3D_Consistency_btest_OBJECT
Scanning dependencies of target PDEmitAVSensor3D_Consistency_btest_build_vera
[ 97%] Checking style of test/system/CodeConsistency/PDEmitAVSensor3D_Consistency_btest.cpp
[ 97%] Built target PDEmitAVSensor3D_Consistency_btest_build_vera
Scanning dependencies of target PDEmitAVSensor3D_Consistency_btest_build
[ 97%] Linking CXX executable PDEmitAVSensor3D_Consistency_btest
[ 97%] Built target PDEmitAVSensor3D_Consistency_btest_build
Scanning dependencies of target Solve2D_XfoilLikePanelMethod_btest_OBJECT
[ 97%] Building CXX object test/system/CodeConsistency/CMakeFiles/Solve2D_XfoilLikePanelMethod_btest_OBJECT.dir/Solve2D_XfoilLikePanelMethod_btest.cpp.o
[ 97%] Built target Solve2D_XfoilLikePanelMethod_btest_OBJECT
Scanning dependencies of target Solve2D_XfoilLikePanelMethod_btest_build_vera
[ 97%] Checking style of test/system/CodeConsistency/Solve2D_XfoilLikePanelMethod_btest.cpp
[ 97%] Built target Solve2D_XfoilLikePanelMethod_btest_build_vera
Scanning dependencies of target Solve2D_XfoilLikePanelMethod_btest_build
[ 97%] Linking CXX executable Solve2D_XfoilLikePanelMethod_btest
[ 97%] Built target Solve2D_XfoilLikePanelMethod_btest_build
Scanning dependencies of target PDEmitAVSensor3D_Consistency_RANSSA_btest_OBJECT
[ 97%] Building CXX object test/system/CodeConsistency/CMakeFiles/PDEmitAVSensor3D_Consistency_RANSSA_btest_OBJECT.dir/PDEmitAVSensor3D_Consistency_RANSSA_btest.cpp.o
[ 97%] Built target PDEmitAVSensor3D_Consistency_RANSSA_btest_OBJECT
Scanning dependencies of target PDEmitAVSensor3D_Consistency_RANSSA_btest_build_vera
[ 97%] Checking style of test/system/CodeConsistency/PDEmitAVSensor3D_Consistency_RANSSA_btest.cpp
[ 97%] Built target PDEmitAVSensor3D_Consistency_RANSSA_btest_build_vera
Scanning dependencies of target PDEmitAVSensor3D_Consistency_RANSSA_btest_build
[ 97%] Linking CXX executable PDEmitAVSensor3D_Consistency_RANSSA_btest
[ 97%] Built target PDEmitAVSensor3D_Consistency_RANSSA_btest_build
Scanning dependencies of target PDEEulermitAVDiffusion3D_Consistency_btest_build_vera
[ 97%] Checking style of test/system/CodeConsistency/PDEEulermitAVDiffusion3D_Consistency_btest.cpp
[ 97%] Built target PDEEulermitAVDiffusion3D_Consistency_btest_build_vera
Scanning dependencies of target PDEEulermitAVDiffusion3D_Consistency_btest_OBJECT
[ 97%] Building CXX object test/system/CodeConsistency/CMakeFiles/PDEEulermitAVDiffusion3D_Consistency_btest_OBJECT.dir/PDEEulermitAVDiffusion3D_Consistency_btest.cpp.o
[ 97%] Built target PDEEulermitAVDiffusion3D_Consistency_btest_OBJECT
Scanning dependencies of target PDEEulermitAVDiffusion3D_Consistency_btest_build
[ 97%] Linking CXX executable PDEEulermitAVDiffusion3D_Consistency_btest
[ 97%] Built target PDEEulermitAVDiffusion3D_Consistency_btest_build
Scanning dependencies of target Solve2D_Coupled4x4_IBLSplitAmpLag_CorrelationClosure_CapturedTransition_PTC_btest_build_vera
[ 97%] Checking style of test/system/CodeConsistency/Solve2D_Coupled4x4_IBLSplitAmpLag_CorrelationClosure_CapturedTransition_PTC_btest.cpp
[ 97%] Built target Solve2D_Coupled4x4_IBLSplitAmpLag_CorrelationClosure_CapturedTransition_PTC_btest_build_vera
Scanning dependencies of target Solve2D_Coupled4x4_IBLSplitAmpLag_CorrelationClosure_CapturedTransition_PTC_btest_OBJECT
[ 97%] Building CXX object test/system/CodeConsistency/CMakeFiles/Solve2D_Coupled4x4_IBLSplitAmpLag_CorrelationClosure_CapturedTransition_PTC_btest_OBJECT.dir/Solve2D_Coupled4x4_IBLSplitAmpLag_CorrelationClosure_CapturedTransition_PTC_btest.cpp.o
[ 97%] Built target Solve2D_Coupled4x4_IBLSplitAmpLag_CorrelationClosure_CapturedTransition_PTC_btest_OBJECT
Scanning dependencies of target Solve2D_Coupled4x4_IBLSplitAmpLag_CorrelationClosure_CapturedTransition_PTC_btest_build
[100%] Linking CXX executable Solve2D_Coupled4x4_IBLSplitAmpLag_CorrelationClosure_CapturedTransition_PTC_btest
[100%] Built target Solve2D_Coupled4x4_IBLSplitAmpLag_CorrelationClosure_CapturedTransition_PTC_btest_build
Scanning dependencies of target AlgebraicEquationSet_PTC_VMSD_Triangle_SA_btest_OBJECT
[100%] Building CXX object test/system/CodeConsistency/CMakeFiles/AlgebraicEquationSet_PTC_VMSD_Triangle_SA_btest_OBJECT.dir/AlgebraicEquationSet_PTC_VMSD_Triangle_SA_btest.cpp.o
[100%] Built target AlgebraicEquationSet_PTC_VMSD_Triangle_SA_btest_OBJECT
Scanning dependencies of target AlgebraicEquationSet_PTC_VMSD_Triangle_SA_btest_build_vera
[100%] Checking style of test/system/CodeConsistency/AlgebraicEquationSet_PTC_VMSD_Triangle_SA_btest.cpp
[100%] Built target AlgebraicEquationSet_PTC_VMSD_Triangle_SA_btest_build_vera
Scanning dependencies of target AlgebraicEquationSet_PTC_VMSD_Triangle_SA_btest_build
[100%] Linking CXX executable AlgebraicEquationSet_PTC_VMSD_Triangle_SA_btest
[100%] Built target AlgebraicEquationSet_PTC_VMSD_Triangle_SA_btest_build
Scanning dependencies of target PDEEulermitAVDiffusion3D_RANSSA_Consistency_btest_OBJECT
[100%] Building CXX object test/system/CodeConsistency/CMakeFiles/PDEEulermitAVDiffusion3D_RANSSA_Consistency_btest_OBJECT.dir/PDEEulermitAVDiffusion3D_RANSSA_Consistency_btest.cpp.o
[100%] Built target PDEEulermitAVDiffusion3D_RANSSA_Consistency_btest_OBJECT
Scanning dependencies of target PDEEulermitAVDiffusion3D_RANSSA_Consistency_btest_build_vera
[100%] Checking style of test/system/CodeConsistency/PDEEulermitAVDiffusion3D_RANSSA_Consistency_btest.cpp
[100%] Built target PDEEulermitAVDiffusion3D_RANSSA_Consistency_btest_build_vera
Scanning dependencies of target PDEEulermitAVDiffusion3D_RANSSA_Consistency_btest_build
[100%] Linking CXX executable PDEEulermitAVDiffusion3D_RANSSA_Consistency_btest
[100%] Built target PDEEulermitAVDiffusion3D_RANSSA_Consistency_btest_build
Scanning dependencies of target Solve2D_Coupled4x4_IBLUniField_LamiBL_TurbWake_CorrelationClosure_PTC_btest_build_vera
[100%] Checking style of test/system/CodeConsistency/Solve2D_Coupled4x4_IBLUniField_LamiBL_TurbWake_CorrelationClosure_PTC_btest.cpp
[100%] Built target Solve2D_Coupled4x4_IBLUniField_LamiBL_TurbWake_CorrelationClosure_PTC_btest_build_vera
Scanning dependencies of target Solve2D_Coupled4x4_IBLUniField_LamiBL_TurbWake_CorrelationClosure_PTC_btest_OBJECT
[100%] Building CXX object test/system/CodeConsistency/CMakeFiles/Solve2D_Coupled4x4_IBLUniField_LamiBL_TurbWake_CorrelationClosure_PTC_btest_OBJECT.dir/Solve2D_Coupled4x4_IBLUniField_LamiBL_TurbWake_CorrelationClosure_PTC_btest.cpp.o
[100%] Built target Solve2D_Coupled4x4_IBLUniField_LamiBL_TurbWake_CorrelationClosure_PTC_btest_OBJECT
Scanning dependencies of target Solve2D_Coupled4x4_IBLUniField_LamiBL_TurbWake_CorrelationClosure_PTC_btest_build
[100%] Linking CXX executable Solve2D_Coupled4x4_IBLUniField_LamiBL_TurbWake_CorrelationClosure_PTC_btest
[100%] Built target Solve2D_Coupled4x4_IBLUniField_LamiBL_TurbWake_CorrelationClosure_PTC_btest_build
Scanning dependencies of target PDEmitAVSensor2D_Consistency_btest_OBJECT
[100%] Building CXX object test/system/CodeConsistency/CMakeFiles/PDEmitAVSensor2D_Consistency_btest_OBJECT.dir/PDEmitAVSensor2D_Consistency_btest.cpp.o
[100%] Built target PDEmitAVSensor2D_Consistency_btest_OBJECT
Scanning dependencies of target PDEmitAVSensor2D_Consistency_btest_build_vera
[100%] Checking style of test/system/CodeConsistency/PDEmitAVSensor2D_Consistency_btest.cpp
[100%] Built target PDEmitAVSensor2D_Consistency_btest_build_vera
Scanning dependencies of target PDEmitAVSensor2D_Consistency_btest_build
[100%] Linking CXX executable PDEmitAVSensor2D_Consistency_btest
[100%] Built target PDEmitAVSensor2D_Consistency_btest_build
Scanning dependencies of target Solve2D_Coupled4x4_HDGAdv_IBL_Panel_NACA0004_LamiBL_TurbWake_btest_build_vera
[100%] Checking style of test/system/CodeConsistency/Solve2D_Coupled4x4_HDGAdv_IBL_Panel_NACA0004_LamiBL_TurbWake_btest.cpp
[100%] Built target Solve2D_Coupled4x4_HDGAdv_IBL_Panel_NACA0004_LamiBL_TurbWake_btest_build_vera
Scanning dependencies of target Solve2D_Coupled4x4_HDGAdv_IBL_Panel_NACA0004_LamiBL_TurbWake_btest_OBJECT
[100%] Building CXX object test/system/CodeConsistency/CMakeFiles/Solve2D_Coupled4x4_HDGAdv_IBL_Panel_NACA0004_LamiBL_TurbWake_btest_OBJECT.dir/Solve2D_Coupled4x4_HDGAdv_IBL_Panel_NACA0004_LamiBL_TurbWake_btest.cpp.o
[100%] Built target Solve2D_Coupled4x4_HDGAdv_IBL_Panel_NACA0004_LamiBL_TurbWake_btest_OBJECT
Scanning dependencies of target Solve2D_Coupled4x4_HDGAdv_IBL_Panel_NACA0004_LamiBL_TurbWake_btest_build
[100%] Linking CXX executable Solve2D_Coupled4x4_HDGAdv_IBL_Panel_NACA0004_LamiBL_TurbWake_btest
[100%] Built target Solve2D_Coupled4x4_HDGAdv_IBL_Panel_NACA0004_LamiBL_TurbWake_btest_build
Scanning dependencies of target Solve2D_Coupled4x4_IBL_CorrelationClosure_LamiBL_TurbWake_btest_OBJECT
[100%] Building CXX object test/system/CodeConsistency/CMakeFiles/Solve2D_Coupled4x4_IBL_CorrelationClosure_LamiBL_TurbWake_btest_OBJECT.dir/Solve2D_Coupled4x4_IBL_CorrelationClosure_LamiBL_TurbWake_btest.cpp.o
[100%] Built target Solve2D_Coupled4x4_IBL_CorrelationClosure_LamiBL_TurbWake_btest_OBJECT
Scanning dependencies of target Solve2D_Coupled4x4_IBL_CorrelationClosure_LamiBL_TurbWake_btest_build_vera
[100%] Checking style of test/system/CodeConsistency/Solve2D_Coupled4x4_IBL_CorrelationClosure_LamiBL_TurbWake_btest.cpp
[100%] Built target Solve2D_Coupled4x4_IBL_CorrelationClosure_LamiBL_TurbWake_btest_build_vera
Scanning dependencies of target Solve2D_Coupled4x4_IBL_CorrelationClosure_LamiBL_TurbWake_btest_build
[100%] Linking CXX executable Solve2D_Coupled4x4_IBL_CorrelationClosure_LamiBL_TurbWake_btest
[100%] Built target Solve2D_Coupled4x4_IBL_CorrelationClosure_LamiBL_TurbWake_btest_build
Scanning dependencies of target Solve2D_Uncoupled_HDGAdvectiveIBL_LamiBL_btest_OBJECT
[100%] Building CXX object test/system/CodeConsistency/CMakeFiles/Solve2D_Uncoupled_HDGAdvectiveIBL_LamiBL_btest_OBJECT.dir/Solve2D_Uncoupled_HDGAdvectiveIBL_LamiBL_btest.cpp.o
[100%] Built target Solve2D_Uncoupled_HDGAdvectiveIBL_LamiBL_btest_OBJECT
Scanning dependencies of target Solve2D_Uncoupled_HDGAdvectiveIBL_LamiBL_btest_build_vera
[100%] Checking style of test/system/CodeConsistency/Solve2D_Uncoupled_HDGAdvectiveIBL_LamiBL_btest.cpp
[100%] Built target Solve2D_Uncoupled_HDGAdvectiveIBL_LamiBL_btest_build_vera
Scanning dependencies of target Solve2D_Uncoupled_HDGAdvectiveIBL_LamiBL_btest_build
[100%] Linking CXX executable Solve2D_Uncoupled_HDGAdvectiveIBL_LamiBL_btest
[100%] Built target Solve2D_Uncoupled_HDGAdvectiveIBL_LamiBL_btest_build
Scanning dependencies of target PDEmitAVSensor2D_Consistency_RANSSA_btest_OBJECT
[100%] Building CXX object test/system/CodeConsistency/CMakeFiles/PDEmitAVSensor2D_Consistency_RANSSA_btest_OBJECT.dir/PDEmitAVSensor2D_Consistency_RANSSA_btest.cpp.o
[100%] Built target PDEmitAVSensor2D_Consistency_RANSSA_btest_OBJECT
Scanning dependencies of target PDEmitAVSensor2D_Consistency_RANSSA_btest_build_vera
[100%] Checking style of test/system/CodeConsistency/PDEmitAVSensor2D_Consistency_RANSSA_btest.cpp
[100%] Built target PDEmitAVSensor2D_Consistency_RANSSA_btest_build_vera
Scanning dependencies of target PDEmitAVSensor2D_Consistency_RANSSA_btest_build
[100%] Linking CXX executable PDEmitAVSensor2D_Consistency_RANSSA_btest
[100%] Built target PDEmitAVSensor2D_Consistency_RANSSA_btest_build
Scanning dependencies of target BCEulermitAVSensor2D_Consistency_RANSSA_btest_OBJECT
[100%] Building CXX object test/system/CodeConsistency/CMakeFiles/BCEulermitAVSensor2D_Consistency_RANSSA_btest_OBJECT.dir/BCEulermitAVSensor2D_Consistency_RANSSA_btest.cpp.o
[100%] Built target BCEulermitAVSensor2D_Consistency_RANSSA_btest_OBJECT
Scanning dependencies of target BCEulermitAVSensor2D_Consistency_RANSSA_btest_build_vera
[100%] Checking style of test/system/CodeConsistency/BCEulermitAVSensor2D_Consistency_RANSSA_btest.cpp
[100%] Built target BCEulermitAVSensor2D_Consistency_RANSSA_btest_build_vera
Scanning dependencies of target BCEulermitAVSensor2D_Consistency_RANSSA_btest_build
[100%] Linking CXX executable BCEulermitAVSensor2D_Consistency_RANSSA_btest
[100%] Built target BCEulermitAVSensor2D_Consistency_RANSSA_btest_build
Scanning dependencies of target Solve2D_Coupled4x4_IBL_Panel_NACA0004_FittedTransition_Forced_btest_build_vera
[100%] Checking style of test/system/CodeConsistency/Solve2D_Coupled4x4_IBL_Panel_NACA0004_FittedTransition_Forced_btest.cpp
[100%] Built target Solve2D_Coupled4x4_IBL_Panel_NACA0004_FittedTransition_Forced_btest_build_vera
Scanning dependencies of target Solve2D_Coupled4x4_IBL_Panel_NACA0004_FittedTransition_Forced_btest_OBJECT
[100%] Building CXX object test/system/CodeConsistency/CMakeFiles/Solve2D_Coupled4x4_IBL_Panel_NACA0004_FittedTransition_Forced_btest_OBJECT.dir/Solve2D_Coupled4x4_IBL_Panel_NACA0004_FittedTransition_Forced_btest.cpp.o
[100%] Built target Solve2D_Coupled4x4_IBL_Panel_NACA0004_FittedTransition_Forced_btest_OBJECT
Scanning dependencies of target Solve2D_Coupled4x4_IBL_Panel_NACA0004_FittedTransition_Forced_btest_build
[100%] Linking CXX executable Solve2D_Coupled4x4_IBL_Panel_NACA0004_FittedTransition_Forced_btest
[100%] Built target Solve2D_Coupled4x4_IBL_Panel_NACA0004_FittedTransition_Forced_btest_build
Scanning dependencies of target Solve2D_Coupled4x4_IBL_Panel_NACA0004_FittedTransition_TwoLayerNewton_btest_OBJECT
[100%] Building CXX object test/system/CodeConsistency/CMakeFiles/Solve2D_Coupled4x4_IBL_Panel_NACA0004_FittedTransition_TwoLayerNewton_btest_OBJECT.dir/Solve2D_Coupled4x4_IBL_Panel_NACA0004_FittedTransition_TwoLayerNewton_btest.cpp.o
[100%] Built target Solve2D_Coupled4x4_IBL_Panel_NACA0004_FittedTransition_TwoLayerNewton_btest_OBJECT
Scanning dependencies of target Solve2D_Coupled4x4_IBL_Panel_NACA0004_FittedTransition_TwoLayerNewton_btest_build_vera
[100%] Checking style of test/system/CodeConsistency/Solve2D_Coupled4x4_IBL_Panel_NACA0004_FittedTransition_TwoLayerNewton_btest.cpp
[100%] Built target Solve2D_Coupled4x4_IBL_Panel_NACA0004_FittedTransition_TwoLayerNewton_btest_build_vera
Scanning dependencies of target Solve2D_Coupled4x4_IBL_Panel_NACA0004_FittedTransition_TwoLayerNewton_btest_build
[100%] Linking CXX executable Solve2D_Coupled4x4_IBL_Panel_NACA0004_FittedTransition_TwoLayerNewton_btest
[100%] Built target Solve2D_Coupled4x4_IBL_Panel_NACA0004_FittedTransition_TwoLayerNewton_btest_build
Scanning dependencies of target PDEmitAVSensor1D_Consistency_btest_build_vera
[100%] Checking style of test/system/CodeConsistency/PDEmitAVSensor1D_Consistency_btest.cpp
[100%] Built target PDEmitAVSensor1D_Consistency_btest_build_vera
Scanning dependencies of target PDEmitAVSensor1D_Consistency_btest_OBJECT
[100%] Building CXX object test/system/CodeConsistency/CMakeFiles/PDEmitAVSensor1D_Consistency_btest_OBJECT.dir/PDEmitAVSensor1D_Consistency_btest.cpp.o
[100%] Built target PDEmitAVSensor1D_Consistency_btest_OBJECT
Scanning dependencies of target PDEmitAVSensor1D_Consistency_btest_build
[100%] Linking CXX executable PDEmitAVSensor1D_Consistency_btest
[100%] Built target PDEmitAVSensor1D_Consistency_btest_build
Scanning dependencies of target Solve2D_Coupled4x4_IBLSplitAmpLag_CorrelationClosure_LamiBL_TurbWake_btest_build_vera
[100%] Checking style of test/system/CodeConsistency/Solve2D_Coupled4x4_IBLSplitAmpLag_CorrelationClosure_LamiBL_TurbWake_btest.cpp
[100%] Built target Solve2D_Coupled4x4_IBLSplitAmpLag_CorrelationClosure_LamiBL_TurbWake_btest_build_vera
Scanning dependencies of target Solve2D_Coupled4x4_IBLSplitAmpLag_CorrelationClosure_LamiBL_TurbWake_btest_OBJECT
[100%] Building CXX object test/system/CodeConsistency/CMakeFiles/Solve2D_Coupled4x4_IBLSplitAmpLag_CorrelationClosure_LamiBL_TurbWake_btest_OBJECT.dir/Solve2D_Coupled4x4_IBLSplitAmpLag_CorrelationClosure_LamiBL_TurbWake_btest.cpp.o
[100%] Built target Solve2D_Coupled4x4_IBLSplitAmpLag_CorrelationClosure_LamiBL_TurbWake_btest_OBJECT
Scanning dependencies of target Solve2D_Coupled4x4_IBLSplitAmpLag_CorrelationClosure_LamiBL_TurbWake_btest_build
[100%] Linking CXX executable Solve2D_Coupled4x4_IBLSplitAmpLag_CorrelationClosure_LamiBL_TurbWake_btest
[100%] Built target Solve2D_Coupled4x4_IBLSplitAmpLag_CorrelationClosure_LamiBL_TurbWake_btest_build
Scanning dependencies of target Solve2D_Uncoupled_DGAdvectiveIBL_LamiBL_PTC_btest_OBJECT
[100%] Building CXX object test/system/CodeConsistency/CMakeFiles/Solve2D_Uncoupled_DGAdvectiveIBL_LamiBL_PTC_btest_OBJECT.dir/Solve2D_Uncoupled_DGAdvectiveIBL_LamiBL_PTC_btest.cpp.o
[100%] Built target Solve2D_Uncoupled_DGAdvectiveIBL_LamiBL_PTC_btest_OBJECT
Scanning dependencies of target Solve2D_Uncoupled_DGAdvectiveIBL_LamiBL_PTC_btest_build_vera
[100%] Checking style of test/system/CodeConsistency/Solve2D_Uncoupled_DGAdvectiveIBL_LamiBL_PTC_btest.cpp
[100%] Built target Solve2D_Uncoupled_DGAdvectiveIBL_LamiBL_PTC_btest_build_vera
Scanning dependencies of target Solve2D_Uncoupled_DGAdvectiveIBL_LamiBL_PTC_btest_build
[100%] Linking CXX executable Solve2D_Uncoupled_DGAdvectiveIBL_LamiBL_PTC_btest
[100%] Built target Solve2D_Uncoupled_DGAdvectiveIBL_LamiBL_PTC_btest_build
Scanning dependencies of target PDEEulermitAVDiffusion2D_RANSSA_Consistency_btest_OBJECT
[100%] Building CXX object test/system/CodeConsistency/CMakeFiles/PDEEulermitAVDiffusion2D_RANSSA_Consistency_btest_OBJECT.dir/PDEEulermitAVDiffusion2D_RANSSA_Consistency_btest.cpp.o
[100%] Built target PDEEulermitAVDiffusion2D_RANSSA_Consistency_btest_OBJECT
Scanning dependencies of target PDEEulermitAVDiffusion2D_RANSSA_Consistency_btest_build_vera
[100%] Checking style of test/system/CodeConsistency/PDEEulermitAVDiffusion2D_RANSSA_Consistency_btest.cpp
[100%] Built target PDEEulermitAVDiffusion2D_RANSSA_Consistency_btest_build_vera
Scanning dependencies of target PDEEulermitAVDiffusion2D_RANSSA_Consistency_btest_build
[100%] Linking CXX executable PDEEulermitAVDiffusion2D_RANSSA_Consistency_btest
[100%] Built target PDEEulermitAVDiffusion2D_RANSSA_Consistency_btest_build
Scanning dependencies of target BCEulermitAVSensor3D_Consistency_btest_build_vera
[100%] Checking style of test/system/CodeConsistency/BCEulermitAVSensor3D_Consistency_btest.cpp
[100%] Built target BCEulermitAVSensor3D_Consistency_btest_build_vera
Scanning dependencies of target BCEulermitAVSensor3D_Consistency_btest_OBJECT
[100%] Building CXX object test/system/CodeConsistency/CMakeFiles/BCEulermitAVSensor3D_Consistency_btest_OBJECT.dir/BCEulermitAVSensor3D_Consistency_btest.cpp.o
[100%] Built target BCEulermitAVSensor3D_Consistency_btest_OBJECT
Scanning dependencies of target BCEulermitAVSensor3D_Consistency_btest_build
[100%] Linking CXX executable BCEulermitAVSensor3D_Consistency_btest
[100%] Built target BCEulermitAVSensor3D_Consistency_btest_build
Scanning dependencies of target Solve2D_Coupled4x4_IBL_Panel_NACA0004_LamiBL_TurbWake_btest_OBJECT
[100%] Building CXX object test/system/CodeConsistency/CMakeFiles/Solve2D_Coupled4x4_IBL_Panel_NACA0004_LamiBL_TurbWake_btest_OBJECT.dir/Solve2D_Coupled4x4_IBL_Panel_NACA0004_LamiBL_TurbWake_btest.cpp.o
[100%] Built target Solve2D_Coupled4x4_IBL_Panel_NACA0004_LamiBL_TurbWake_btest_OBJECT
Scanning dependencies of target Solve2D_Coupled4x4_IBL_Panel_NACA0004_LamiBL_TurbWake_btest_build_vera
[100%] Checking style of test/system/CodeConsistency/Solve2D_Coupled4x4_IBL_Panel_NACA0004_LamiBL_TurbWake_btest.cpp
[100%] Built target Solve2D_Coupled4x4_IBL_Panel_NACA0004_LamiBL_TurbWake_btest_build_vera
Scanning dependencies of target Solve2D_Coupled4x4_IBL_Panel_NACA0004_LamiBL_TurbWake_btest_build
[100%] Linking CXX executable Solve2D_Coupled4x4_IBL_Panel_NACA0004_LamiBL_TurbWake_btest
[100%] Built target Solve2D_Coupled4x4_IBL_Panel_NACA0004_LamiBL_TurbWake_btest_build
Scanning dependencies of target BCEulermitAVSensor3D_Consistency_RANSSA_btest_OBJECT
[100%] Building CXX object test/system/CodeConsistency/CMakeFiles/BCEulermitAVSensor3D_Consistency_RANSSA_btest_OBJECT.dir/BCEulermitAVSensor3D_Consistency_RANSSA_btest.cpp.o
[100%] Built target BCEulermitAVSensor3D_Consistency_RANSSA_btest_OBJECT
Scanning dependencies of target BCEulermitAVSensor3D_Consistency_RANSSA_btest_build_vera
[100%] Checking style of test/system/CodeConsistency/BCEulermitAVSensor3D_Consistency_RANSSA_btest.cpp
[100%] Built target BCEulermitAVSensor3D_Consistency_RANSSA_btest_build_vera
Scanning dependencies of target BCEulermitAVSensor3D_Consistency_RANSSA_btest_build
[100%] Linking CXX executable BCEulermitAVSensor3D_Consistency_RANSSA_btest
[100%] Built target BCEulermitAVSensor3D_Consistency_RANSSA_btest_build
Scanning dependencies of target PDEEulermitAVDiffusion1D_Consistency_btest_OBJECT
[100%] Building CXX object test/system/CodeConsistency/CMakeFiles/PDEEulermitAVDiffusion1D_Consistency_btest_OBJECT.dir/PDEEulermitAVDiffusion1D_Consistency_btest.cpp.o
[100%] Built target PDEEulermitAVDiffusion1D_Consistency_btest_OBJECT
Scanning dependencies of target PDEEulermitAVDiffusion1D_Consistency_btest_build_vera
[100%] Checking style of test/system/CodeConsistency/PDEEulermitAVDiffusion1D_Consistency_btest.cpp
[100%] Built target PDEEulermitAVDiffusion1D_Consistency_btest_build_vera
Scanning dependencies of target PDEEulermitAVDiffusion1D_Consistency_btest_build
[100%] Linking CXX executable PDEEulermitAVDiffusion1D_Consistency_btest
[100%] Built target PDEEulermitAVDiffusion1D_Consistency_btest_build
Scanning dependencies of target check_system_build
[100%] Built target check_system_build
Scanning dependencies of target memcheck_system
   Site: reynolds
   Build name: Linux-g++-9
Create new tag: 20200414-1342 - Experimental
Test project /jenkins/workspace/SANS_Weekly/builddir/debug_gnu9/buildnode/reynolds/build/debug_gnu9
        Start 1698: SolverInterface_Galerkin_Stabilized_btest_memcheck
  1/109 Test #1698: SolverInterface_Galerkin_Stabilized_btest_memcheck ...........................................   Passed   31.20 sec
        Start 1700: SolverInterface_DGAdvective_btest_memcheck
  2/109 Test #1700: SolverInterface_DGAdvective_btest_memcheck ...................................................   Passed   21.68 sec
        Start 1702: SolverInterface_DGBR2_btest_memcheck
  3/109 Test #1702: SolverInterface_DGBR2_btest_memcheck .........................................................   Passed   62.16 sec
        Start 1704: ErrorOrder_2D_CG_Triangle_AD_btest_memcheck
  4/109 Test #1704: ErrorOrder_2D_CG_Triangle_AD_btest_memcheck ..................................................   Passed   10.91 sec
        Start 1706: ErrorOrder_2D_EDG_Triangle_AD_btest_memcheck
  5/109 Test #1706: ErrorOrder_2D_EDG_Triangle_AD_btest_memcheck .................................................   Passed   77.02 sec
        Start 1708: ErrorOrder_3D_DGBR2_Sphere_Triangle_AD_btest_memcheck
  6/109 Test #1708: ErrorOrder_3D_DGBR2_Sphere_Triangle_AD_btest_memcheck ........................................   Passed   27.50 sec
        Start 1710: ErrorOrder_3D_CG_Tet_AD_btest_memcheck
  7/109 Test #1710: ErrorOrder_3D_CG_Tet_AD_btest_memcheck .......................................................   Passed   15.37 sec
        Start 1712: ErrorOrder_4D_DG_Pentatope_btest_memcheck
  8/109 Test #1712: ErrorOrder_4D_DG_Pentatope_btest_memcheck ....................................................***Failed   12.28 sec
Running 2 test cases...
creating geometry context with EGADS v1.17 and OpenCASCADE with OpenCASCADE 7.4.1
entity 6 (3683013136) maps to 8
entity 8 (3917754896) maps to 7
entity 4 (3987166224) maps to 6
entity 2 (3989547392) maps to 5
entity 1 (4150608673) maps to 4
entity 3 (4240016946) maps to 3
entity 7 (4257982309) maps to 2
entity 5 (4274689859) maps to 1
added vertices
added cells
added boundary
unknown location(0): fatal error in "ErrorOrder_4D_DG_Pentatope": memory access violation at address: 0x00000000: no mapping at fault address

*** 1 failure detected in test suite "SANS_unit_test"

        Start 1714: ErrorEstimateOrder_2D_HDG_Triangle_AD_btest_memcheck
  9/109 Test #1714: ErrorEstimateOrder_2D_HDG_Triangle_AD_btest_memcheck .........................................   Passed  449.31 sec
        Start 1716: ErrorOrder_1D_DGBR2_BuckleyLeverett_ST_btest_memcheck
 10/109 Test #1716: ErrorOrder_1D_DGBR2_BuckleyLeverett_ST_btest_memcheck ........................................   Passed  360.66 sec
        Start 1718: ErrorOrder_1D_HDG_AD_btest_memcheck
 11/109 Test #1718: ErrorOrder_1D_HDG_AD_btest_memcheck ..........................................................   Passed   14.68 sec
        Start 1720: ErrorOrder_1D_HDG_AD_BDF_btest_memcheck
 12/109 Test #1720: ErrorOrder_1D_HDG_AD_BDF_btest_memcheck ......................................................   Passed  267.11 sec
        Start 1722: ErrorOrder_1D_DGBR2_AD_BDF_btest_memcheck
 13/109 Test #1722: ErrorOrder_1D_DGBR2_AD_BDF_btest_memcheck ....................................................   Passed  166.67 sec
        Start 1724: ErrorEstimateOrder_2D_DGAdvective_Triangle_AD_btest_memcheck
 14/109 Test #1724: ErrorEstimateOrder_2D_DGAdvective_Triangle_AD_btest_memcheck .................................   Passed  489.49 sec
        Start 1726: ErrorEstimateOrder_1D_CG_Line_AD_btest_memcheck
 15/109 Test #1726: ErrorEstimateOrder_1D_CG_Line_AD_btest_memcheck ..............................................   Passed    6.47 sec
        Start 1728: Adjoint2D_HDG_Triangle_AD_sansLG_btest_memcheck
 16/109 Test #1728: Adjoint2D_HDG_Triangle_AD_sansLG_btest_memcheck ..............................................   Passed  206.36 sec
        Start 1730: Adjoint1D_DGBR2_BuckleyLeverett_ST_btest_memcheck
 17/109 Test #1730: Adjoint1D_DGBR2_BuckleyLeverett_ST_btest_memcheck ............................................   Passed  110.03 sec
        Start 1732: ErrorOrder_1D_CG_AD_btest_memcheck
 18/109 Test #1732: ErrorOrder_1D_CG_AD_btest_memcheck ...........................................................   Passed    5.72 sec
        Start 1734: ErrorEstimateOrder_3D_CG_Tet_AD_btest_memcheck
 19/109 Test #1734: ErrorEstimateOrder_3D_CG_Tet_AD_btest_memcheck ...............................................   Passed    0.92 sec
        Start 1736: ErrorOrder_1D_DGBR2_TwoPhase_ST_btest_memcheck
 20/109 Test #1736: ErrorOrder_1D_DGBR2_TwoPhase_ST_btest_memcheck ...............................................   Passed  124.09 sec
        Start 1738: Adjoint2D_DGAdvective_Triangle_AD_btest_memcheck
 21/109 Test #1738: Adjoint2D_DGAdvective_Triangle_AD_btest_memcheck .............................................   Passed   13.87 sec
        Start 1740: Solve2D_DGAdvective_LinearRobin_mitLG_sansLG_Consistency_AD_btest_memcheck
 22/109 Test #1740: Solve2D_DGAdvective_LinearRobin_mitLG_sansLG_Consistency_AD_btest_memcheck ...................   Passed   16.56 sec
        Start 1742: ErrorOrder_2D_HDG_Triangle_AD_btest_memcheck
 23/109 Test #1742: ErrorOrder_2D_HDG_Triangle_AD_btest_memcheck .................................................   Passed   86.34 sec
        Start 1744: ErrorOrder_1D_HDGAdvective_Advection_btest_memcheck
 24/109 Test #1744: ErrorOrder_1D_HDGAdvective_Advection_btest_memcheck ..........................................   Passed    6.46 sec
        Start 1746: ErrorOrder_1D_CG_AD_BDF_btest_memcheck
 25/109 Test #1746: ErrorOrder_1D_CG_AD_BDF_btest_memcheck .......................................................   Passed  409.27 sec
        Start 1748: ErrorOrder_3D_CG_Sphere_Triangle_AD_btest_memcheck
 26/109 Test #1748: ErrorOrder_3D_CG_Sphere_Triangle_AD_btest_memcheck ...........................................   Passed   30.92 sec
        Start 1750: ErrorEstimateOrder_1D_DGBR2_Line_AD_btest_memcheck
 27/109 Test #1750: ErrorEstimateOrder_1D_DGBR2_Line_AD_btest_memcheck ...........................................   Passed   11.11 sec
        Start 1752: ErrorOrder_3D_CG_Hex_AD_btest_memcheck
 28/109 Test #1752: ErrorOrder_3D_CG_Hex_AD_btest_memcheck .......................................................   Passed    9.86 sec
        Start 1754: ErrorOrder_1D_HDG_Burgers_btest_memcheck
 29/109 Test #1754: ErrorOrder_1D_HDG_Burgers_btest_memcheck .....................................................   Passed  826.37 sec
        Start 1756: ErrorEstimateOrder_2D_CG_Nodal_Triangle_AD_btest_memcheck
 30/109 Test #1756: ErrorEstimateOrder_2D_CG_Nodal_Triangle_AD_btest_memcheck ....................................   Passed  474.43 sec
        Start 1758: ErrorOrder_1D_DGBR2_Burgers_btest_memcheck
 31/109 Test #1758: ErrorOrder_1D_DGBR2_Burgers_btest_memcheck ...................................................   Passed  150.13 sec
        Start 1760: ErrorOrder_2D_DGAdvective_Flat_Line_AD_btest_memcheck
 32/109 Test #1760: ErrorOrder_2D_DGAdvective_Flat_Line_AD_btest_memcheck ........................................   Passed   14.44 sec
        Start 1762: ErrorOrder_3D_DGBR2_Tet_AD_btest_memcheck
 33/109 Test #1762: ErrorOrder_3D_DGBR2_Tet_AD_btest_memcheck ....................................................   Passed   23.62 sec
        Start 1764: ErrorOrder_1D_DGBR2_AD_btest_memcheck
 34/109 Test #1764: ErrorOrder_1D_DGBR2_AD_btest_memcheck ........................................................   Passed   16.48 sec
        Start 1766: ErrorOrder_2D_DGAdvective_Annulus_Triangle_btest_memcheck
 35/109 Test #1766: ErrorOrder_2D_DGAdvective_Annulus_Triangle_btest_memcheck ....................................   Passed   15.76 sec
        Start 1768: ErrorEstimateOrder_2D_CG_Triangle_RD_btest_memcheck
 36/109 Test #1768: ErrorEstimateOrder_2D_CG_Triangle_RD_btest_memcheck ..........................................   Passed  217.96 sec
        Start 1770: ErrorOrder_2D_DGAdvective_Circle_Line_AD_btest_memcheck
 37/109 Test #1770: ErrorOrder_2D_DGAdvective_Circle_Line_AD_btest_memcheck ......................................   Passed   14.83 sec
        Start 1772: ErrorOrder_2D_CG_Quad_AD_btest_memcheck
 38/109 Test #1772: ErrorOrder_2D_CG_Quad_AD_btest_memcheck ......................................................   Passed   12.01 sec
        Start 1774: ErrorEstimateOrder_2D_DGBR2_Triangle_AD_btest_memcheck
 39/109 Test #1774: ErrorEstimateOrder_2D_DGBR2_Triangle_AD_btest_memcheck .......................................   Passed  261.87 sec
        Start 1776: ErrorOrder_2D_DGAdvective_Circle_Line_ShallowWater_btest_memcheck
 40/109 Test #1776: ErrorOrder_2D_DGAdvective_Circle_Line_ShallowWater_btest_memcheck ............................   Passed   13.92 sec
        Start 1778: ErrorEstimateOrder_2D_CG_Triangle_AD_btest_memcheck
 41/109 Test #1778: ErrorEstimateOrder_2D_CG_Triangle_AD_btest_memcheck ..........................................   Passed  592.48 sec
        Start 1780: ErrorOrder_2D_DGBR2_Triangle_AD_btest_memcheck
 42/109 Test #1780: ErrorOrder_2D_DGBR2_Triangle_AD_btest_memcheck ...............................................   Passed   35.57 sec
        Start 1782: ErrorOrder_1D_DGAdvective_ShallowWater_btest_memcheck
 43/109 Test #1782: ErrorOrder_1D_DGAdvective_ShallowWater_btest_memcheck ........................................   Passed   19.91 sec
        Start 1784: ErrorOrder_3D_DGBR2_Periodic_Hex_AD_btest_memcheck
 44/109 Test #1784: ErrorOrder_3D_DGBR2_Periodic_Hex_AD_btest_memcheck ...........................................   Passed   18.59 sec
        Start 1786: ErrorOrder_1D_DGBR2_AD_HB_btest_memcheck
 45/109 Test #1786: ErrorOrder_1D_DGBR2_AD_HB_btest_memcheck .....................................................   Passed   36.61 sec
        Start 1788: ErrorOrder_2D_DGAdvective_Annulus_Quad_btest_memcheck
 46/109 Test #1788: ErrorOrder_2D_DGAdvective_Annulus_Quad_btest_memcheck ........................................   Passed   16.36 sec
        Start 1790: ErrorOrder_2D_CGStabilized_RANS_MMS_btest_memcheck
 47/109 Test #1790: ErrorOrder_2D_CGStabilized_RANS_MMS_btest_memcheck ...........................................   Passed   80.60 sec
        Start 1792: Adjoint2D_HDG_Triangle_AD_mitState_btest_memcheck
 48/109 Test #1792: Adjoint2D_HDG_Triangle_AD_mitState_btest_memcheck ............................................   Passed  283.27 sec
        Start 1794: ErrorOrder_2D_DGBR2_RANS_MMS_btest_memcheck
 49/109 Test #1794: ErrorOrder_2D_DGBR2_RANS_MMS_btest_memcheck ..................................................   Passed   72.44 sec
        Start 1796: Adjoint2D_DGBR2_Triangle_AD_btest_memcheck
 50/109 Test #1796: Adjoint2D_DGBR2_Triangle_AD_btest_memcheck ...................................................   Passed   39.62 sec
        Start 1798: Adjoint2D_CG_Triangle_AD_btest_memcheck
 51/109 Test #1798: Adjoint2D_CG_Triangle_AD_btest_memcheck ......................................................   Passed   13.47 sec
        Start 1800: ElementLocalSolve3D_DGBR2_Tet_AD_btest_memcheck
 52/109 Test #1800: ElementLocalSolve3D_DGBR2_Tet_AD_btest_memcheck ..............................................   Passed  368.75 sec
        Start 1802: AlgebraicEquationSet_Local_VMSD_Triangle_AD_btest_memcheck
 53/109 Test #1802: AlgebraicEquationSet_Local_VMSD_Triangle_AD_btest_memcheck ...................................   Passed   24.17 sec
        Start 1804: LocalSolve3D_HDG_Tet_AD_btest_memcheck
 54/109 Test #1804: LocalSolve3D_HDG_Tet_AD_btest_memcheck .......................................................   Passed  909.29 sec
        Start 1806: LocalSolve3D_Split_HDG_Tet_AD_btest_memcheck
 55/109 Test #1806: LocalSolve3D_Split_HDG_Tet_AD_btest_memcheck .................................................   Passed  696.43 sec
        Start 1808: EdgeLocalSolve3D_Dual_Galerkin_Stabilized_AD_btest_memcheck
 56/109 Test #1808: EdgeLocalSolve3D_Dual_Galerkin_Stabilized_AD_btest_memcheck ..................................   Passed  129.18 sec
        Start 1810: EdgeLocalSolve2D_Dual_Galerkin_Stabilized_AR_btest_memcheck
 57/109 Test #1810: EdgeLocalSolve2D_Dual_Galerkin_Stabilized_AR_btest_memcheck ..................................   Passed  186.79 sec
        Start 1812: EdgeLocalSolve2D_Dual_Galerkin_Stabilized_Euler_btest_memcheck
 58/109 Test #1812: EdgeLocalSolve2D_Dual_Galerkin_Stabilized_Euler_btest_memcheck ...............................   Passed   30.20 sec
        Start 1814: LocalSolve2D_Split_HDG_Triangle_AD_btest_memcheck
 59/109 Test #1814: LocalSolve2D_Split_HDG_Triangle_AD_btest_memcheck ............................................   Passed   81.61 sec
        Start 1816: LocalSolve1D_Split_DGBR2_AD_btest_memcheck
 60/109 Test #1816: LocalSolve1D_Split_DGBR2_AD_btest_memcheck ...................................................   Passed   16.95 sec
        Start 1818: LocalSolve1D_HDG_AD_btest_memcheck
 61/109 Test #1818: LocalSolve1D_HDG_AD_btest_memcheck ...........................................................   Passed   19.78 sec
        Start 1820: AlgebraicEquationSet_Local_VMSDBR2_Triangle_AD_btest_memcheck
 62/109 Test #1820: AlgebraicEquationSet_Local_VMSDBR2_Triangle_AD_btest_memcheck ................................   Passed   18.04 sec
        Start 1822: LocalSolve2D_HDG_Triangle_AD_btest_memcheck
 63/109 Test #1822: LocalSolve2D_HDG_Triangle_AD_btest_memcheck ..................................................   Passed   65.52 sec
        Start 1824: ElementLocalSolve1D_DGBR2_Triangle_AD_btest_memcheck
 64/109 Test #1824: ElementLocalSolve1D_DGBR2_Triangle_AD_btest_memcheck .........................................   Passed   21.69 sec
        Start 1826: LocalSolve1D_Split_HDG_AD_btest_memcheck
 65/109 Test #1826: LocalSolve1D_Split_HDG_AD_btest_memcheck .....................................................   Passed   14.59 sec
        Start 1828: LocalSolve2D_Split_DGBR2_Triangle_AD_AV_btest_memcheck
 66/109 Test #1828: LocalSolve2D_Split_DGBR2_Triangle_AD_AV_btest_memcheck .......................................   Passed  333.72 sec
        Start 1830: ElementLocalSolve3D_DGAdvective_Tet_AD_btest_memcheck
 67/109 Test #1830: ElementLocalSolve3D_DGAdvective_Tet_AD_btest_memcheck ........................................   Passed  123.09 sec
        Start 1832: EdgeLocalSolve1D_Dual_Galerkin_Stabilized_Line_AD_btest_memcheck
 68/109 Test #1832: EdgeLocalSolve1D_Dual_Galerkin_Stabilized_Line_AD_btest_memcheck .............................   Passed   15.67 sec
        Start 1834: ElementDualLocalSolve3D_Galerkin_Stabilized_Triangle_AD_btest_memcheck
 69/109 Test #1834: ElementDualLocalSolve3D_Galerkin_Stabilized_Triangle_AD_btest_memcheck .......................   Passed  451.96 sec
        Start 1836: EdgeLocalSolve2D_Dual_Galerkin_Stabilized_AD_btest_memcheck
 70/109 Test #1836: EdgeLocalSolve2D_Dual_Galerkin_Stabilized_AD_btest_memcheck ..................................   Passed  233.20 sec
        Start 1838: ElementLocalSolve2D_DGBR2_Triangle_AD_btest_memcheck
 71/109 Test #1838: ElementLocalSolve2D_DGBR2_Triangle_AD_btest_memcheck .........................................   Passed  247.27 sec
        Start 1840: ElementDualLocalSolve2D_Galerkin_Stabilized_Triangle_AD_btest_memcheck
 72/109 Test #1840: ElementDualLocalSolve2D_Galerkin_Stabilized_Triangle_AD_btest_memcheck .......................   Passed  150.43 sec
        Start 1842: Block_1D_Decoupled_Burgers_btest_memcheck
 73/109 Test #1842: Block_1D_Decoupled_Burgers_btest_memcheck ....................................................   Passed  770.60 sec
        Start 1844: Block_1D_Decoupled_AD_btest_memcheck
 74/109 Test #1844: Block_1D_Decoupled_AD_btest_memcheck .........................................................   Passed    6.81 sec
        Start 1846: AnalyticSolve2D_HDG_Triangle_NavierStokes_UniformStream_btest_memcheck
 75/109 Test #1846: AnalyticSolve2D_HDG_Triangle_NavierStokes_UniformStream_btest_memcheck .......................   Passed   17.82 sec
        Start 1848: AnalyticSolve2D_DGAdvective_IBL_StagnationFlow_SingleElem_LamiBL_btest_memcheck
 76/109 Test #1848: AnalyticSolve2D_DGAdvective_IBL_StagnationFlow_SingleElem_LamiBL_btest_memcheck ..............   Passed   21.08 sec
        Start 1850: AnalyticSolve2D_HDG_Triangle_NavierStokes_btest_memcheck
 77/109 Test #1850: AnalyticSolve2D_HDG_Triangle_NavierStokes_btest_memcheck .....................................   Passed  587.66 sec
        Start 1852: AnalyticSolve2D_DGBR2_Triangle_NavierStokes_UniformStream_btest_memcheck
 78/109 Test #1852: AnalyticSolve2D_DGBR2_Triangle_NavierStokes_UniformStream_btest_memcheck .....................   Passed   52.22 sec
        Start 1854: AnalyticSolve2D_DGAdvective_Triangle_Euler_UniformStream_btest_memcheck
 79/109 Test #1854: AnalyticSolve2D_DGAdvective_Triangle_Euler_UniformStream_btest_memcheck ......................   Passed   62.36 sec
        Start 1856: AnalyticSolve2D_DGAdvective_IBL_StagnationFlow_LamiBL_btest_memcheck
 80/109 Test #1856: AnalyticSolve2D_DGAdvective_IBL_StagnationFlow_LamiBL_btest_memcheck .........................   Passed   25.33 sec
        Start 1858: AnalyticSolve_HDG_AD_btest_memcheck
 81/109 Test #1858: AnalyticSolve_HDG_AD_btest_memcheck ..........................................................   Passed   12.62 sec
        Start 1860: AnalyticSolve2D_DGBR2_Triangle_NavierStokes_btest_memcheck
 82/109 Test #1860: AnalyticSolve2D_DGBR2_Triangle_NavierStokes_btest_memcheck ...................................   Passed   75.87 sec
        Start 1862: Solve2D_Coupled4x4_HDGAdv_IBL_Panel_NACA0004_LamiBL_TurbWake_btest_memcheck
 83/109 Test #1862: Solve2D_Coupled4x4_HDGAdv_IBL_Panel_NACA0004_LamiBL_TurbWake_btest_memcheck ..................   Passed  729.50 sec
        Start 1864: Solve2D_Coupled4x4_IBL_Panel_NACA0004_LamiBL_TurbWake_btest_memcheck
 84/109 Test #1864: Solve2D_Coupled4x4_IBL_Panel_NACA0004_LamiBL_TurbWake_btest_memcheck .........................   Passed  2205.74 sec
        Start 1866: Solve2D_Coupled4x4_IBLUniField_LamiBL_TurbWake_CorrelationClosure_PTC_btest_memcheck
 85/109 Test #1866: Solve2D_Coupled4x4_IBLUniField_LamiBL_TurbWake_CorrelationClosure_PTC_btest_memcheck .........   Passed  1126.74 sec
        Start 1868: PDEmitAVSensor2D_Consistency_RANSSA_btest_memcheck
 86/109 Test #1868: PDEmitAVSensor2D_Consistency_RANSSA_btest_memcheck ...........................................   Passed   21.15 sec
        Start 1870: Solve2D_Uncoupled_HDGAdvectiveIBL_LamiBL_btest_memcheck
 87/109 Test #1870: Solve2D_Uncoupled_HDGAdvectiveIBL_LamiBL_btest_memcheck ......................................   Passed  297.86 sec
        Start 1872: AlgebraicEquationSet_PTC_VMSD_Triangle_SA_btest_memcheck
 88/109 Test #1872: AlgebraicEquationSet_PTC_VMSD_Triangle_SA_btest_memcheck .....................................   Passed    1.66 sec
        Start 1874: PDEmitAVSensor1D_Consistency_btest_memcheck
 89/109 Test #1874: PDEmitAVSensor1D_Consistency_btest_memcheck ..................................................   Passed    3.77 sec
        Start 1876: PDEEulermitAVDiffusion3D_RANSSA_Consistency_btest_memcheck
 90/109 Test #1876: PDEEulermitAVDiffusion3D_RANSSA_Consistency_btest_memcheck ...................................   Passed    3.82 sec
        Start 1878: Solve2D_Coupled4x4_IBLSplitAmpLag_CorrelationClosure_CapturedTransition_PTC_btest_memcheck
 91/109 Test #1878: Solve2D_Coupled4x4_IBLSplitAmpLag_CorrelationClosure_CapturedTransition_PTC_btest_memcheck ...   Passed  715.95 sec
        Start 1880: PDEEulermitAVDiffusion3D_Consistency_btest_memcheck
 92/109 Test #1880: PDEEulermitAVDiffusion3D_Consistency_btest_memcheck ..........................................   Passed    4.28 sec
        Start 1882: Solve2D_Coupled4x4_IBL_Panel_NACA0004_FittedTransition_Forced_btest_memcheck
 93/109 Test #1882: Solve2D_Coupled4x4_IBL_Panel_NACA0004_FittedTransition_Forced_btest_memcheck .................   Passed  2971.80 sec
        Start 1884: Solve2D_Coupled4x4_IBL_Panel_NACA0004_FittedTransition_TwoLayerNewton_btest_memcheck
 94/109 Test #1884: Solve2D_Coupled4x4_IBL_Panel_NACA0004_FittedTransition_TwoLayerNewton_btest_memcheck .........   Passed  1619.63 sec
        Start 1886: Solve2D_Coupled4x4_IBLSplitAmpLag_CorrelationClosure_LamiBL_TurbWake_btest_memcheck
 95/109 Test #1886: Solve2D_Coupled4x4_IBLSplitAmpLag_CorrelationClosure_LamiBL_TurbWake_btest_memcheck ..........   Passed  1063.09 sec
        Start 1888: PDEEulermitAVDiffusion1D_Consistency_btest_memcheck
 96/109 Test #1888: PDEEulermitAVDiffusion1D_Consistency_btest_memcheck ..........................................   Passed    2.69 sec
        Start 1890: PDEEulermitAVDiffusion2D_RANSSA_Consistency_btest_memcheck
 97/109 Test #1890: PDEEulermitAVDiffusion2D_RANSSA_Consistency_btest_memcheck ...................................   Passed    2.43 sec
        Start 1892: BCEulermitAVSensor2D_Consistency_RANSSA_btest_memcheck
 98/109 Test #1892: BCEulermitAVSensor2D_Consistency_RANSSA_btest_memcheck .......................................   Passed    5.24 sec
        Start 1894: BCEulermitAVSensor3D_Consistency_btest_memcheck
 99/109 Test #1894: BCEulermitAVSensor3D_Consistency_btest_memcheck ..............................................   Passed    4.60 sec
        Start 1896: BCEulermitAVSensor3D_Consistency_RANSSA_btest_memcheck
100/109 Test #1896: BCEulermitAVSensor3D_Consistency_RANSSA_btest_memcheck .......................................   Passed    4.22 sec
        Start 1898: Solve2D_Uncoupled_DGAdvectiveIBLUniField_CorrelationClosure_LamiBL_btest_memcheck
101/109 Test #1898: Solve2D_Uncoupled_DGAdvectiveIBLUniField_CorrelationClosure_LamiBL_btest_memcheck ............   Passed   68.34 sec
        Start 1900: PDEmitAVSensor2D_Consistency_btest_memcheck
102/109 Test #1900: PDEmitAVSensor2D_Consistency_btest_memcheck ..................................................   Passed    8.71 sec
        Start 1902: PDEmitAVSensor3D_Consistency_RANSSA_btest_memcheck
103/109 Test #1902: PDEmitAVSensor3D_Consistency_RANSSA_btest_memcheck ...........................................   Passed    5.37 sec
        Start 1904: Solve2D_XfoilLikePanelMethod_btest_memcheck
104/109 Test #1904: Solve2D_XfoilLikePanelMethod_btest_memcheck ..................................................   Passed  713.00 sec
        Start 1906: PDEmitAVSensor3D_Consistency_btest_memcheck
105/109 Test #1906: PDEmitAVSensor3D_Consistency_btest_memcheck ..................................................   Passed    6.92 sec
        Start 1908: Solve2D_Uncoupled_DGAdvectiveIBL_LamiBL_PTC_btest_memcheck
106/109 Test #1908: Solve2D_Uncoupled_DGAdvectiveIBL_LamiBL_PTC_btest_memcheck ...................................   Passed  755.32 sec
        Start 1910: BCEulermitAVSensor2D_Consistency_btest_memcheck
107/109 Test #1910: BCEulermitAVSensor2D_Consistency_btest_memcheck ..............................................   Passed    4.19 sec
        Start 1912: Solve2D_Coupled4x4_IBL_CorrelationClosure_LamiBL_TurbWake_btest_memcheck
108/109 Test #1912: Solve2D_Coupled4x4_IBL_CorrelationClosure_LamiBL_TurbWake_btest_memcheck .....................   Passed  771.44 sec
        Start 1914: PDEEulermitAVDiffusion2D_Consistency_btest_memcheck
109/109 Test #1914: PDEEulermitAVDiffusion2D_Consistency_btest_memcheck ..........................................   Passed    3.69 sec

99% tests passed, 1 tests failed out of 109

Label Time Summary:
SANSMemCheck_system    = 25186.57 sec (109 tests)

Total Test time (real) = 25186.76 sec

The following tests FAILED:
	1712 - ErrorOrder_4D_DG_Pentatope_btest_memcheck (Failed)
Errors while running CTest
test/system/CMakeFiles/memcheck_system.dir/build.make:57: recipe for target 'test/system/CMakeFiles/memcheck_system' failed
make[3]: *** [test/system/CMakeFiles/memcheck_system] Error 8
CMakeFiles/Makefile2:177161: recipe for target 'test/system/CMakeFiles/memcheck_system.dir/all' failed
make[2]: *** [test/system/CMakeFiles/memcheck_system.dir/all] Error 2
CMakeFiles/Makefile2:177168: recipe for target 'test/system/CMakeFiles/memcheck_system.dir/rule' failed
make[1]: *** [test/system/CMakeFiles/memcheck_system.dir/rule] Error 2
Makefile:62001: recipe for target 'memcheck_system' failed
make: *** [memcheck_system] Error 2

real	502m31.136s
user	486m19.664s
sys	8m46.048s
+ status=1
++ find /jenkins/workspace/SANS_Weekly/builddir/debug_gnu9/buildnode/reynolds/build/debug_gnu9 -name Test.xml
+ mv /jenkins/workspace/SANS_Weekly/builddir/debug_gnu9/buildnode/reynolds/build/debug_gnu9/Testing/20200414-1342/Test.xml /jenkins/workspace/SANS_Weekly/builddir/debug_gnu9/buildnode/reynolds/build/Test_system_memcheck.xml
+ '[' 1 -eq 1 ']'
+ exit 1
Build step 'Execute shell' marked build as failure
[GNU C Compiler (gcc)Clang (LLVM based)Intel Compiler (C, Fortran)Vera++] Skipping execution of recorder since overall result is 'FAILURE'
[Valgrind] Files to copy:
[Valgrind] build/debug_gnu9/test/valgrind.10113.memcheck.xml
[Valgrind] build/debug_gnu9/test/valgrind.10256.memcheck.xml
[Valgrind] build/debug_gnu9/test/valgrind.10264.memcheck.xml
[Valgrind] build/debug_gnu9/test/valgrind.10310.memcheck.xml
[Valgrind] build/debug_gnu9/test/valgrind.10402.memcheck.xml
[Valgrind] build/debug_gnu9/test/valgrind.1059.memcheck.xml
[Valgrind] build/debug_gnu9/test/valgrind.10864.memcheck.xml
[Valgrind] build/debug_gnu9/test/valgrind.11440.memcheck.xml
[Valgrind] build/debug_gnu9/test/valgrind.11458.memcheck.xml
[Valgrind] build/debug_gnu9/test/valgrind.11469.memcheck.xml
[Valgrind] build/debug_gnu9/test/valgrind.11480.memcheck.xml
[Valgrind] build/debug_gnu9/test/valgrind.1249.memcheck.xml
[Valgrind] build/debug_gnu9/test/valgrind.12874.memcheck.xml
[Valgrind] build/debug_gnu9/test/valgrind.13429.memcheck.xml
[Valgrind] build/debug_gnu9/test/valgrind.13926.memcheck.xml
[Valgrind] build/debug_gnu9/test/valgrind.14375.memcheck.xml
[Valgrind] build/debug_gnu9/test/valgrind.14512.memcheck.xml
[Valgrind] build/debug_gnu9/test/valgrind.14710.memcheck.xml
[Valgrind] build/debug_gnu9/test/valgrind.14884.memcheck.xml
[Valgrind] build/debug_gnu9/test/valgrind.15819.memcheck.xml
[Valgrind] build/debug_gnu9/test/valgrind.16251.memcheck.xml
[Valgrind] build/debug_gnu9/test/valgrind.16266.memcheck.xml
[Valgrind] build/debug_gnu9/test/valgrind.16315.memcheck.xml
[Valgrind] build/debug_gnu9/test/valgrind.16415.memcheck.xml
[Valgrind] build/debug_gnu9/test/valgrind.16437.memcheck.xml
[Valgrind] build/debug_gnu9/test/valgrind.1694.memcheck.xml
[Valgrind] build/debug_gnu9/test/valgrind.17148.memcheck.xml
[Valgrind] build/debug_gnu9/test/valgrind.17319.memcheck.xml
[Valgrind] build/debug_gnu9/test/valgrind.17577.memcheck.xml
[Valgrind] build/debug_gnu9/test/valgrind.1795.memcheck.xml
[Valgrind] build/debug_gnu9/test/valgrind.17951.memcheck.xml
[Valgrind] build/debug_gnu9/test/valgrind.18648.memcheck.xml
[Valgrind] build/debug_gnu9/test/valgrind.18883.memcheck.xml
[Valgrind] build/debug_gnu9/test/valgrind.19265.memcheck.xml
[Valgrind] build/debug_gnu9/test/valgrind.20803.memcheck.xml
[Valgrind] build/debug_gnu9/test/valgrind.20886.memcheck.xml
[Valgrind] build/debug_gnu9/test/valgrind.21008.memcheck.xml
[Valgrind] build/debug_gnu9/test/valgrind.21418.memcheck.xml
[Valgrind] build/debug_gnu9/test/valgrind.21740.memcheck.xml
[Valgrind] build/debug_gnu9/test/valgrind.21798.memcheck.xml
[Valgrind] build/debug_gnu9/test/valgrind.2240.memcheck.xml
[Valgrind] build/debug_gnu9/test/valgrind.22449.memcheck.xml
[Valgrind] build/debug_gnu9/test/valgrind.22530.memcheck.xml
[Valgrind] build/debug_gnu9/test/valgrind.22688.memcheck.xml
[Valgrind] build/debug_gnu9/test/valgrind.22854.memcheck.xml
[Valgrind] build/debug_gnu9/test/valgrind.23168.memcheck.xml
[Valgrind] build/debug_gnu9/test/valgrind.23222.memcheck.xml
[Valgrind] build/debug_gnu9/test/valgrind.23650.memcheck.xml
[Valgrind] build/debug_gnu9/test/valgrind.23711.memcheck.xml
[Valgrind] build/debug_gnu9/test/valgrind.2403.memcheck.xml
[Valgrind] build/debug_gnu9/test/valgrind.25780.memcheck.xml
[Valgrind] build/debug_gnu9/test/valgrind.25878.memcheck.xml
[Valgrind] build/debug_gnu9/test/valgrind.26124.memcheck.xml
[Valgrind] build/debug_gnu9/test/valgrind.26308.memcheck.xml
[Valgrind] build/debug_gnu9/test/valgrind.2646.memcheck.xml
[Valgrind] build/debug_gnu9/test/valgrind.26727.memcheck.xml
[Valgrind] build/debug_gnu9/test/valgrind.27340.memcheck.xml
[Valgrind] build/debug_gnu9/test/valgrind.27895.memcheck.xml
[Valgrind] build/debug_gnu9/test/valgrind.28098.memcheck.xml
[Valgrind] build/debug_gnu9/test/valgrind.28113.memcheck.xml
[Valgrind] build/debug_gnu9/test/valgrind.28715.memcheck.xml
[Valgrind] build/debug_gnu9/test/valgrind.28894.memcheck.xml
[Valgrind] build/debug_gnu9/test/valgrind.28958.memcheck.xml
[Valgrind] build/debug_gnu9/test/valgrind.29195.memcheck.xml
[Valgrind] build/debug_gnu9/test/valgrind.29439.memcheck.xml
[Valgrind] build/debug_gnu9/test/valgrind.30709.memcheck.xml
[Valgrind] build/debug_gnu9/test/valgrind.31829.memcheck.xml
[Valgrind] build/debug_gnu9/test/valgrind.32044.memcheck.xml
[Valgrind] build/debug_gnu9/test/valgrind.32191.memcheck.xml
[Valgrind] build/debug_gnu9/test/valgrind.33358.memcheck.xml
[Valgrind] build/debug_gnu9/test/valgrind.33544.memcheck.xml
[Valgrind] build/debug_gnu9/test/valgrind.33570.memcheck.xml
[Valgrind] build/debug_gnu9/test/valgrind.33774.memcheck.xml
[Valgrind] build/debug_gnu9/test/valgrind.34094.memcheck.xml
[Valgrind] build/debug_gnu9/test/valgrind.34156.memcheck.xml
[Valgrind] build/debug_gnu9/test/valgrind.34559.memcheck.xml
[Valgrind] build/debug_gnu9/test/valgrind.34761.memcheck.xml
[Valgrind] build/debug_gnu9/test/valgrind.35960.memcheck.xml
[Valgrind] build/debug_gnu9/test/valgrind.36374.memcheck.xml
[Valgrind] build/debug_gnu9/test/valgrind.3689.memcheck.xml
[Valgrind] build/debug_gnu9/test/valgrind.37268.memcheck.xml
[Valgrind] build/debug_gnu9/test/valgrind.3776.memcheck.xml
[Valgrind] build/debug_gnu9/test/valgrind.37885.memcheck.xml
[Valgrind] build/debug_gnu9/test/valgrind.3839.memcheck.xml
[Valgrind] build/debug_gnu9/test/valgrind.38721.memcheck.xml
[Valgrind] build/debug_gnu9/test/valgrind.39857.memcheck.xml
[Valgrind] build/debug_gnu9/test/valgrind.40131.memcheck.xml
[Valgrind] build/debug_gnu9/test/valgrind.40656.memcheck.xml
[Valgrind] build/debug_gnu9/test/valgrind.4322.memcheck.xml
[Valgrind] build/debug_gnu9/test/valgrind.4351.memcheck.xml
[Valgrind] build/debug_gnu9/test/valgrind.4514.memcheck.xml
[Valgrind] build/debug_gnu9/test/valgrind.5527.memcheck.xml
[Valgrind] build/debug_gnu9/test/valgrind.5648.memcheck.xml
[Valgrind] build/debug_gnu9/test/valgrind.6228.memcheck.xml
[Valgrind] build/debug_gnu9/test/valgrind.6759.memcheck.xml
[Valgrind] build/debug_gnu9/test/valgrind.6944.memcheck.xml
[Valgrind] build/debug_gnu9/test/valgrind.7043.memcheck.xml
[Valgrind] build/debug_gnu9/test/valgrind.7078.memcheck.xml
[Valgrind] build/debug_gnu9/test/valgrind.7655.memcheck.xml
[Valgrind] build/debug_gnu9/test/valgrind.7822.memcheck.xml
[Valgrind] build/debug_gnu9/test/valgrind.8370.memcheck.xml
[Valgrind] build/debug_gnu9/test/valgrind.8549.memcheck.xml
[Valgrind] build/debug_gnu9/test/valgrind.9530.memcheck.xml
[Valgrind] build/debug_gnu9/test/valgrind.9539.memcheck.xml
[Valgrind] build/debug_gnu9/test/valgrind.9561.memcheck.xml
[Valgrind] build/debug_gnu9/test/valgrind.9636.memcheck.xml
[Valgrind] build/debug_gnu9/test/valgrind.9647.memcheck.xml
[Valgrind] build/debug_gnu9/test/valgrind.9722.memcheck.xml
[Valgrind] build/debug_gnu9/test/valgrind.9746.memcheck.xml
[Valgrind] Copying build/debug_gnu9/test/valgrind.10113.memcheck.xml to /var/lib/jenkins/jobs/SANS_Weekly/configurations/axis-builddir/debug_gnu9/axis-buildnode/reynolds/builds/258/valgrind-plugin/valgrind-results/build/debug_gnu9/test/valgrind.10113.memcheck.xml
[Valgrind] Copying build/debug_gnu9/test/valgrind.10256.memcheck.xml to /var/lib/jenkins/jobs/SANS_Weekly/configurations/axis-builddir/debug_gnu9/axis-buildnode/reynolds/builds/258/valgrind-plugin/valgrind-results/build/debug_gnu9/test/valgrind.10256.memcheck.xml
[Valgrind] Copying build/debug_gnu9/test/valgrind.10264.memcheck.xml to /var/lib/jenkins/jobs/SANS_Weekly/configurations/axis-builddir/debug_gnu9/axis-buildnode/reynolds/builds/258/valgrind-plugin/valgrind-results/build/debug_gnu9/test/valgrind.10264.memcheck.xml
[Valgrind] Copying build/debug_gnu9/test/valgrind.10310.memcheck.xml to /var/lib/jenkins/jobs/SANS_Weekly/configurations/axis-builddir/debug_gnu9/axis-buildnode/reynolds/builds/258/valgrind-plugin/valgrind-results/build/debug_gnu9/test/valgrind.10310.memcheck.xml
[Valgrind] Copying build/debug_gnu9/test/valgrind.10402.memcheck.xml to /var/lib/jenkins/jobs/SANS_Weekly/configurations/axis-builddir/debug_gnu9/axis-buildnode/reynolds/builds/258/valgrind-plugin/valgrind-results/build/debug_gnu9/test/valgrind.10402.memcheck.xml
[Valgrind] Copying build/debug_gnu9/test/valgrind.1059.memcheck.xml to /var/lib/jenkins/jobs/SANS_Weekly/configurations/axis-builddir/debug_gnu9/axis-buildnode/reynolds/builds/258/valgrind-plugin/valgrind-results/build/debug_gnu9/test/valgrind.1059.memcheck.xml
[Valgrind] Copying build/debug_gnu9/test/valgrind.10864.memcheck.xml to /var/lib/jenkins/jobs/SANS_Weekly/configurations/axis-builddir/debug_gnu9/axis-buildnode/reynolds/builds/258/valgrind-plugin/valgrind-results/build/debug_gnu9/test/valgrind.10864.memcheck.xml
[Valgrind] Copying build/debug_gnu9/test/valgrind.11440.memcheck.xml to /var/lib/jenkins/jobs/SANS_Weekly/configurations/axis-builddir/debug_gnu9/axis-buildnode/reynolds/builds/258/valgrind-plugin/valgrind-results/build/debug_gnu9/test/valgrind.11440.memcheck.xml
[Valgrind] Copying build/debug_gnu9/test/valgrind.11458.memcheck.xml to /var/lib/jenkins/jobs/SANS_Weekly/configurations/axis-builddir/debug_gnu9/axis-buildnode/reynolds/builds/258/valgrind-plugin/valgrind-results/build/debug_gnu9/test/valgrind.11458.memcheck.xml
[Valgrind] Copying build/debug_gnu9/test/valgrind.11469.memcheck.xml to /var/lib/jenkins/jobs/SANS_Weekly/configurations/axis-builddir/debug_gnu9/axis-buildnode/reynolds/builds/258/valgrind-plugin/valgrind-results/build/debug_gnu9/test/valgrind.11469.memcheck.xml
[Valgrind] Copying build/debug_gnu9/test/valgrind.11480.memcheck.xml to /var/lib/jenkins/jobs/SANS_Weekly/configurations/axis-builddir/debug_gnu9/axis-buildnode/reynolds/builds/258/valgrind-plugin/valgrind-results/build/debug_gnu9/test/valgrind.11480.memcheck.xml
[Valgrind] Copying build/debug_gnu9/test/valgrind.1249.memcheck.xml to /var/lib/jenkins/jobs/SANS_Weekly/configurations/axis-builddir/debug_gnu9/axis-buildnode/reynolds/builds/258/valgrind-plugin/valgrind-results/build/debug_gnu9/test/valgrind.1249.memcheck.xml
[Valgrind] Copying build/debug_gnu9/test/valgrind.12874.memcheck.xml to /var/lib/jenkins/jobs/SANS_Weekly/configurations/axis-builddir/debug_gnu9/axis-buildnode/reynolds/builds/258/valgrind-plugin/valgrind-results/build/debug_gnu9/test/valgrind.12874.memcheck.xml
[Valgrind] Copying build/debug_gnu9/test/valgrind.13429.memcheck.xml to /var/lib/jenkins/jobs/SANS_Weekly/configurations/axis-builddir/debug_gnu9/axis-buildnode/reynolds/builds/258/valgrind-plugin/valgrind-results/build/debug_gnu9/test/valgrind.13429.memcheck.xml
[Valgrind] Copying build/debug_gnu9/test/valgrind.13926.memcheck.xml to /var/lib/jenkins/jobs/SANS_Weekly/configurations/axis-builddir/debug_gnu9/axis-buildnode/reynolds/builds/258/valgrind-plugin/valgrind-results/build/debug_gnu9/test/valgrind.13926.memcheck.xml
[Valgrind] Copying build/debug_gnu9/test/valgrind.14375.memcheck.xml to /var/lib/jenkins/jobs/SANS_Weekly/configurations/axis-builddir/debug_gnu9/axis-buildnode/reynolds/builds/258/valgrind-plugin/valgrind-results/build/debug_gnu9/test/valgrind.14375.memcheck.xml
[Valgrind] Copying build/debug_gnu9/test/valgrind.14512.memcheck.xml to /var/lib/jenkins/jobs/SANS_Weekly/configurations/axis-builddir/debug_gnu9/axis-buildnode/reynolds/builds/258/valgrind-plugin/valgrind-results/build/debug_gnu9/test/valgrind.14512.memcheck.xml
[Valgrind] Copying build/debug_gnu9/test/valgrind.14710.memcheck.xml to /var/lib/jenkins/jobs/SANS_Weekly/configurations/axis-builddir/debug_gnu9/axis-buildnode/reynolds/builds/258/valgrind-plugin/valgrind-results/build/debug_gnu9/test/valgrind.14710.memcheck.xml
[Valgrind] Copying build/debug_gnu9/test/valgrind.14884.memcheck.xml to /var/lib/jenkins/jobs/SANS_Weekly/configurations/axis-builddir/debug_gnu9/axis-buildnode/reynolds/builds/258/valgrind-plugin/valgrind-results/build/debug_gnu9/test/valgrind.14884.memcheck.xml
[Valgrind] Copying build/debug_gnu9/test/valgrind.15819.memcheck.xml to /var/lib/jenkins/jobs/SANS_Weekly/configurations/axis-builddir/debug_gnu9/axis-buildnode/reynolds/builds/258/valgrind-plugin/valgrind-results/build/debug_gnu9/test/valgrind.15819.memcheck.xml
[Valgrind] Copying build/debug_gnu9/test/valgrind.16251.memcheck.xml to /var/lib/jenkins/jobs/SANS_Weekly/configurations/axis-builddir/debug_gnu9/axis-buildnode/reynolds/builds/258/valgrind-plugin/valgrind-results/build/debug_gnu9/test/valgrind.16251.memcheck.xml
[Valgrind] Copying build/debug_gnu9/test/valgrind.16266.memcheck.xml to /var/lib/jenkins/jobs/SANS_Weekly/configurations/axis-builddir/debug_gnu9/axis-buildnode/reynolds/builds/258/valgrind-plugin/valgrind-results/build/debug_gnu9/test/valgrind.16266.memcheck.xml
[Valgrind] Copying build/debug_gnu9/test/valgrind.16315.memcheck.xml to /var/lib/jenkins/jobs/SANS_Weekly/configurations/axis-builddir/debug_gnu9/axis-buildnode/reynolds/builds/258/valgrind-plugin/valgrind-results/build/debug_gnu9/test/valgrind.16315.memcheck.xml
[Valgrind] Copying build/debug_gnu9/test/valgrind.16415.memcheck.xml to /var/lib/jenkins/jobs/SANS_Weekly/configurations/axis-builddir/debug_gnu9/axis-buildnode/reynolds/builds/258/valgrind-plugin/valgrind-results/build/debug_gnu9/test/valgrind.16415.memcheck.xml
[Valgrind] Copying build/debug_gnu9/test/valgrind.16437.memcheck.xml to /var/lib/jenkins/jobs/SANS_Weekly/configurations/axis-builddir/debug_gnu9/axis-buildnode/reynolds/builds/258/valgrind-plugin/valgrind-results/build/debug_gnu9/test/valgrind.16437.memcheck.xml
[Valgrind] Copying build/debug_gnu9/test/valgrind.1694.memcheck.xml to /var/lib/jenkins/jobs/SANS_Weekly/configurations/axis-builddir/debug_gnu9/axis-buildnode/reynolds/builds/258/valgrind-plugin/valgrind-results/build/debug_gnu9/test/valgrind.1694.memcheck.xml
[Valgrind] Copying build/debug_gnu9/test/valgrind.17148.memcheck.xml to /var/lib/jenkins/jobs/SANS_Weekly/configurations/axis-builddir/debug_gnu9/axis-buildnode/reynolds/builds/258/valgrind-plugin/valgrind-results/build/debug_gnu9/test/valgrind.17148.memcheck.xml
[Valgrind] Copying build/debug_gnu9/test/valgrind.17319.memcheck.xml to /var/lib/jenkins/jobs/SANS_Weekly/configurations/axis-builddir/debug_gnu9/axis-buildnode/reynolds/builds/258/valgrind-plugin/valgrind-results/build/debug_gnu9/test/valgrind.17319.memcheck.xml
[Valgrind] Copying build/debug_gnu9/test/valgrind.17577.memcheck.xml to /var/lib/jenkins/jobs/SANS_Weekly/configurations/axis-builddir/debug_gnu9/axis-buildnode/reynolds/builds/258/valgrind-plugin/valgrind-results/build/debug_gnu9/test/valgrind.17577.memcheck.xml
[Valgrind] Copying build/debug_gnu9/test/valgrind.1795.memcheck.xml to /var/lib/jenkins/jobs/SANS_Weekly/configurations/axis-builddir/debug_gnu9/axis-buildnode/reynolds/builds/258/valgrind-plugin/valgrind-results/build/debug_gnu9/test/valgrind.1795.memcheck.xml
[Valgrind] Copying build/debug_gnu9/test/valgrind.17951.memcheck.xml to /var/lib/jenkins/jobs/SANS_Weekly/configurations/axis-builddir/debug_gnu9/axis-buildnode/reynolds/builds/258/valgrind-plugin/valgrind-results/build/debug_gnu9/test/valgrind.17951.memcheck.xml
[Valgrind] Copying build/debug_gnu9/test/valgrind.18648.memcheck.xml to /var/lib/jenkins/jobs/SANS_Weekly/configurations/axis-builddir/debug_gnu9/axis-buildnode/reynolds/builds/258/valgrind-plugin/valgrind-results/build/debug_gnu9/test/valgrind.18648.memcheck.xml
[Valgrind] Copying build/debug_gnu9/test/valgrind.18883.memcheck.xml to /var/lib/jenkins/jobs/SANS_Weekly/configurations/axis-builddir/debug_gnu9/axis-buildnode/reynolds/builds/258/valgrind-plugin/valgrind-results/build/debug_gnu9/test/valgrind.18883.memcheck.xml
[Valgrind] Copying build/debug_gnu9/test/valgrind.19265.memcheck.xml to /var/lib/jenkins/jobs/SANS_Weekly/configurations/axis-builddir/debug_gnu9/axis-buildnode/reynolds/builds/258/valgrind-plugin/valgrind-results/build/debug_gnu9/test/valgrind.19265.memcheck.xml
[Valgrind] Copying build/debug_gnu9/test/valgrind.20803.memcheck.xml to /var/lib/jenkins/jobs/SANS_Weekly/configurations/axis-builddir/debug_gnu9/axis-buildnode/reynolds/builds/258/valgrind-plugin/valgrind-results/build/debug_gnu9/test/valgrind.20803.memcheck.xml
[Valgrind] Copying build/debug_gnu9/test/valgrind.20886.memcheck.xml to /var/lib/jenkins/jobs/SANS_Weekly/configurations/axis-builddir/debug_gnu9/axis-buildnode/reynolds/builds/258/valgrind-plugin/valgrind-results/build/debug_gnu9/test/valgrind.20886.memcheck.xml
[Valgrind] Copying build/debug_gnu9/test/valgrind.21008.memcheck.xml to /var/lib/jenkins/jobs/SANS_Weekly/configurations/axis-builddir/debug_gnu9/axis-buildnode/reynolds/builds/258/valgrind-plugin/valgrind-results/build/debug_gnu9/test/valgrind.21008.memcheck.xml
[Valgrind] Copying build/debug_gnu9/test/valgrind.21418.memcheck.xml to /var/lib/jenkins/jobs/SANS_Weekly/configurations/axis-builddir/debug_gnu9/axis-buildnode/reynolds/builds/258/valgrind-plugin/valgrind-results/build/debug_gnu9/test/valgrind.21418.memcheck.xml
[Valgrind] Copying build/debug_gnu9/test/valgrind.21740.memcheck.xml to /var/lib/jenkins/jobs/SANS_Weekly/configurations/axis-builddir/debug_gnu9/axis-buildnode/reynolds/builds/258/valgrind-plugin/valgrind-results/build/debug_gnu9/test/valgrind.21740.memcheck.xml
[Valgrind] Copying build/debug_gnu9/test/valgrind.21798.memcheck.xml to /var/lib/jenkins/jobs/SANS_Weekly/configurations/axis-builddir/debug_gnu9/axis-buildnode/reynolds/builds/258/valgrind-plugin/valgrind-results/build/debug_gnu9/test/valgrind.21798.memcheck.xml
[Valgrind] Copying build/debug_gnu9/test/valgrind.2240.memcheck.xml to /var/lib/jenkins/jobs/SANS_Weekly/configurations/axis-builddir/debug_gnu9/axis-buildnode/reynolds/builds/258/valgrind-plugin/valgrind-results/build/debug_gnu9/test/valgrind.2240.memcheck.xml
[Valgrind] Copying build/debug_gnu9/test/valgrind.22449.memcheck.xml to /var/lib/jenkins/jobs/SANS_Weekly/configurations/axis-builddir/debug_gnu9/axis-buildnode/reynolds/builds/258/valgrind-plugin/valgrind-results/build/debug_gnu9/test/valgrind.22449.memcheck.xml
[Valgrind] Copying build/debug_gnu9/test/valgrind.22530.memcheck.xml to /var/lib/jenkins/jobs/SANS_Weekly/configurations/axis-builddir/debug_gnu9/axis-buildnode/reynolds/builds/258/valgrind-plugin/valgrind-results/build/debug_gnu9/test/valgrind.22530.memcheck.xml
[Valgrind] Copying build/debug_gnu9/test/valgrind.22688.memcheck.xml to /var/lib/jenkins/jobs/SANS_Weekly/configurations/axis-builddir/debug_gnu9/axis-buildnode/reynolds/builds/258/valgrind-plugin/valgrind-results/build/debug_gnu9/test/valgrind.22688.memcheck.xml
[Valgrind] Copying build/debug_gnu9/test/valgrind.22854.memcheck.xml to /var/lib/jenkins/jobs/SANS_Weekly/configurations/axis-builddir/debug_gnu9/axis-buildnode/reynolds/builds/258/valgrind-plugin/valgrind-results/build/debug_gnu9/test/valgrind.22854.memcheck.xml
[Valgrind] Copying build/debug_gnu9/test/valgrind.23168.memcheck.xml to /var/lib/jenkins/jobs/SANS_Weekly/configurations/axis-builddir/debug_gnu9/axis-buildnode/reynolds/builds/258/valgrind-plugin/valgrind-results/build/debug_gnu9/test/valgrind.23168.memcheck.xml
[Valgrind] Copying build/debug_gnu9/test/valgrind.23222.memcheck.xml to /var/lib/jenkins/jobs/SANS_Weekly/configurations/axis-builddir/debug_gnu9/axis-buildnode/reynolds/builds/258/valgrind-plugin/valgrind-results/build/debug_gnu9/test/valgrind.23222.memcheck.xml
[Valgrind] Copying build/debug_gnu9/test/valgrind.23650.memcheck.xml to /var/lib/jenkins/jobs/SANS_Weekly/configurations/axis-builddir/debug_gnu9/axis-buildnode/reynolds/builds/258/valgrind-plugin/valgrind-results/build/debug_gnu9/test/valgrind.23650.memcheck.xml
[Valgrind] Copying build/debug_gnu9/test/valgrind.23711.memcheck.xml to /var/lib/jenkins/jobs/SANS_Weekly/configurations/axis-builddir/debug_gnu9/axis-buildnode/reynolds/builds/258/valgrind-plugin/valgrind-results/build/debug_gnu9/test/valgrind.23711.memcheck.xml
[Valgrind] Copying build/debug_gnu9/test/valgrind.2403.memcheck.xml to /var/lib/jenkins/jobs/SANS_Weekly/configurations/axis-builddir/debug_gnu9/axis-buildnode/reynolds/builds/258/valgrind-plugin/valgrind-results/build/debug_gnu9/test/valgrind.2403.memcheck.xml
[Valgrind] Copying build/debug_gnu9/test/valgrind.25780.memcheck.xml to /var/lib/jenkins/jobs/SANS_Weekly/configurations/axis-builddir/debug_gnu9/axis-buildnode/reynolds/builds/258/valgrind-plugin/valgrind-results/build/debug_gnu9/test/valgrind.25780.memcheck.xml
[Valgrind] Copying build/debug_gnu9/test/valgrind.25878.memcheck.xml to /var/lib/jenkins/jobs/SANS_Weekly/configurations/axis-builddir/debug_gnu9/axis-buildnode/reynolds/builds/258/valgrind-plugin/valgrind-results/build/debug_gnu9/test/valgrind.25878.memcheck.xml
[Valgrind] Copying build/debug_gnu9/test/valgrind.26124.memcheck.xml to /var/lib/jenkins/jobs/SANS_Weekly/configurations/axis-builddir/debug_gnu9/axis-buildnode/reynolds/builds/258/valgrind-plugin/valgrind-results/build/debug_gnu9/test/valgrind.26124.memcheck.xml
[Valgrind] Copying build/debug_gnu9/test/valgrind.26308.memcheck.xml to /var/lib/jenkins/jobs/SANS_Weekly/configurations/axis-builddir/debug_gnu9/axis-buildnode/reynolds/builds/258/valgrind-plugin/valgrind-results/build/debug_gnu9/test/valgrind.26308.memcheck.xml
[Valgrind] Copying build/debug_gnu9/test/valgrind.2646.memcheck.xml to /var/lib/jenkins/jobs/SANS_Weekly/configurations/axis-builddir/debug_gnu9/axis-buildnode/reynolds/builds/258/valgrind-plugin/valgrind-results/build/debug_gnu9/test/valgrind.2646.memcheck.xml
[Valgrind] Copying build/debug_gnu9/test/valgrind.26727.memcheck.xml to /var/lib/jenkins/jobs/SANS_Weekly/configurations/axis-builddir/debug_gnu9/axis-buildnode/reynolds/builds/258/valgrind-plugin/valgrind-results/build/debug_gnu9/test/valgrind.26727.memcheck.xml
[Valgrind] Copying build/debug_gnu9/test/valgrind.27340.memcheck.xml to /var/lib/jenkins/jobs/SANS_Weekly/configurations/axis-builddir/debug_gnu9/axis-buildnode/reynolds/builds/258/valgrind-plugin/valgrind-results/build/debug_gnu9/test/valgrind.27340.memcheck.xml
[Valgrind] Copying build/debug_gnu9/test/valgrind.27895.memcheck.xml to /var/lib/jenkins/jobs/SANS_Weekly/configurations/axis-builddir/debug_gnu9/axis-buildnode/reynolds/builds/258/valgrind-plugin/valgrind-results/build/debug_gnu9/test/valgrind.27895.memcheck.xml
[Valgrind] Copying build/debug_gnu9/test/valgrind.28098.memcheck.xml to /var/lib/jenkins/jobs/SANS_Weekly/configurations/axis-builddir/debug_gnu9/axis-buildnode/reynolds/builds/258/valgrind-plugin/valgrind-results/build/debug_gnu9/test/valgrind.28098.memcheck.xml
[Valgrind] Copying build/debug_gnu9/test/valgrind.28113.memcheck.xml to /var/lib/jenkins/jobs/SANS_Weekly/configurations/axis-builddir/debug_gnu9/axis-buildnode/reynolds/builds/258/valgrind-plugin/valgrind-results/build/debug_gnu9/test/valgrind.28113.memcheck.xml
[Valgrind] Copying build/debug_gnu9/test/valgrind.28715.memcheck.xml to /var/lib/jenkins/jobs/SANS_Weekly/configurations/axis-builddir/debug_gnu9/axis-buildnode/reynolds/builds/258/valgrind-plugin/valgrind-results/build/debug_gnu9/test/valgrind.28715.memcheck.xml
[Valgrind] Copying build/debug_gnu9/test/valgrind.28894.memcheck.xml to /var/lib/jenkins/jobs/SANS_Weekly/configurations/axis-builddir/debug_gnu9/axis-buildnode/reynolds/builds/258/valgrind-plugin/valgrind-results/build/debug_gnu9/test/valgrind.28894.memcheck.xml
[Valgrind] Copying build/debug_gnu9/test/valgrind.28958.memcheck.xml to /var/lib/jenkins/jobs/SANS_Weekly/configurations/axis-builddir/debug_gnu9/axis-buildnode/reynolds/builds/258/valgrind-plugin/valgrind-results/build/debug_gnu9/test/valgrind.28958.memcheck.xml
[Valgrind] Copying build/debug_gnu9/test/valgrind.29195.memcheck.xml to /var/lib/jenkins/jobs/SANS_Weekly/configurations/axis-builddir/debug_gnu9/axis-buildnode/reynolds/builds/258/valgrind-plugin/valgrind-results/build/debug_gnu9/test/valgrind.29195.memcheck.xml
[Valgrind] Copying build/debug_gnu9/test/valgrind.29439.memcheck.xml to /var/lib/jenkins/jobs/SANS_Weekly/configurations/axis-builddir/debug_gnu9/axis-buildnode/reynolds/builds/258/valgrind-plugin/valgrind-results/build/debug_gnu9/test/valgrind.29439.memcheck.xml
[Valgrind] Copying build/debug_gnu9/test/valgrind.30709.memcheck.xml to /var/lib/jenkins/jobs/SANS_Weekly/configurations/axis-builddir/debug_gnu9/axis-buildnode/reynolds/builds/258/valgrind-plugin/valgrind-results/build/debug_gnu9/test/valgrind.30709.memcheck.xml
[Valgrind] Copying build/debug_gnu9/test/valgrind.31829.memcheck.xml to /var/lib/jenkins/jobs/SANS_Weekly/configurations/axis-builddir/debug_gnu9/axis-buildnode/reynolds/builds/258/valgrind-plugin/valgrind-results/build/debug_gnu9/test/valgrind.31829.memcheck.xml
[Valgrind] Copying build/debug_gnu9/test/valgrind.32044.memcheck.xml to /var/lib/jenkins/jobs/SANS_Weekly/configurations/axis-builddir/debug_gnu9/axis-buildnode/reynolds/builds/258/valgrind-plugin/valgrind-results/build/debug_gnu9/test/valgrind.32044.memcheck.xml
[Valgrind] Copying build/debug_gnu9/test/valgrind.32191.memcheck.xml to /var/lib/jenkins/jobs/SANS_Weekly/configurations/axis-builddir/debug_gnu9/axis-buildnode/reynolds/builds/258/valgrind-plugin/valgrind-results/build/debug_gnu9/test/valgrind.32191.memcheck.xml
[Valgrind] Copying build/debug_gnu9/test/valgrind.33358.memcheck.xml to /var/lib/jenkins/jobs/SANS_Weekly/configurations/axis-builddir/debug_gnu9/axis-buildnode/reynolds/builds/258/valgrind-plugin/valgrind-results/build/debug_gnu9/test/valgrind.33358.memcheck.xml
[Valgrind] Copying build/debug_gnu9/test/valgrind.33544.memcheck.xml to /var/lib/jenkins/jobs/SANS_Weekly/configurations/axis-builddir/debug_gnu9/axis-buildnode/reynolds/builds/258/valgrind-plugin/valgrind-results/build/debug_gnu9/test/valgrind.33544.memcheck.xml
[Valgrind] Copying build/debug_gnu9/test/valgrind.33570.memcheck.xml to /var/lib/jenkins/jobs/SANS_Weekly/configurations/axis-builddir/debug_gnu9/axis-buildnode/reynolds/builds/258/valgrind-plugin/valgrind-results/build/debug_gnu9/test/valgrind.33570.memcheck.xml
[Valgrind] Copying build/debug_gnu9/test/valgrind.33774.memcheck.xml to /var/lib/jenkins/jobs/SANS_Weekly/configurations/axis-builddir/debug_gnu9/axis-buildnode/reynolds/builds/258/valgrind-plugin/valgrind-results/build/debug_gnu9/test/valgrind.33774.memcheck.xml
[Valgrind] Copying build/debug_gnu9/test/valgrind.34094.memcheck.xml to /var/lib/jenkins/jobs/SANS_Weekly/configurations/axis-builddir/debug_gnu9/axis-buildnode/reynolds/builds/258/valgrind-plugin/valgrind-results/build/debug_gnu9/test/valgrind.34094.memcheck.xml
[Valgrind] Copying build/debug_gnu9/test/valgrind.34156.memcheck.xml to /var/lib/jenkins/jobs/SANS_Weekly/configurations/axis-builddir/debug_gnu9/axis-buildnode/reynolds/builds/258/valgrind-plugin/valgrind-results/build/debug_gnu9/test/valgrind.34156.memcheck.xml
[Valgrind] Copying build/debug_gnu9/test/valgrind.34559.memcheck.xml to /var/lib/jenkins/jobs/SANS_Weekly/configurations/axis-builddir/debug_gnu9/axis-buildnode/reynolds/builds/258/valgrind-plugin/valgrind-results/build/debug_gnu9/test/valgrind.34559.memcheck.xml
[Valgrind] Copying build/debug_gnu9/test/valgrind.34761.memcheck.xml to /var/lib/jenkins/jobs/SANS_Weekly/configurations/axis-builddir/debug_gnu9/axis-buildnode/reynolds/builds/258/valgrind-plugin/valgrind-results/build/debug_gnu9/test/valgrind.34761.memcheck.xml
[Valgrind] Copying build/debug_gnu9/test/valgrind.35960.memcheck.xml to /var/lib/jenkins/jobs/SANS_Weekly/configurations/axis-builddir/debug_gnu9/axis-buildnode/reynolds/builds/258/valgrind-plugin/valgrind-results/build/debug_gnu9/test/valgrind.35960.memcheck.xml
[Valgrind] Copying build/debug_gnu9/test/valgrind.36374.memcheck.xml to /var/lib/jenkins/jobs/SANS_Weekly/configurations/axis-builddir/debug_gnu9/axis-buildnode/reynolds/builds/258/valgrind-plugin/valgrind-results/build/debug_gnu9/test/valgrind.36374.memcheck.xml
[Valgrind] Copying build/debug_gnu9/test/valgrind.3689.memcheck.xml to /var/lib/jenkins/jobs/SANS_Weekly/configurations/axis-builddir/debug_gnu9/axis-buildnode/reynolds/builds/258/valgrind-plugin/valgrind-results/build/debug_gnu9/test/valgrind.3689.memcheck.xml
[Valgrind] Copying build/debug_gnu9/test/valgrind.37268.memcheck.xml to /var/lib/jenkins/jobs/SANS_Weekly/configurations/axis-builddir/debug_gnu9/axis-buildnode/reynolds/builds/258/valgrind-plugin/valgrind-results/build/debug_gnu9/test/valgrind.37268.memcheck.xml
[Valgrind] Copying build/debug_gnu9/test/valgrind.3776.memcheck.xml to /var/lib/jenkins/jobs/SANS_Weekly/configurations/axis-builddir/debug_gnu9/axis-buildnode/reynolds/builds/258/valgrind-plugin/valgrind-results/build/debug_gnu9/test/valgrind.3776.memcheck.xml
[Valgrind] Copying build/debug_gnu9/test/valgrind.37885.memcheck.xml to /var/lib/jenkins/jobs/SANS_Weekly/configurations/axis-builddir/debug_gnu9/axis-buildnode/reynolds/builds/258/valgrind-plugin/valgrind-results/build/debug_gnu9/test/valgrind.37885.memcheck.xml
[Valgrind] Copying build/debug_gnu9/test/valgrind.3839.memcheck.xml to /var/lib/jenkins/jobs/SANS_Weekly/configurations/axis-builddir/debug_gnu9/axis-buildnode/reynolds/builds/258/valgrind-plugin/valgrind-results/build/debug_gnu9/test/valgrind.3839.memcheck.xml
[Valgrind] Copying build/debug_gnu9/test/valgrind.38721.memcheck.xml to /var/lib/jenkins/jobs/SANS_Weekly/configurations/axis-builddir/debug_gnu9/axis-buildnode/reynolds/builds/258/valgrind-plugin/valgrind-results/build/debug_gnu9/test/valgrind.38721.memcheck.xml
[Valgrind] Copying build/debug_gnu9/test/valgrind.39857.memcheck.xml to /var/lib/jenkins/jobs/SANS_Weekly/configurations/axis-builddir/debug_gnu9/axis-buildnode/reynolds/builds/258/valgrind-plugin/valgrind-results/build/debug_gnu9/test/valgrind.39857.memcheck.xml
[Valgrind] Copying build/debug_gnu9/test/valgrind.40131.memcheck.xml to /var/lib/jenkins/jobs/SANS_Weekly/configurations/axis-builddir/debug_gnu9/axis-buildnode/reynolds/builds/258/valgrind-plugin/valgrind-results/build/debug_gnu9/test/valgrind.40131.memcheck.xml
[Valgrind] Copying build/debug_gnu9/test/valgrind.40656.memcheck.xml to /var/lib/jenkins/jobs/SANS_Weekly/configurations/axis-builddir/debug_gnu9/axis-buildnode/reynolds/builds/258/valgrind-plugin/valgrind-results/build/debug_gnu9/test/valgrind.40656.memcheck.xml
[Valgrind] Copying build/debug_gnu9/test/valgrind.4322.memcheck.xml to /var/lib/jenkins/jobs/SANS_Weekly/configurations/axis-builddir/debug_gnu9/axis-buildnode/reynolds/builds/258/valgrind-plugin/valgrind-results/build/debug_gnu9/test/valgrind.4322.memcheck.xml
[Valgrind] Copying build/debug_gnu9/test/valgrind.4351.memcheck.xml to /var/lib/jenkins/jobs/SANS_Weekly/configurations/axis-builddir/debug_gnu9/axis-buildnode/reynolds/builds/258/valgrind-plugin/valgrind-results/build/debug_gnu9/test/valgrind.4351.memcheck.xml
[Valgrind] Copying build/debug_gnu9/test/valgrind.4514.memcheck.xml to /var/lib/jenkins/jobs/SANS_Weekly/configurations/axis-builddir/debug_gnu9/axis-buildnode/reynolds/builds/258/valgrind-plugin/valgrind-results/build/debug_gnu9/test/valgrind.4514.memcheck.xml
[Valgrind] Copying build/debug_gnu9/test/valgrind.5527.memcheck.xml to /var/lib/jenkins/jobs/SANS_Weekly/configurations/axis-builddir/debug_gnu9/axis-buildnode/reynolds/builds/258/valgrind-plugin/valgrind-results/build/debug_gnu9/test/valgrind.5527.memcheck.xml
[Valgrind] Copying build/debug_gnu9/test/valgrind.5648.memcheck.xml to /var/lib/jenkins/jobs/SANS_Weekly/configurations/axis-builddir/debug_gnu9/axis-buildnode/reynolds/builds/258/valgrind-plugin/valgrind-results/build/debug_gnu9/test/valgrind.5648.memcheck.xml
[Valgrind] Copying build/debug_gnu9/test/valgrind.6228.memcheck.xml to /var/lib/jenkins/jobs/SANS_Weekly/configurations/axis-builddir/debug_gnu9/axis-buildnode/reynolds/builds/258/valgrind-plugin/valgrind-results/build/debug_gnu9/test/valgrind.6228.memcheck.xml
[Valgrind] Copying build/debug_gnu9/test/valgrind.6759.memcheck.xml to /var/lib/jenkins/jobs/SANS_Weekly/configurations/axis-builddir/debug_gnu9/axis-buildnode/reynolds/builds/258/valgrind-plugin/valgrind-results/build/debug_gnu9/test/valgrind.6759.memcheck.xml
[Valgrind] Copying build/debug_gnu9/test/valgrind.6944.memcheck.xml to /var/lib/jenkins/jobs/SANS_Weekly/configurations/axis-builddir/debug_gnu9/axis-buildnode/reynolds/builds/258/valgrind-plugin/valgrind-results/build/debug_gnu9/test/valgrind.6944.memcheck.xml
[Valgrind] Copying build/debug_gnu9/test/valgrind.7043.memcheck.xml to /var/lib/jenkins/jobs/SANS_Weekly/configurations/axis-builddir/debug_gnu9/axis-buildnode/reynolds/builds/258/valgrind-plugin/valgrind-results/build/debug_gnu9/test/valgrind.7043.memcheck.xml
[Valgrind] Copying build/debug_gnu9/test/valgrind.7078.memcheck.xml to /var/lib/jenkins/jobs/SANS_Weekly/configurations/axis-builddir/debug_gnu9/axis-buildnode/reynolds/builds/258/valgrind-plugin/valgrind-results/build/debug_gnu9/test/valgrind.7078.memcheck.xml
[Valgrind] Copying build/debug_gnu9/test/valgrind.7655.memcheck.xml to /var/lib/jenkins/jobs/SANS_Weekly/configurations/axis-builddir/debug_gnu9/axis-buildnode/reynolds/builds/258/valgrind-plugin/valgrind-results/build/debug_gnu9/test/valgrind.7655.memcheck.xml
[Valgrind] Copying build/debug_gnu9/test/valgrind.7822.memcheck.xml to /var/lib/jenkins/jobs/SANS_Weekly/configurations/axis-builddir/debug_gnu9/axis-buildnode/reynolds/builds/258/valgrind-plugin/valgrind-results/build/debug_gnu9/test/valgrind.7822.memcheck.xml
[Valgrind] Copying build/debug_gnu9/test/valgrind.8370.memcheck.xml to /var/lib/jenkins/jobs/SANS_Weekly/configurations/axis-builddir/debug_gnu9/axis-buildnode/reynolds/builds/258/valgrind-plugin/valgrind-results/build/debug_gnu9/test/valgrind.8370.memcheck.xml
[Valgrind] Copying build/debug_gnu9/test/valgrind.8549.memcheck.xml to /var/lib/jenkins/jobs/SANS_Weekly/configurations/axis-builddir/debug_gnu9/axis-buildnode/reynolds/builds/258/valgrind-plugin/valgrind-results/build/debug_gnu9/test/valgrind.8549.memcheck.xml
[Valgrind] Copying build/debug_gnu9/test/valgrind.9530.memcheck.xml to /var/lib/jenkins/jobs/SANS_Weekly/configurations/axis-builddir/debug_gnu9/axis-buildnode/reynolds/builds/258/valgrind-plugin/valgrind-results/build/debug_gnu9/test/valgrind.9530.memcheck.xml
[Valgrind] Copying build/debug_gnu9/test/valgrind.9539.memcheck.xml to /var/lib/jenkins/jobs/SANS_Weekly/configurations/axis-builddir/debug_gnu9/axis-buildnode/reynolds/builds/258/valgrind-plugin/valgrind-results/build/debug_gnu9/test/valgrind.9539.memcheck.xml
[Valgrind] Copying build/debug_gnu9/test/valgrind.9561.memcheck.xml to /var/lib/jenkins/jobs/SANS_Weekly/configurations/axis-builddir/debug_gnu9/axis-buildnode/reynolds/builds/258/valgrind-plugin/valgrind-results/build/debug_gnu9/test/valgrind.9561.memcheck.xml
[Valgrind] Copying build/debug_gnu9/test/valgrind.9636.memcheck.xml to /var/lib/jenkins/jobs/SANS_Weekly/configurations/axis-builddir/debug_gnu9/axis-buildnode/reynolds/builds/258/valgrind-plugin/valgrind-results/build/debug_gnu9/test/valgrind.9636.memcheck.xml
[Valgrind] Copying build/debug_gnu9/test/valgrind.9647.memcheck.xml to /var/lib/jenkins/jobs/SANS_Weekly/configurations/axis-builddir/debug_gnu9/axis-buildnode/reynolds/builds/258/valgrind-plugin/valgrind-results/build/debug_gnu9/test/valgrind.9647.memcheck.xml
[Valgrind] Copying build/debug_gnu9/test/valgrind.9722.memcheck.xml to /var/lib/jenkins/jobs/SANS_Weekly/configurations/axis-builddir/debug_gnu9/axis-buildnode/reynolds/builds/258/valgrind-plugin/valgrind-results/build/debug_gnu9/test/valgrind.9722.memcheck.xml
[Valgrind] Copying build/debug_gnu9/test/valgrind.9746.memcheck.xml to /var/lib/jenkins/jobs/SANS_Weekly/configurations/axis-builddir/debug_gnu9/axis-buildnode/reynolds/builds/258/valgrind-plugin/valgrind-results/build/debug_gnu9/test/valgrind.9746.memcheck.xml
[Valgrind] Analysing valgrind results
[Valgrind] copying source file '/usr/include/c++/9/bits/stl_bvector.h' to 'source_1.tmp'...
[Valgrind] copying source file '/usr/include/c++/5/bits/stl_bvector.h' to 'source_2.tmp'...
[Valgrind] copying source file '/home/jenkins/util/avro/src/lib/mesh/vertices.cpp' to 'source_3.tmp'...
[Valgrind] copying source file '/home/jenkins/util/avro/src/lib/library/cube.cpp' to 'source_4.tmp'...
[Valgrind] copying source file '/jenkins/workspace/SANS_Weekly/builddir/debug_gnu9/buildnode/reynolds/test/unit/UnitGrids/XField_KuhnFreudenthal.cpp' to 'source_5.tmp'...
[Valgrind] copying source file '/usr/include/c++/9/ext/new_allocator.h' to 'source_6.tmp'...
[Valgrind] copying source file '/usr/include/c++/9/bits/alloc_traits.h' to 'source_7.tmp'...
[Valgrind] copying source file '/usr/include/c++/9/bits/shared_ptr_base.h' to 'source_8.tmp'...
[Valgrind] copying source file '/usr/include/c++/9/bits/shared_ptr.h' to 'source_9.tmp'...
[Valgrind] copying source file '/jenkins/workspace/SANS_Weekly/builddir/debug_gnu9/buildnode/reynolds/test/system/Asymptotic/ErrorOrder_4D_DG_Pentatope_btest.cpp' to 'source_10.tmp'...
[Valgrind] copying source file '/usr/include/boost/test/utils/callback.hpp' to 'source_11.tmp'...
[Valgrind] copying source file '/usr/include/boost/test/unit_test.hpp' to 'source_12.tmp'...
[Valgrind] copying source file '/home/jenkins/util/valgrind/valgrind-3.15.0/coregrind/m_replacemalloc/vg_replace_malloc.c' to 'source_13.tmp'...
[Valgrind] copying source file '/home/jenkins/util/avro/src/lib/geometry/context.cpp' to 'source_14.tmp'...
[Valgrind] copying source file '/jenkins/workspace/SANS_Weekly/builddir/debug_gnu9/buildnode/reynolds/src/tools/PointerArray.h' to 'source_15.tmp'...
[Valgrind] copying source file '/jenkins/workspace/SANS_Weekly/builddir/debug_gnu9/buildnode/reynolds/src/Field/FieldBase_impl.h' to 'source_16.tmp'...
[Valgrind] copying source file '/jenkins/workspace/SANS_Weekly/builddir/debug_gnu9/buildnode/reynolds/src/Field/XField_impl.h' to 'source_17.tmp'...
[Valgrind] copying source file '/usr/include/c++/9/bits/stl_vector.h' to 'source_18.tmp'...
[Valgrind] copying source file '/usr/include/c++/5/ext/new_allocator.h' to 'source_19.tmp'...
[Valgrind] copying source file '/usr/include/c++/5/bits/alloc_traits.h' to 'source_20.tmp'...
[Valgrind] copying source file '/usr/include/c++/5/bits/stl_vector.h' to 'source_21.tmp'...
[Valgrind] copying source file '/usr/include/c++/5/bits/vector.tcc' to 'source_22.tmp'...
[Valgrind] copying source file '/home/jenkins/util/avro/src/lib/mesh/mesh.h' to 'source_23.tmp'...
[Valgrind] copying source file '/usr/include/c++/9/bits/allocated_ptr.h' to 'source_24.tmp'...
[Valgrind] copying source file '/jenkins/workspace/SANS_Weekly/builddir/debug_gnu9/buildnode/reynolds/src/Field/Partition/XField_Lagrange_impl.h' to 'source_25.tmp'...
[Valgrind] copying source file '/usr/include/c++/9/bits/vector.tcc' to 'source_26.tmp'...
[Valgrind] copying source file '/home/jenkins/util/avro/src/lib/mesh/neighbours.cpp' to 'source_27.tmp'...
[Valgrind] copying source file '/home/jenkins/util/avro/src/lib/mesh/topology.hpp' to 'source_28.tmp'...
[Valgrind] copying source file '/usr/include/c++/5/bits/shared_ptr_base.h' to 'source_29.tmp'...
[Valgrind] copying source file '/usr/include/c++/5/bits/shared_ptr.h' to 'source_30.tmp'...
[Valgrind] copying source file '/home/jenkins/util/avro/src/lib/mesh/neighbours.h' to 'source_31.tmp'...
[Valgrind] copying source file '/home/jenkins/util/ESP/EngSketchPad/src/EGADS/util/emp.c' to 'source_32.tmp'...
[Valgrind] copying source file '/home/jenkins/util/ESP/EngSketchPad/src/EGADS/src/egadsBase.c' to 'source_33.tmp'...
[Valgrind] copying source file '/jenkins/workspace/SANS_Weekly/builddir/debug_gnu9/buildnode/reynolds/src/Field/XFieldSpacetime_impl.h' to 'source_34.tmp'...
[Valgrind] copying source file '/home/jenkins/util/ESP/EngSketchPad/src/EGADS/src/egadsMemory.c' to 'source_35.tmp'...
[Valgrind] copying source file '/home/jenkins/util/avro/src/lib/mesh/simplex.cpp' to 'source_36.tmp'...
[Valgrind] copying source file '/home/jenkins/util/avro/src/lib/geometry/body.cpp' to 'source_37.tmp'...
[Valgrind] copying source file '/home/jenkins/util/avro/src/lib/library/tesseract.cpp' to 'source_38.tmp'...
[Valgrind] copying source file '/jenkins/workspace/SANS_Weekly/builddir/debug_gnu9/buildnode/reynolds/src/Field/ElementConnectivity.h' to 'source_39.tmp'...
[Valgrind] copying source file '/home/jenkins/util/avro/src/lib/mesh/curvilinear.cpp' to 'source_40.tmp'...
[Valgrind] copying source file '/home/jenkins/util/avro/src/lib/common/hierarchical.hpp' to 'source_41.tmp'...
[Valgrind] copying source file '/home/jenkins/util/avro/src/lib/library/tesseract.h' to 'source_42.tmp'...
[Valgrind] copying source file '/jenkins/workspace/SANS_Weekly/builddir/debug_gnu9/buildnode/reynolds/src/Field/Element/ElementAssociativitySpacetime.cpp' to 'source_43.tmp'...
[Valgrind] copying source file '/jenkins/workspace/SANS_Weekly/builddir/debug_gnu9/buildnode/reynolds/src/Field/FieldAssociativity.h' to 'source_44.tmp'...
[Valgrind] copying source file '/jenkins/workspace/SANS_Weekly/builddir/debug_gnu9/buildnode/reynolds/src/Field/Element/ElementAssociativityVolume.cpp' to 'source_45.tmp'...
[Valgrind] copying source file '/home/jenkins/util/avro/src/lib/common/hierarchical.h' to 'source_46.tmp'...
[Valgrind] copying source file '/usr/include/c++/5/bits/allocated_ptr.h' to 'source_47.tmp'...
[Valgrind] workspacePath: /jenkins/workspace/SANS_Weekly/builddir/debug_gnu9/buildnode/reynolds/
[Valgrind] Ending the valgrind analysis.
INFO: Starting to record.
INFO: Processing CTest-Version 3.x (default)
INFO: [CTest-Version 3.x (default)] - 1 test report file(s) were found with the pattern 'build/Test*.xml' relative to '/jenkins/workspace/SANS_Weekly/builddir/debug_gnu9/buildnode/reynolds' for the testing framework 'CTest-Version 3.x (default)'.
INFO: Check 'Failed Tests' threshold.
INFO: The total number of tests for the threshold 'Failed Tests' exceeds the specified "failure threshold" value.
INFO: Setting the build status to FAILURE
INFO: Stopping recording.
[PostBuildScript] - [INFO] Executing post build scripts.
[PostBuildScript] - [INFO] Build does not have any of the results []. Did not execute build step #0.
[WS-CLEANUP] Deleting project workspace...
[WS-CLEANUP] Deferred wipeout is used...
[WS-CLEANUP] done
Finished: FAILURE